Mailinglist Archive: zypp-commit (39 mails)

< Previous Next >
[zypp-commit] Build failed in Hudson: libzypp-bindings-HEAD #217
  • From: hudson@xxxxxxx
  • Date: Thu, 14 Apr 2011 17:26:42 +0200 (CEST)
  • Message-id: <1139191932.71302794802795.JavaMail.hudson@river>
See <http://river.suse.de/job/libzypp-bindings-HEAD/217/>

------------------------------------------
[...truncated 594 lines...]
+ rpm --rebuilddb
+ /usr/bin/rpmbuild --buildroot
<http://river.suse.de/job/libzypp-bindings-HEAD/ws/rpm/rpmbuildroot> -bb
--define 'run_testsuite 1' libzypp-bindings.spec
Executing(%prep): /bin/sh -e /var/tmp/rpm-tmp.ez1orV
+ umask 022
+ cd <http://river.suse.de/job/libzypp-bindings-HEAD/ws/rpm/rpmbuild>
+ cd <http://river.suse.de/job/libzypp-bindings-HEAD/ws/rpm/rpmbuild>
+ rm -rf libzypp-bindings-0.5.9
+ /usr/bin/bzip2 -dc
<http://river.suse.de/job/libzypp-bindings-HEAD/ws/build/package/libzypp-bindings-0.5.9.tar.bz2>
+ /bin/tar -xf -
+ STATUS=0
+ '[' 0 -ne 0 ']'
+ cd libzypp-bindings-0.5.9
+ /bin/chmod -Rf a+rX,u+w,g-w,o-w .
+ exit 0
Executing(%build): /bin/sh -e /var/tmp/rpm-tmp.H3kEwY
+ umask 022
+ cd <http://river.suse.de/job/libzypp-bindings-HEAD/ws/rpm/rpmbuild>
+ /bin/rm -rf
<http://river.suse.de/job/libzypp-bindings-HEAD/ws/rpm/rpmbuildroot>
++ dirname <http://river.suse.de/job/libzypp-bindings-HEAD/ws/rpm/rpmbuildroot>
+ /bin/mkdir -p <http://river.suse.de/job/libzypp-bindings-HEAD/ws/rpm>
+ /bin/mkdir
<http://river.suse.de/job/libzypp-bindings-HEAD/ws/rpm/rpmbuildroot>
+ cd libzypp-bindings-0.5.9
+ mkdir build
+ cd build
+ cmake '-DCMAKE_INSTALL_PREFIX=%{prefix}'
-DPYTHON_SITEDIR=/usr/lib64/python2.7/site-packages -DLIB=lib64
-DCMAKE_VERBOSE_MAKEFILE=TRUE '-DCMAKE_C_FLAGS_RELEASE:STRING=-O2 -g -m64
-fmessage-length=0 -D_FORTIFY_SOURCE=2 -fstack-protector -funwind-tables
-fasynchronous-unwind-tables' '-DCMAKE_CXX_FLAGS_RELEASE:STRING=-O2 -g -m64
-fmessage-length=0 -D_FORTIFY_SOURCE=2 -fstack-protector -funwind-tables
-fasynchronous-unwind-tables' -DCMAKE_BUILD_TYPE=Release -DCMAKE_SKIP_RPATH=1 ..
-- The C compiler identification is GNU
-- The CXX compiler identification is GNU
-- Check for working C compiler: /opt/icecream/bin/gcc
-- Check for working C compiler: /opt/icecream/bin/gcc -- works
-- Detecting C compiler ABI info
-- Detecting C compiler ABI info - done
-- Check for working CXX compiler: /opt/icecream/bin/g++
-- Check for working CXX compiler: /opt/icecream/bin/g++ -- works
-- Detecting CXX compiler ABI info
-- Detecting CXX compiler ABI info - done
-- Libraries will be installed in
<http://river.suse.de/job/libzypp-bindings-HEAD/ws/rpm/rpmbuild/libzypp-bindings-0.5.9/build/%{prefix}/lib64>
-- Config files will be installed in
<http://river.suse.de/job/libzypp-bindings-HEAD/ws/rpm/rpmbuild/libzypp-bindings-0.5.9/build/%{prefix}/etc>
** Manual files will be installed in
<http://river.suse.de/job/libzypp-bindings-HEAD/ws/rpm/rpmbuild/libzypp-bindings-0.5.9/build/%{prefix}/share/man>
-- Writing spec file...
-- I hate you rpm-lint...!!!
-- Looking modules in
<http://river.suse.de/job/libzypp-bindings-HEAD/ws/rpm/rpmbuild/libzypp-bindings-0.5.9/build/%{prefix}/share/cmake/Modules;/root/hudson/workspace/libzypp-bindings-HEAD/rpm/rpmbuild/libzypp-bindings-0.5.9/cmake/modules>
-- Found SWIG: /usr/bin/swig (found version "1.3.40")
-- ZYpp path not set. Looking for it.
-- ZYpp found: includes in /usr/include, library in /usr/lib64/libzypp.so
-- Zypp so library: libzypp.so.900
, version 900
-- Found Ruby: /usr/bin/ruby (found version "1.8.7")
-- Found PythonLibs: /usr/lib64/libpython2.7.so
-- Found Perl: /usr/bin/perl
-- Ruby executable: /usr/bin/ruby
-- Ruby vendor arch dir: /usr/lib64/ruby/vendor_ruby/1.8/x86_64-linux
-- Ruby include path:
/usr/lib64/ruby/1.8/x86_64-linux;/usr/lib64/ruby/1.8/x86_64-linux
-- Found PythonInterp: /usr/bin/python2.7
-- Python executable: /usr/bin/python2.7
-- Python include path: /usr/include/python2.7
-- Python site dir: /usr/lib64/python2.7/site-packages
-- Perl executable: /usr/bin/perl
-- Perl core dir: /usr/lib/perl5/5.12.3/x86_64-linux-thread-multi/CORE
-- Perl vendor arch dir:
-- Configuring done
-- Generating done
-- Build files have been written to:
<http://river.suse.de/job/libzypp-bindings-HEAD/ws/rpm/rpmbuild/libzypp-bindings-0.5.9/build>
+ make -j1
/usr/bin/cmake
-H<http://river.suse.de/job/libzypp-bindings-HEAD/ws/rpm/rpmbuild/libzypp-bindings-0.5.9>

-B<http://river.suse.de/job/libzypp-bindings-HEAD/ws/rpm/rpmbuild/libzypp-bindings-0.5.9/build>
--check-build-system CMakeFiles/Makefile.cmake 0
/usr/bin/cmake -E cmake_progress_start
<http://river.suse.de/job/libzypp-bindings-HEAD/ws/rpm/rpmbuild/libzypp-bindings-0.5.9/build/CMakeFiles>

<http://river.suse.de/job/libzypp-bindings-HEAD/ws/rpm/rpmbuild/libzypp-bindings-0.5.9/build/CMakeFiles/progress.marks>
make -f CMakeFiles/Makefile2 all
make[1]: Entering directory
`<http://river.suse.de/job/libzypp-bindings-HEAD/ws/rpm/rpmbuild/libzypp-bindings-0.5.9/build'>
make -f swig/ruby/CMakeFiles/zypp_ruby.dir/build.make
swig/ruby/CMakeFiles/zypp_ruby.dir/depend
make[2]: Entering directory
`<http://river.suse.de/job/libzypp-bindings-HEAD/ws/rpm/rpmbuild/libzypp-bindings-0.5.9/build'>
/usr/bin/cmake -E cmake_progress_report
<http://river.suse.de/job/libzypp-bindings-HEAD/ws/rpm/rpmbuild/libzypp-bindings-0.5.9/build/CMakeFiles>
6
[ 16%] Generating libzypp_ruby.cc
cd
<http://river.suse.de/job/libzypp-bindings-HEAD/ws/rpm/rpmbuild/libzypp-bindings-0.5.9/build/swig/ruby>
&& /usr/bin/cmake -E echo_append Creating\ wrapper\ code\ for\ Ruby...
Creating wrapper code for Ruby...cd
<http://river.suse.de/job/libzypp-bindings-HEAD/ws/rpm/rpmbuild/libzypp-bindings-0.5.9/build/swig/ruby>
&& /usr/bin/swig -DZYPP_DEPRECATED -DZYPP_VERSION=900
-DBOOST_SMARTPTR_INCLUDE_DIR -c++ -ruby -o
<http://river.suse.de/job/libzypp-bindings-HEAD/ws/rpm/rpmbuild/libzypp-bindings-0.5.9/build/swig/ruby/libzypp_ruby.cc>
-I/usr/include
<http://river.suse.de/job/libzypp-bindings-HEAD/ws/rpm/rpmbuild/libzypp-bindings-0.5.9/swig/zypp.i>
/usr/include/boost/smart_ptr/shared_ptr.hpp:319: Warning(362): operator= ignored
/usr/include/boost/smart_ptr/shared_ptr.hpp:328: Warning(362): operator= ignored
/usr/include/boost/smart_ptr/shared_ptr.hpp:339: Warning(362): operator= ignored
/usr/include/boost/smart_ptr/shared_ptr.hpp:348: Warning(362): operator= ignored
/usr/include/boost/smart_ptr/shared_ptr.hpp:501: Warning(378): operator!=
ignored
/usr/include/boost/smart_ptr/weak_ptr.hpp:135: Warning(362): operator= ignored
/usr/include/boost/smart_ptr/weak_ptr.hpp:154: Warning(362): operator= ignored
/usr/include/boost/smart_ptr/intrusive_ptr.hpp:114: Warning(362): operator=
ignored
/usr/include/boost/smart_ptr/intrusive_ptr.hpp:139: Warning(362): operator=
ignored
/usr/include/boost/smart_ptr/intrusive_ptr.hpp:145: Warning(362): operator=
ignored
/usr/include/boost/smart_ptr/intrusive_ptr.hpp:197: Warning(378): operator!=
ignored
/usr/include/boost/smart_ptr/intrusive_ptr.hpp:207: Warning(378): operator!=
ignored
/usr/include/boost/smart_ptr/intrusive_ptr.hpp:217: Warning(378): operator!=
ignored
/usr/include/zypp/base/Flags.h:68: Warning(371): operator&= ignored
/usr/include/zypp/base/Flags.h:69: Warning(371): operator&= ignored
/usr/include/zypp/base/Flags.h:70: Warning(371): operator&= ignored
/usr/include/zypp/base/Flags.h:72: Warning(372): operator|= ignored
/usr/include/zypp/base/Flags.h:73: Warning(372): operator|= ignored
/usr/include/zypp/base/Flags.h:75: Warning(370): operator^= ignored
/usr/include/zypp/base/Flags.h:76: Warning(370): operator^= ignored
/usr/include/zypp/IdStringType.h:96: Warning(362): operator= ignored
/usr/include/zypp/Pathname.h:67: Warning(362): operator= ignored
/usr/include/zypp/Pathname.h:71: Warning(368): operator/= ignored
/usr/include/zypp/Pathname.h:77: Warning(365): operator+= ignored
/usr/include/zypp/ByteCount.h:92: Warning(365): operator+= ignored
/usr/include/zypp/ByteCount.h:93: Warning(366): operator-= ignored
/usr/include/zypp/ByteCount.h:94: Warning(367): operator*= ignored
/usr/include/zypp/ByteCount.h:95: Warning(368): operator/= ignored
/usr/include/zypp/ByteCount.h:97: Warning(383): operator++ ignored
/usr/include/zypp/ByteCount.h:98: Warning(384): operator-- ignored
/usr/include/zypp/ByteCount.h:100: Warning(383): operator++ ignored
/usr/include/zypp/ByteCount.h:101: Warning(384): operator-- ignored
/usr/include/zypp/Url.h:179: Warning(362): operator= ignored
/usr/include/zypp/Url.h:193: Warning(362): operator= ignored
/usr/include/zypp/Edition.h:164: Warning(312): Nested class not currently
supported (ignored)
/usr/include/zypp/Date.h:88: Warning(365): operator+= ignored
/usr/include/zypp/Date.h:89: Warning(366): operator-= ignored
/usr/include/zypp/Date.h:90: Warning(367): operator*= ignored
/usr/include/zypp/Date.h:91: Warning(368): operator/= ignored
/usr/include/zypp/Date.h:93: Warning(383): operator++ ignored
/usr/include/zypp/Date.h:94: Warning(384): operator-- ignored
/usr/include/zypp/Date.h:96: Warning(383): operator++ ignored
/usr/include/zypp/Date.h:97: Warning(384): operator-- ignored
/usr/include/zypp/Dep.h:32: Warning(378): operator!= ignored
/usr/include/zypp/Capability.h:203: Warning(312): Nested class not currently
supported (ignored)
/usr/include/zypp/CapMatch.h:59: Warning(378): operator!= ignored
/usr/include/zypp/CapMatch.h:66: Warning(361): operator! ignored
/usr/include/zypp/CapMatch.h:76: Warning(381): operator&& ignored
/usr/include/zypp/CapMatch.h:86: Warning(382): operator|| ignored
/usr/include/zypp/sat/Solvable.h:210: Warning(389): operator[] ignored
(consider using %extend)
/usr/include/zypp/sat/Solvable.h:292: Warning(312): Nested class not currently
supported (ignored).
/usr/include/zypp/sat/Solvable.h:322: Warning(378): operator!= ignored
/usr/include/zypp/Resolvable.h:100: Warning(389): operator[] ignored (consider
using %extend)
/usr/include/zypp/repo/RepoType.h:65: Warning(378): operator!= ignored
/usr/include/zypp/RepoStatus.h:137: Warning(381): operator&& ignored
<http://river.suse.de/job/libzypp-bindings-HEAD/ws/rpm/rpmbuild/libzypp-bindings-0.5.9/swig/KeyRing.i>:22:
Warning(302): Identifier 'KeyRing_Ptr' redefined (ignored),
/usr/include/zypp/KeyRing.h:33: Warning(302): previous definition of
'KeyRing_Ptr'.
/usr/include/zypp/Target.h:145: Warning(312): Nested struct not currently
supported (ignored).
<http://river.suse.de/job/libzypp-bindings-HEAD/ws/rpm/rpmbuild/libzypp-bindings-0.5.9/swig/Target.i>:11:
Warning(302): Identifier 'Target_Ptr' redefined (ignored),
/usr/include/zypp/Target.h:41: Warning(302): previous definition of
'Target_Ptr'.
<http://river.suse.de/job/libzypp-bindings-HEAD/ws/rpm/rpmbuild/libzypp-bindings-0.5.9/swig/Resolver.i>:8:
Warning(302): Identifier 'Resolver_Ptr' redefined (ignored),
/usr/include/zypp/ProblemTypes.h:39: Warning(302): previous definition of
'Resolver_Ptr'.
/usr/include/zypp/CheckSum.h:26: Warning(401): Nothing known about base class
'Exception'. Ignored.
/usr/include/zypp/Date.h:138: Warning(401): Nothing known about base class
'Exception'. Ignored.
/usr/include/zypp/Capabilities.h:98: Warning(401): Nothing known about base
class 'boost::iterator_adaptor< const_iterator,sat::detail::IdType const
*,Capability const,boost::forward_traversal_tag,Capability const >'. Ignored.
/usr/include/zypp/Capabilities.h:98: Warning(401): Maybe you forgot to
instantiate 'boost::iterator_adaptor< const_iterator,sat::detail::IdType const
*,Capability const,boost::forward_traversal_tag,Capability const >' using
%template.
/usr/include/zypp/sat/Solvable.h:351: Warning(401): Nothing known about base
class 'boost::iterator_adaptor< SolvableIterator,::_Solvable *,Solvable
const,boost::forward_traversal_tag,Solvable const >'. Ignored.
/usr/include/zypp/sat/Solvable.h:351: Warning(401): Maybe you forgot to
instantiate 'boost::iterator_adaptor< SolvableIterator,::_Solvable *,Solvable
const,boost::forward_traversal_tag,Solvable const >' using %template.
/usr/include/zypp/Patch.h:157: Warning(401): Nothing known about base class
'boost::iterator_adaptor<
Patch::ReferenceIterator,sat::LookupAttr::iterator,int,boost::forward_traversal_tag,int
'. Ignored.
/usr/include/zypp/Patch.h:157: Warning(401): Maybe you forgot to instantiate
'boost::iterator_adaptor<
Patch::ReferenceIterator,sat::LookupAttr::iterator,int,boost::forward_traversal_tag,int
' using %template.
/usr/include/zypp/Repository.h:328: Warning(401): Nothing known about base
class 'boost::iterator_adaptor<
Repository::ProductInfoIterator,sat::LookupAttr::iterator,int,boost::forward_traversal_tag,int
'. Ignored.
/usr/include/zypp/Repository.h:328: Warning(401): Maybe you forgot to
instantiate 'boost::iterator_adaptor<
Repository::ProductInfoIterator,sat::LookupAttr::iterator,int,boost::forward_traversal_tag,int
' using %template.
/usr/include/zypp/Repository.h:409: Warning(401): Nothing known about base
class 'boost::iterator_adaptor< RepositoryIterator,::_Repo
**,Repository,boost::forward_traversal_tag,Repository >'. Ignored.
/usr/include/zypp/Repository.h:409: Warning(401): Maybe you forgot to
instantiate 'boost::iterator_adaptor< RepositoryIterator,::_Repo
**,Repository,boost::forward_traversal_tag,Repository >' using %template.
/usr/include/zypp/PublicKey.h:39: Warning(401): Nothing known about base class
'Exception'. Ignored.
/usr/include/zypp/KeyRing.h:45: Warning(401): Nothing known about base class
'callback::ReportBase'. Ignored.
/usr/include/zypp/KeyRing.h:99: Warning(401): Nothing known about base class
'callback::ReportBase'. Ignored.
/usr/include/zypp/KeyRing.h:107: Warning(401): Nothing known about base class
'Exception'. Ignored.
/usr/include/zypp/Target.h:50: Warning(401): Nothing known about base class
'base::NonCopyable'. Ignored.
/usr/include/zypp/ZYppFactory.h:25: Warning(401): Nothing known about base
class 'Exception'. Ignored.
/usr/include/zypp/PoolItem.h:115: Warning(508): Declaration of 'satSolvable'
shadows declaration accessible via operator->(),
/usr/include/zypp/Resolvable.h:138: Warning(508): previous declaration of
'satSolvable'.
/usr/include/boost/smart_ptr/intrusive_ptr.hpp:150: Warning(508): Declaration
of 'reset' shadows declaration accessible via operator->(),
/usr/include/zypp/Resolver.h:108: Warning(508): previous declaration of 'reset'.
/usr/include/boost/smart_ptr/shared_ptr.hpp:77: Warning(801): Wrong class name
(corrected to `Static_cast_tag')
/usr/include/boost/smart_ptr/shared_ptr.hpp:78: Warning(801): Wrong class name
(corrected to `Const_cast_tag')
/usr/include/boost/smart_ptr/shared_ptr.hpp:79: Warning(801): Wrong class name
(corrected to `Dynamic_cast_tag')
/usr/include/boost/smart_ptr/shared_ptr.hpp:80: Warning(801): Wrong class name
(corrected to `Polymorphic_cast_tag')
/usr/include/zypp/IdString.h:226: Warning(503): Can't wrap '::zypp::IdString'
unless renamed to a valid identifier.
/usr/include/zypp/ByteCount.h:32: Warning(503): Can't wrap 'operator <<' unless
renamed to a valid identifier.
/usr/include/zypp/ByteCount.h:86: Warning(503): Can't wrap 'operator SizeType'
unless renamed to a valid identifier.
/usr/include/zypp/Edition.h:67: Warning(801): Wrong constant name (corrected to
`Noepoch')
/usr/include/zypp/Date.h:33: Warning(503): Can't wrap 'operator <<' unless
renamed to a valid identifier.
/usr/include/zypp/Date.h:39: Warning(801): Wrong constant name (corrected to
`Second')
/usr/include/zypp/Date.h:40: Warning(801): Wrong constant name (corrected to
`Minute')
/usr/include/zypp/Date.h:41: Warning(801): Wrong constant name (corrected to
`Hour')
/usr/include/zypp/Date.h:42: Warning(801): Wrong constant name (corrected to
`Day')
/usr/include/zypp/Date.h:43: Warning(801): Wrong constant name (corrected to
`Month28')
/usr/include/zypp/Date.h:44: Warning(801): Wrong constant name (corrected to
`Month29')
/usr/include/zypp/Date.h:45: Warning(801): Wrong constant name (corrected to
`Month30')
/usr/include/zypp/Date.h:46: Warning(801): Wrong constant name (corrected to
`Month31')
/usr/include/zypp/Date.h:47: Warning(801): Wrong constant name (corrected to
`Month')
/usr/include/zypp/Date.h:48: Warning(801): Wrong constant name (corrected to
`Year365')
/usr/include/zypp/Date.h:49: Warning(801): Wrong constant name (corrected to
`Year366')
/usr/include/zypp/Date.h:50: Warning(801): Wrong constant name (corrected to
`Year')
/usr/include/zypp/Date.h:82: Warning(503): Can't wrap 'operator ValueType'
unless renamed to a valid identifier.
/usr/include/zypp/Dep.h:31: Warning(503): Can't wrap 'operator ==' unless
renamed to a valid identifier.
/usr/include/zypp/Dep.h:34: Warning(503): Can't wrap 'operator <' unless
renamed to a valid identifier.
/usr/include/zypp/Capability.h:386: Warning(503): Can't wrap
'::zypp::Capability' unless renamed to a valid identifier.
/usr/include/zypp/Capabilities.h:98: Warning(801): Wrong class name (corrected
to `Zypp::Capabilities::const_iterator')
/usr/include/zypp/Capabilities.h:98: Warning(503): Can't wrap class
zypp::Capabilities::const_iterator unless renamed to a valid identifier.
/usr/include/zypp/CapMatch.h:56: Warning(503): Can't wrap 'operator ==' unless
renamed to a valid identifier.
/usr/include/zypp/CapMatch.h:88: Warning(503): Can't wrap 'operator <<' unless
renamed to a valid identifier.
/usr/include/zypp/OnMediaLocation.h:41: Warning(503): Can't wrap 'operator <<'
unless renamed to a valid identifier.
/usr/include/zypp/sat/Solvable.h:403: Warning(801): Wrong class name (corrected
to `AsSolvable')
/usr/include/zypp/Resolvable.h:42: Warning(503): Can't wrap 'operator <<'
unless renamed to a valid identifier.
/usr/include/zypp/repo/RepoInfoBase.h:38: Warning(503): Can't wrap 'operator
<<' unless renamed to a valid identifier.
/usr/include/zypp/RepoInfo.h:68: Warning(503): Can't wrap 'operator <<' unless
renamed to a valid identifier.
/usr/include/zypp/ResStatus.h:55: Warning(503): Can't wrap 'operator <<' unless
renamed to a valid identifier.
/usr/include/zypp/ResStatus.h:56: Warning(503): Can't wrap 'operator ==' unless
renamed to a valid identifier.
/usr/include/zypp/ResObject.h:196: Warning(503): Can't wrap
'zypp::makeResObject' unless renamed to a valid identifier.
/usr/include/zypp/Package.h:122: Warning(503): Can't wrap 'zypp::make<(Self)>'
unless renamed to a valid identifier.
/usr/include/zypp/Patch.h:157: Warning(801): Wrong class name (corrected to
`Zypp::Patch::ReferenceIterator')
/usr/include/zypp/Patch.h:157: Warning(503): Can't wrap class
zypp::Patch::ReferenceIterator unless renamed to a valid identifier.
/usr/include/zypp/Product.h:171: Warning(801): Wrong class name (corrected to
`Zypp::Product::UrlList')
/usr/include/zypp/Product.h:171: Warning(503): Can't wrap class
zypp::Product::UrlList unless renamed to a valid identifier.
/usr/include/zypp/Repository.h:328: Warning(801): Wrong class name (corrected
to `Zypp::Repository::ProductInfoIterator')
/usr/include/zypp/Repository.h:328: Warning(503): Can't wrap class
zypp::Repository::ProductInfoIterator unless renamed to a valid identifier.
/usr/include/zypp/Repository.h:388: Warning(801): Wrong class name (corrected
to `Zypp::Repository::EraseFromPool')
/usr/include/zypp/Repository.h:388: Warning(503): Can't wrap class
zypp::Repository::EraseFromPool unless renamed to a valid identifier.
/usr/include/zypp/RepoStatus.h:39: Warning(503): Can't wrap 'operator <<'
unless renamed to a valid identifier.
/usr/include/zypp/RepoManager.h:110: Warning(503): Can't wrap 'operator <<'
unless renamed to a valid identifier.
/usr/include/zypp/PublicKey.h:78: Warning(503): Can't wrap 'operator <<' unless
renamed to a valid identifier.
/usr/include/zypp/KeyRing.h:134: Warning(503): Can't wrap 'operator <<' unless
renamed to a valid identifier.
/usr/include/zypp/Target.h:196: Warning(503): Can't wrap 'operator <<' unless
renamed to a valid identifier.
/usr/include/zypp/MediaSetAccess.h:79: Warning(503): Can't wrap 'operator <<'
unless renamed to a valid identifier.
/usr/include/zypp/PoolItem.h:52: Warning(503): Can't wrap 'operator <<' unless
renamed to a valid identifier.
/usr/include/zypp/PoolItem.h:132: Warning(503): Can't wrap 'operator
ResObject::constPtr' unless renamed to a valid identifier.
/usr/include/zypp/PoolItem.h:141: Warning(503): Can't wrap 'operator
ResObject::constPtr::unspecified_bool_type' unless renamed to a valid
identifier.
/usr/include/zypp/PoolItem.h:226: Warning(801): Wrong class name (corrected to
`AsPoolItem')
/usr/include/zypp/PoolItem.h:226: Warning(801): Wrong class name (corrected to
`AsPoolItem')
/usr/include/zypp/ResPool.h:50: Warning(503): Can't wrap 'operator <<' unless
renamed to a valid identifier.
/usr/include/zypp/TmpPath.h:62: Warning(503): Can't wrap 'operator const void*'
unless renamed to a valid identifier.
/usr/include/zypp/TmpPath.h:74: Warning(503): Can't wrap 'operator Pathname'
unless renamed to a valid identifier.
/usr/include/zypp/ResolverProblem.h:58: Warning(503): Can't wrap 'operator <<'
unless renamed to a valid identifier.
/usr/include/zypp/ProblemSolution.h:74: Warning(503): Can't wrap 'operator <<'
unless renamed to a valid identifier.
/usr/include/zypp/ProblemSolution.h:75: Warning(503): Can't wrap 'operator <<'
unless renamed to a valid identifier.
/usr/include/zypp/ProblemSolution.h:76: Warning(503): Can't wrap 'operator <<'
unless renamed to a valid identifier.
/usr/include/zypp/Resolver.h:369: Warning(503): Can't wrap 'operator <<' unless
renamed to a valid identifier.
/usr/include/zypp/ZYppFactory.h:47: Warning(503): Can't wrap 'operator <<'
unless renamed to a valid identifier.
cd
<http://river.suse.de/job/libzypp-bindings-HEAD/ws/rpm/rpmbuild/libzypp-bindings-0.5.9/build/swig/ruby>
&& /usr/bin/cmake -E echo Done.
Done.
cd
<http://river.suse.de/job/libzypp-bindings-HEAD/ws/rpm/rpmbuild/libzypp-bindings-0.5.9/build>
&& /usr/bin/cmake -E cmake_depends "Unix Makefiles"
<http://river.suse.de/job/libzypp-bindings-HEAD/ws/rpm/rpmbuild/libzypp-bindings-0.5.9>

<http://river.suse.de/job/libzypp-bindings-HEAD/ws/rpm/rpmbuild/libzypp-bindings-0.5.9/swig/ruby>

<http://river.suse.de/job/libzypp-bindings-HEAD/ws/rpm/rpmbuild/libzypp-bindings-0.5.9/build>

<http://river.suse.de/job/libzypp-bindings-HEAD/ws/rpm/rpmbuild/libzypp-bindings-0.5.9/build/swig/ruby>

<http://river.suse.de/job/libzypp-bindings-HEAD/ws/rpm/rpmbuild/libzypp-bindings-0.5.9/build/swig/ruby/CMakeFiles/zypp_ruby.dir/DependInfo.cmake>
--color=
Scanning dependencies of target zypp_ruby
make[2]: Leaving directory
`<http://river.suse.de/job/libzypp-bindings-HEAD/ws/rpm/rpmbuild/libzypp-bindings-0.5.9/build'>
make -f swig/ruby/CMakeFiles/zypp_ruby.dir/build.make
swig/ruby/CMakeFiles/zypp_ruby.dir/build
make[2]: Entering directory
`<http://river.suse.de/job/libzypp-bindings-HEAD/ws/rpm/rpmbuild/libzypp-bindings-0.5.9/build'>
/usr/bin/cmake -E cmake_progress_report
<http://river.suse.de/job/libzypp-bindings-HEAD/ws/rpm/rpmbuild/libzypp-bindings-0.5.9/build/CMakeFiles>
5
[ 33%] Building CXX object swig/ruby/CMakeFiles/zypp_ruby.dir/libzypp_ruby.cc.o
cd
<http://river.suse.de/job/libzypp-bindings-HEAD/ws/rpm/rpmbuild/libzypp-bindings-0.5.9/build/swig/ruby>
&& /opt/icecream/bin/g++ -Dzypp_ruby_EXPORTS -fPIC -fno-strict-aliasing -O2
-g -m64 -fmessage-length=0 -D_FORTIFY_SOURCE=2 -fstack-protector
-funwind-tables -fasynchronous-unwind-tables -fPIC
-I<http://river.suse.de/job/libzypp-bindings-HEAD/ws/rpm/rpmbuild/libzypp-bindings-0.5.9>

-I<http://river.suse.de/job/libzypp-bindings-HEAD/ws/rpm/rpmbuild/libzypp-bindings-0.5.9/build>
-I/usr/lib64/ruby/1.8/x86_64-linux
-I<http://river.suse.de/job/libzypp-bindings-HEAD/ws/rpm/rpmbuild/libzypp-bindings-0.5.9/swig>
-o CMakeFiles/zypp_ruby.dir/libzypp_ruby.cc.o -c
<http://river.suse.de/job/libzypp-bindings-HEAD/ws/rpm/rpmbuild/libzypp-bindings-0.5.9/build/swig/ruby/libzypp_ruby.cc>
<http://river.suse.de/job/libzypp-bindings-HEAD/ws/rpm/rpmbuild/libzypp-bindings-0.5.9/build/swig/ruby/libzypp_ruby.cc>:
In function ‘VALUE _wrap_ZYppFactoryException_locker_pid(int, VALUE*, VALUE)’:
<http://river.suse.de/job/libzypp-bindings-HEAD/ws/rpm/rpmbuild/libzypp-bindings-0.5.9/build/swig/ruby/libzypp_ruby.cc>:110579:71:
warning: ‘pid_t zypp::ZYppFactoryException::locker_pid() const’ is deprecated
(declared at /usr/include/zypp/ZYppFactory.h:33)
g++: Internal error: Killed (program cc1plus)
Please submit a full bug report.
See <http://bugs.opensuse.org/> for instructions.
make[2]: *** [swig/ruby/CMakeFiles/zypp_ruby.dir/libzypp_ruby.cc.o] Error 1
make[2]: Leaving directory
`<http://river.suse.de/job/libzypp-bindings-HEAD/ws/rpm/rpmbuild/libzypp-bindings-0.5.9/build'>
make[1]: *** [swig/ruby/CMakeFiles/zypp_ruby.dir/all] Error 2
make[1]: Leaving directory
`<http://river.suse.de/job/libzypp-bindings-HEAD/ws/rpm/rpmbuild/libzypp-bindings-0.5.9/build'>
make: *** [all] Error 2
error: Bad exit status from /var/tmp/rpm-tmp.H3kEwY (%build)


RPM build errors:
Bad exit status from /var/tmp/rpm-tmp.H3kEwY (%build)
Archiving artifacts

--
To unsubscribe, e-mail: zypp-commit+unsubscribe@xxxxxxxxxxxx
For additional commands, e-mail: zypp-commit+help@xxxxxxxxxxxx

< Previous Next >
This Thread
  • No further messages