Mailinglist Archive: zypp-commit (52 mails)

< Previous Next >
[zypp-commit] Build failed in Hudson: libzypp-11.2 #210
  • From: hudson@xxxxxxx
  • Date: Tue, 22 Feb 2011 17:03:08 +0100 (CET)
  • Message-id: <1269366293.371298390588681.JavaMail.hudson@river>
See <http://river.suse.de/job/libzypp-11.2/210/changes>

Changes:

[Michael Andres] Set proper defaults for service repos (bnc#673943)

[Michael Andres] changes 6.35.3

------------------------------------------
Started by an SCM change
Building remotely on node-zypp11.2
Checkout:libzypp-11.2 / <http://river.suse.de/job/libzypp-11.2/ws/> -
hudson.remoting.Channel@fae7b85:node-zypp11.2
Using strategy: Default
Last Built Revision: Revision fd7101e989433b53eb6e72d1013076eb8edb5676
(origin/SuSE-Code-11_2-Branch)
Checkout:checkout / <http://river.suse.de/job/libzypp-11.2/ws/checkout> -
hudson.remoting.LocalChannel@6b5a0316
GitAPI created
Fetching changes from the remote Git repository
Fetching upstream changes from git://gitorious.org/opensuse/libzypp.git
[checkout] $ git fetch -t git://gitorious.org/opensuse/libzypp.git
+refs/heads/*:refs/remotes/origin/*
[checkout] $ git ls-tree HEAD
[checkout] $ git tag -l SuSE-Code-11_2-Branch
[checkout] $ git rev-parse origin/SuSE-Code-11_2-Branch
Commencing build of Revision 05cce881480fabea22a1a43164a5d2aa0ce239d1
(origin/SuSE-Code-11_2-Branch)
GitAPI created
Checking out Revision 05cce881480fabea22a1a43164a5d2aa0ce239d1
(origin/SuSE-Code-11_2-Branch)
[checkout] $ git checkout -f 05cce881480fabea22a1a43164a5d2aa0ce239d1
[checkout] $ git tag -a -f -m "Hudson Build #210" hudson-libzypp-11.2-210
Recording changes in branch origin/SuSE-Code-11_2-Branch
[checkout] $ git whatchanged --no-abbrev -M --pretty=raw
fd7101e989433b53eb6e72d1013076eb8edb5676..05cce881480fabea22a1a43164a5d2aa0ce239d1
[libzypp-11.2] $ /bin/sh -xe /tmp/hudson3437821822603921818.sh
+ echo '### BUILD ###'
### BUILD ###
+ echo '==> Reading build configuration'
==> Reading build configuration
+ . .hudson-scripts/base-functions
++ . .hudson-scripts/ascii_art
++ trap 'error_exit $?' ERR
++ echo 'Job running as user: root'
Job running as user: root
+++ date '+%F %T'
++ echo 'Started at: 2011-02-22 17:01:49'
Started at: 2011-02-22 17:01:49
+++ hostname --fqdn
++ export SITENAME=riverboat.suse.de
++ SITENAME=riverboat.suse.de
++ export TARGET_DIST=11.2
++ TARGET_DIST=11.2
++ export PROJECT=libzypp
++ PROJECT=libzypp
++ case $TARGET_DIST in
++ echo 'Successfully identified the target disttribution as: 11.2'
Successfully identified the target disttribution as: 11.2
+ . .hudson-scripts/build-functions
+ . .hudson-scripts/obs-functions
++ trap 'error_exit $?' ERR
++ export ALLOW_OBS_SUBMIT=yes
++ ALLOW_OBS_SUBMIT=yes
+ . .hudson-scripts/setup-buildenvironment
++ export RUNTESTS=1
++ RUNTESTS=1
++ export ICEJOBS=4
++ ICEJOBS=4
++ export CMAKE_INSTALL_PREFIX=/usr
++ CMAKE_INSTALL_PREFIX=/usr
+++ uname -m
+++ hostname -f
++ export 'CMAKEPARAS=-DBUILDNAME=x86_64 -DSITE=riverboat.suse.de
-DCMAKE_INSTALL_PREFIX=/usr'
++ CMAKEPARAS='-DBUILDNAME=x86_64 -DSITE=riverboat.suse.de
-DCMAKE_INSTALL_PREFIX=/usr'
++ echo 'Configuring cmake for Icecream ...'
Configuring cmake for Icecream ...
++ pushd <http://river.suse.de/job/libzypp-11.2/ws/>
~/hudson/workspace/libzypp-11.2 ~/hudson/workspace/libzypp-11.2
+++ icecc --build-native
+++ grep .tar.gz
+++ tail -1
+++ sed -e 's/creating //'
++ export ICECC_ENV=724a5d6afb9ce6f3c1bdb750d2b78346.tar.gz
++ ICECC_ENV=724a5d6afb9ce6f3c1bdb750d2b78346.tar.gz
++ export ICECC_ENV=724a5d6afb9ce6f3c1bdb750d2b78346.tar.gz
++ ICECC_ENV=724a5d6afb9ce6f3c1bdb750d2b78346.tar.gz
++ export
ICECC_VERSION=<http://river.suse.de/job/libzypp-11.2/ws/724a5d6afb9ce6f3c1bdb750d2b78346.tar.gz>
++
ICECC_VERSION=<http://river.suse.de/job/libzypp-11.2/ws/724a5d6afb9ce6f3c1bdb750d2b78346.tar.gz>
++ export ICECREAM=-DCMAKE_CXX_COMPILER=/opt/icecream/bin/g++
++ ICECREAM=-DCMAKE_CXX_COMPILER=/opt/icecream/bin/g++
++ export CXX=/opt/icecream/bin/g++
++ CXX=/opt/icecream/bin/g++
++ export 'MAKECMD=make -j 4'
++ MAKECMD='make -j 4'
++ export MAKEBIN=make
++ MAKEBIN=make
++ export
PATH=/opt/icecream/bin:/usr/lib64/mpi/gcc/openmpi/bin:/sbin:/usr/sbin:/usr/local/sbin:/root/bin:/usr/local/bin:/usr/bin:/bin:/usr/X11R6/bin:/usr/games:/usr/lib/mit/bin:/usr/lib/mit/sbin
++
PATH=/opt/icecream/bin:/usr/lib64/mpi/gcc/openmpi/bin:/sbin:/usr/sbin:/usr/local/sbin:/root/bin:/usr/local/bin:/usr/bin:/bin:/usr/X11R6/bin:/usr/games:/usr/lib/mit/bin:/usr/lib/mit/sbin
++ popd
~/hudson/workspace/libzypp-11.2
++ export CHECKOUTDIR=<http://river.suse.de/job/libzypp-11.2/ws/checkout>
++ CHECKOUTDIR=<http://river.suse.de/job/libzypp-11.2/ws/checkout>
++ export BUILDDIR=<http://river.suse.de/job/libzypp-11.2/ws/build>
++ BUILDDIR=<http://river.suse.de/job/libzypp-11.2/ws/build>
++ export PACKAGEDIR=<http://river.suse.de/job/libzypp-11.2/ws/build/package>
++ PACKAGEDIR=<http://river.suse.de/job/libzypp-11.2/ws/build/package>
++ export
ARTIFACTS=<http://river.suse.de/job/libzypp-11.2/210/artifact/.artifacts>
++ ARTIFACTS=<http://river.suse.de/job/libzypp-11.2/210/artifact/.artifacts>
++ export OBSDIR=<http://river.suse.de/job/libzypp-11.2/ws/OBS>
++ OBSDIR=<http://river.suse.de/job/libzypp-11.2/ws/OBS>
++ export RPMTOPDIR=<http://river.suse.de/job/libzypp-11.2/ws/rpm>
++ RPMTOPDIR=<http://river.suse.de/job/libzypp-11.2/ws/rpm>
++ export RPMOUT=<http://river.suse.de/job/libzypp-11.2/ws/rpm/rpms>
++ RPMOUT=<http://river.suse.de/job/libzypp-11.2/ws/rpm/rpms>
++ export RPMBUILDDIR=<http://river.suse.de/job/libzypp-11.2/ws/rpm/rpmbuild>
++ RPMBUILDDIR=<http://river.suse.de/job/libzypp-11.2/ws/rpm/rpmbuild>
++ export
RPMBUILDROOT=<http://river.suse.de/job/libzypp-11.2/ws/rpm/rpmbuildroot>
++ RPMBUILDROOT=<http://river.suse.de/job/libzypp-11.2/ws/rpm/rpmbuildroot>
++ rm -rf <http://river.suse.de/job/libzypp-11.2/ws/rpm/rpms>
++ rm -rf <http://river.suse.de/job/libzypp-11.2/ws/rpm/rpmbuild>
++ rm -rf <http://river.suse.de/job/libzypp-11.2/ws/rpm/rpmbuildroot>
++ rm -rf <http://river.suse.de/job/libzypp-11.2/210/artifact/.artifacts>
++ rm -rf <http://river.suse.de/job/libzypp-11.2/ws/OBS>
++ rm -rf '<http://river.suse.de/job/libzypp-11.2/ws/copy-to-slave*.dir'>
++ '[' -z ']'
++ rm -rf <http://river.suse.de/job/libzypp-11.2/ws/build>
++ mkdir -p <http://river.suse.de/job/libzypp-11.2/ws/build>
++ mkdir -p <http://river.suse.de/job/libzypp-11.2/ws/rpm>
++ mkdir -p <http://river.suse.de/job/libzypp-11.2/ws/rpm/rpms>
++ mkdir -p <http://river.suse.de/job/libzypp-11.2/ws/rpm/rpmbuild>
++ mkdir -p <http://river.suse.de/job/libzypp-11.2/ws/rpm/rpmbuildroot>
++ mkdir -p <http://river.suse.de/job/libzypp-11.2/210/artifact/.artifacts>
++ mkdir -p <http://river.suse.de/job/libzypp-11.2/ws/OBS>
++ cat
+ build_cmake
+ echo '==> Building'
==> Building
+ pushd <http://river.suse.de/job/libzypp-11.2/ws/build>
~/hudson/workspace/libzypp-11.2/build ~/hudson/workspace/libzypp-11.2
+ cmake -DCMAKE_CXX_COMPILER=/opt/icecream/bin/g++
<http://river.suse.de/job/libzypp-11.2/ws/checkout>
-- The C compiler identification is GNU
-- The CXX compiler identification is GNU
-- Check for working C compiler: /opt/icecream/bin/gcc
-- Check for working C compiler: /opt/icecream/bin/gcc -- works
-- Detecting C compiler ABI info
-- Detecting C compiler ABI info - done
-- Check for working CXX compiler: /opt/icecream/bin/g++
-- Check for working CXX compiler: /opt/icecream/bin/g++ -- works
-- Detecting CXX compiler ABI info
-- Detecting CXX compiler ABI info - done
-- Libraries will be installed in /usr/local/lib64
-- Config files will be installed in /usr/local/etc
** Manual files will be installed in /usr/local/share/man
-- Writing spec file...
-- I hate you rpm-lint...!!!
-- rpm found: includes in /usr/include, library in /usr/lib64/librpm.so
(suspect 4.x)
-- rpm found: enable rpm-4.4 legacy interface.
-- Boost version: 1.39.0
-- Found the following Boost libraries:
-- boost found: includes in /usr/include, library in /usr/lib
-- Found Gettext:
-- hal found: includes in /usr/include, library in /usr/lib64/libhal.so
-- dbus found: includes in /usr/include/dbus-1.0, library in
/usr/lib64/libdbus-1.so
-- curl found: includes in /usr/include, library in /usr/lib64/libcurl.so
-- libxml found: includes in /usr/include, library in /usr/lib64/libxml2.so
-- Found ZLIB: /usr/lib64/libz.so
-- satsolver found: includes in /usr/include, library in
/usr/lib64/libsatsolver.a /usr/lib64/libsatsolverext.a
-- Found EXPAT: /usr/lib64/libexpat.so
-- Found libcrypto: /usr/lib64/libcrypto.so
-- Found OpenSSL: /usr/lib64/libssl.so
-- doxygen found: /usr/bin/doxygen
-- soname: 631.4.3
-- version: 6.35.3
-- Writing pkg-config file...
-- FindZypp.cmake will be installed in /usr/local/share/cmake/Modules
-- zypp.conf will be installed in /usr/local/etc/zypp
-- systemCheck will be installed in /usr/local/etc/zypp
-- zsync not found
WARNING qt3 not found
-- Translation set: zypp-po.tar.bz2
tar: Record size = 8 blocks
-- Translations:
es.po;bn.po;hr.po;nl.po;pt_BR.po;hi.po;km.po;bs.po;zh_CN.po;gl.po;id.po;et.po;mr.po;wa.po;el.po;en_US.po;sr.po;nb.po;af.po;pl.po;uk.po;ru.po;he.po;sl.po;lt.po;sk.po;it.po;xh.po;zu.po;de.po;hu.po;fr.po;en_GB.po;ca.po;vi.po;tr.po;fi.po;ja.po;da.po;be.po;ro.po;zh_TW.po;cy.po;tg.po;si.po;ko.po;bg.po;lo.po;mk.po;pt.po;ar.po;sv.po;gu.po;ka.po;th.po;ta.po;cs.po;pa.po;
-- CTest cannot determine repository type. Please set UPDATE_TYPE to 'cvs' or
'svn'. CTest update will not work.
-- Configuring done
-- Generating done
-- Build files have been written to:
<http://river.suse.de/job/libzypp-11.2/ws/build>
+ make -j 4
Scanning dependencies of target mongoose
[ 0%] Building C object vendor/mongoose/CMakeFiles/mongoose.dir/mongoose.c.o
Linking C static library libmongoose.a
[ 0%] Built target mongoose
Scanning dependencies of target zypp
[ 0%] [ 0%] Building CXX object
zypp/CMakeFiles/zypp.dir/misc/DefaultLoadSystem.cc.o
Building CXX object zypp/CMakeFiles/zypp.dir/misc/CheckAccessDeleted.cc.o
[ 0%] Building CXX object
zypp/CMakeFiles/zypp.dir/pool/GetResolvablesToInsDel.cc.o
[ 1%] Building CXX object zypp/CMakeFiles/zypp.dir/pool/PoolImpl.cc.o
[ 1%] Building CXX object zypp/CMakeFiles/zypp.dir/pool/PoolStats.cc.o
In file included from
<http://river.suse.de/job/libzypp-11.2/ws/checkout/zypp/misc/DefaultLoadSystem.cc>:20:
<http://river.suse.de/job/libzypp-11.2/ws/checkout/zypp/zypp_detail/ZYppReadOnlyHack.h>:15:2:
warning: #warning ZYPP_ZYPP_DETAIL_ZYPPREADONLYHACK_H

cc1plus: out of memory allocating 4064 bytes after a total of 2105344 bytes
ICECC[30600] 17:03:00: Compiled on 10.10.101.69
make[2]: *** [zypp/CMakeFiles/zypp.dir/pool/PoolImpl.cc.o] Error 1
make[2]: *** Waiting for unfinished jobs....
<http://river.suse.de/job/libzypp-11.2/ws/checkout/zypp/misc/DefaultLoadSystem.cc>:
In function 'void zypp::misc::defaultLoadSystem(const
zypp::filesystem::Pathname&, zypp::misc::LoadSystemFlags)':
<http://river.suse.de/job/libzypp-11.2/ws/checkout/zypp/misc/DefaultLoadSystem.cc>:48:
warning: 'void zypp::zypp_readonly_hack::IWantIt()' is deprecated (declared at
<http://river.suse.de/job/libzypp-11.2/ws/checkout/zypp/zypp_detail/ZYppReadOnlyHack.h>:26)
<http://river.suse.de/job/libzypp-11.2/ws/checkout/zypp/misc/DefaultLoadSystem.cc>:48:
warning: 'void zypp::zypp_readonly_hack::IWantIt()' is deprecated (declared at
<http://river.suse.de/job/libzypp-11.2/ws/checkout/zypp/zypp_detail/ZYppReadOnlyHack.h>:26)
make[1]: *** [zypp/CMakeFiles/zypp.dir/all] Error 2
make: *** [all] Error 2
Archiving artifacts

--
To unsubscribe, e-mail: zypp-commit+unsubscribe@xxxxxxxxxxxx
For additional commands, e-mail: zypp-commit+help@xxxxxxxxxxxx

< Previous Next >
This Thread
Follow Ups