Mailinglist Archive: zypp-commit (30 mails)

< Previous Next >
[zypp-commit] Build failed in Hudson: libzypp-bindings-HEAD #131
See <http://river.suse.de/job/libzypp-bindings-HEAD/131/>

------------------------------------------
[...truncated 515 lines...]
/usr/include/zypp/Target.h:196: Warning(503): Can't wrap 'operator <<' unless
renamed to a valid identifier.
/usr/include/zypp/Resolver.h:369: Warning(503): Can't wrap 'operator <<' unless
renamed to a valid identifier.
/usr/include/zypp/MediaSetAccess.h:79: Warning(503): Can't wrap 'operator <<'
unless renamed to a valid identifier.
/usr/include/zypp/PoolItem.h:52: Warning(503): Can't wrap 'operator <<' unless
renamed to a valid identifier.
/usr/include/zypp/ZYppFactory.h:47: /usr/include/zypp/PoolItem.h:132:
Warning(503): Can't wrap 'operator ResObject::constPtr' unless renamed to a
valid identifier.
Warning(503): Can't wrap 'operator <<' unless renamed to a valid identifier.
/usr/include/zypp/PoolItem.h:141: Warning(503): Can't wrap 'operator
ResObject::constPtr::unspecified_bool_type' unless renamed to a valid
identifier.
Processing types...
C++ analysis...
Generating wrappers...
Done.
/usr/include/zypp/ResPool.h:50: Warning(503): Can't wrap 'operator <<' unless
renamed to a valid identifier.
Scanning dependencies of target zypp_python
[ 83%] Building CXX object
swig/python/CMakeFiles/zypp_python.dir/libzypp_python.cc.o
/usr/include/zypp/TmpPath.h:62: Warning(503): Can't wrap 'operator const void*'
unless renamed to a valid identifier.
/usr/include/zypp/TmpPath.h:74: Warning(503): Can't wrap 'operator Pathname'
unless renamed to a valid identifier.
/usr/include/zypp/Resolver.h:369: Warning(503): Can't wrap 'operator <<' unless
renamed to a valid identifier.
/usr/include/zypp/ZYppFactory.h:47: Warning(503): Can't wrap 'operator <<'
unless renamed to a valid identifier.
Done.
Scanning dependencies of target zypp_perl
[100%] Building CXX object swig/perl5/CMakeFiles/zypp_perl.dir/libzypp_perl.cc.o
<http://river.suse.de/job/libzypp-bindings-HEAD/ws/build/swig/python/libzypp_python.cc>:
In function 'PyObject* _wrap_Resolvable_dep(PyObject*, PyObject*)':
<http://river.suse.de/job/libzypp-bindings-HEAD/ws/build/swig/python/libzypp_python.cc>:7240:7:
error: no matching function for call to 'zypp::Dep::Dep()'
/usr/include/zypp/Dep.h:89:5: note: candidates are:
zypp::Dep::Dep(zypp::Dep::for_use_in_switch)
/usr/include/zypp/Dep.h:76:5: note: zypp::Dep::Dep(const
std::string&)
/usr/include/zypp/Dep.h:30:3: note: zypp::Dep::Dep(const
zypp::Dep&)
<http://river.suse.de/job/libzypp-bindings-HEAD/ws/build/swig/python/libzypp_python.cc>:
In function 'PyObject* _wrap_ResObject_constPtr_dep(PyObject*, PyObject*)':
<http://river.suse.de/job/libzypp-bindings-HEAD/ws/build/swig/python/libzypp_python.cc>:39570:7:
error: no matching function for call to 'zypp::Dep::Dep()'
/usr/include/zypp/Dep.h:89:5: note: candidates are:
zypp::Dep::Dep(zypp::Dep::for_use_in_switch)
/usr/include/zypp/Dep.h:76:5: note: zypp::Dep::Dep(const
std::string&)
/usr/include/zypp/Dep.h:30:3: note: zypp::Dep::Dep(const
zypp::Dep&)
<http://river.suse.de/job/libzypp-bindings-HEAD/ws/build/swig/python/libzypp_python.cc>:
In function 'PyObject* _wrap_ResObject_Ptr_dep(PyObject*, PyObject*)':
<http://river.suse.de/job/libzypp-bindings-HEAD/ws/build/swig/python/libzypp_python.cc>:41958:7:
error: no matching function for call to 'zypp::Dep::Dep()'
/usr/include/zypp/Dep.h:89:5: note: candidates are:
zypp::Dep::Dep(zypp::Dep::for_use_in_switch)
/usr/include/zypp/Dep.h:76:5: note: zypp::Dep::Dep(const
std::string&)
/usr/include/zypp/Dep.h:30:3: note: zypp::Dep::Dep(const
zypp::Dep&)
<http://river.suse.de/job/libzypp-bindings-HEAD/ws/build/swig/python/libzypp_python.cc>:
In function 'PyObject* _wrap_Package_constPtr_dep(PyObject*, PyObject*)':
<http://river.suse.de/job/libzypp-bindings-HEAD/ws/build/swig/python/libzypp_python.cc>:45022:7:
error: no matching function for call to 'zypp::Dep::Dep()'
/usr/include/zypp/Dep.h:89:5: note: candidates are:
zypp::Dep::Dep(zypp::Dep::for_use_in_switch)
/usr/include/zypp/Dep.h:76:5: note: zypp::Dep::Dep(const
std::string&)
/usr/include/zypp/Dep.h:30:3: note: zypp::Dep::Dep(const
zypp::Dep&)
<http://river.suse.de/job/libzypp-bindings-HEAD/ws/build/swig/python/libzypp_python.cc>:
In function 'PyObject* _wrap_Package_Ptr_dep(PyObject*, PyObject*)':
<http://river.suse.de/job/libzypp-bindings-HEAD/ws/build/swig/python/libzypp_python.cc>:47968:7:
error: no matching function for call to 'zypp::Dep::Dep()'
/usr/include/zypp/Dep.h:89:5: note: candidates are:
zypp::Dep::Dep(zypp::Dep::for_use_in_switch)
/usr/include/zypp/Dep.h:76:5: note: zypp::Dep::Dep(const
std::string&)
/usr/include/zypp/Dep.h:30:3: note: zypp::Dep::Dep(const
zypp::Dep&)
<http://river.suse.de/job/libzypp-bindings-HEAD/ws/build/swig/python/libzypp_python.cc>:
In function 'PyObject* _wrap_Patch_constPtr_dep(PyObject*, PyObject*)':
<http://river.suse.de/job/libzypp-bindings-HEAD/ws/build/swig/python/libzypp_python.cc>:50990:7:
error: no matching function for call to 'zypp::Dep::Dep()'
/usr/include/zypp/Dep.h:89:5: note: candidates are:
zypp::Dep::Dep(zypp::Dep::for_use_in_switch)
/usr/include/zypp/Dep.h:76:5: note: zypp::Dep::Dep(const
std::string&)
/usr/include/zypp/Dep.h:30:3: note: zypp::Dep::Dep(const
zypp::Dep&)
<http://river.suse.de/job/libzypp-bindings-HEAD/ws/build/swig/python/libzypp_python.cc>:
In function 'PyObject* _wrap_Patch_Ptr_dep(PyObject*, PyObject*)':
<http://river.suse.de/job/libzypp-bindings-HEAD/ws/build/swig/python/libzypp_python.cc>:53804:7:
error: no matching function for call to 'zypp::Dep::Dep()'
/usr/include/zypp/Dep.h:89:5: note: candidates are:
zypp::Dep::Dep(zypp::Dep::for_use_in_switch)
/usr/include/zypp/Dep.h:76:5: note: zypp::Dep::Dep(const
std::string&)
/usr/include/zypp/Dep.h:30:3: note: zypp::Dep::Dep(const
zypp::Dep&)
<http://river.suse.de/job/libzypp-bindings-HEAD/ws/build/swig/python/libzypp_python.cc>:
In function 'PyObject* _wrap_SrcPackage_constPtr_dep(PyObject*, PyObject*)':
<http://river.suse.de/job/libzypp-bindings-HEAD/ws/build/swig/python/libzypp_python.cc>:56462:7:
error: no matching function for call to 'zypp::Dep::Dep()'
/usr/include/zypp/Dep.h:89:5: note: candidates are:
zypp::Dep::Dep(zypp::Dep::for_use_in_switch)
/usr/include/zypp/Dep.h:76:5: note: zypp::Dep::Dep(const
std::string&)
/usr/include/zypp/Dep.h:30:3: note: zypp::Dep::Dep(const
zypp::Dep&)
<http://river.suse.de/job/libzypp-bindings-HEAD/ws/build/swig/python/libzypp_python.cc>:
In function 'PyObject* _wrap_SrcPackage_Ptr_dep(PyObject*, PyObject*)':
<http://river.suse.de/job/libzypp-bindings-HEAD/ws/build/swig/python/libzypp_python.cc>:58912:7:
error: no matching function for call to 'zypp::Dep::Dep()'
/usr/include/zypp/Dep.h:89:5: note: candidates are:
zypp::Dep::Dep(zypp::Dep::for_use_in_switch)
/usr/include/zypp/Dep.h:76:5: note: zypp::Dep::Dep(const
std::string&)
/usr/include/zypp/Dep.h:30:3: note: zypp::Dep::Dep(const
zypp::Dep&)
<http://river.suse.de/job/libzypp-bindings-HEAD/ws/build/swig/python/libzypp_python.cc>:
In function 'PyObject* _wrap_Pattern_constPtr_dep(PyObject*, PyObject*)':
<http://river.suse.de/job/libzypp-bindings-HEAD/ws/build/swig/python/libzypp_python.cc>:61934:7:
error: no matching function for call to 'zypp::Dep::Dep()'
/usr/include/zypp/Dep.h:89:5: note: candidates are:
zypp::Dep::Dep(zypp::Dep::for_use_in_switch)
/usr/include/zypp/Dep.h:76:5: note: zypp::Dep::Dep(const
std::string&)
/usr/include/zypp/Dep.h:30:3: note: zypp::Dep::Dep(const
zypp::Dep&)
<http://river.suse.de/job/libzypp-bindings-HEAD/ws/build/swig/python/libzypp_python.cc>:
In function 'PyObject* _wrap_Pattern_Ptr_dep(PyObject*, PyObject*)':
<http://river.suse.de/job/libzypp-bindings-HEAD/ws/build/swig/python/libzypp_python.cc>:64748:7:
error: no matching function for call to 'zypp::Dep::Dep()'
/usr/include/zypp/Dep.h:89:5: note: candidates are:
zypp::Dep::Dep(zypp::Dep::for_use_in_switch)
/usr/include/zypp/Dep.h:76:5: note: zypp::Dep::Dep(const
std::string&)
/usr/include/zypp/Dep.h:30:3: note: zypp::Dep::Dep(const
zypp::Dep&)
<http://river.suse.de/job/libzypp-bindings-HEAD/ws/build/swig/python/libzypp_python.cc>:
In function 'PyObject* _wrap_Product_constPtr_dep(PyObject*, PyObject*)':
<http://river.suse.de/job/libzypp-bindings-HEAD/ws/build/swig/python/libzypp_python.cc>:67918:7:
error: no matching function for call to 'zypp::Dep::Dep()'
/usr/include/zypp/Dep.h:89:5: note: candidates are:
zypp::Dep::Dep(zypp::Dep::for_use_in_switch)
/usr/include/zypp/Dep.h:76:5: note: zypp::Dep::Dep(const
std::string&)
/usr/include/zypp/Dep.h:30:3: note: zypp::Dep::Dep(const
zypp::Dep&)
<http://river.suse.de/job/libzypp-bindings-HEAD/ws/build/swig/python/libzypp_python.cc>:
In function 'PyObject* _wrap_Product_Ptr_dep(PyObject*, PyObject*)':
<http://river.suse.de/job/libzypp-bindings-HEAD/ws/build/swig/python/libzypp_python.cc>:70880:7:
error: no matching function for call to 'zypp::Dep::Dep()'
/usr/include/zypp/Dep.h:89:5: note: candidates are:
zypp::Dep::Dep(zypp::Dep::for_use_in_switch)
/usr/include/zypp/Dep.h:76:5: note: zypp::Dep::Dep(const
std::string&)
/usr/include/zypp/Dep.h:30:3: note: zypp::Dep::Dep(const
zypp::Dep&)
<http://river.suse.de/job/libzypp-bindings-HEAD/ws/build/swig/python/libzypp_python.cc>:
In function 'PyObject* _wrap_PoolItem_dep(PyObject*, PyObject*)':
<http://river.suse.de/job/libzypp-bindings-HEAD/ws/build/swig/python/libzypp_python.cc>:99782:7:
error: no matching function for call to 'zypp::Dep::Dep()'
/usr/include/zypp/Dep.h:89:5: note: candidates are:
zypp::Dep::Dep(zypp::Dep::for_use_in_switch)
/usr/include/zypp/Dep.h:76:5: note: zypp::Dep::Dep(const
std::string&)
/usr/include/zypp/Dep.h:30:3: note: zypp::Dep::Dep(const
zypp::Dep&)
<http://river.suse.de/job/libzypp-bindings-HEAD/ws/build/swig/python/libzypp_python.cc>:
In function 'PyObject* _wrap_ZYppFactoryException_locker_pid(PyObject*,
PyObject*)':
<http://river.suse.de/job/libzypp-bindings-HEAD/ws/build/swig/python/libzypp_python.cc>:115880:71:
warning: 'pid_t zypp::ZYppFactoryException::locker_pid() const' is deprecated
(declared at /usr/include/zypp/ZYppFactory.h:33)
ICECC[10902] 12:11:00: Compiled on 10.11.1.12
make[2]: *** [swig/python/CMakeFiles/zypp_python.dir/libzypp_python.cc.o] Error
1
make[1]: *** [swig/python/CMakeFiles/zypp_python.dir/all] Error 2
make[1]: *** Waiting for unfinished jobs....
<http://river.suse.de/job/libzypp-bindings-HEAD/ws/build/swig/ruby/libzypp_ruby.cc>:
In function 'VALUE _wrap_Resolvable_dep(int, VALUE*, VALUE)':
<http://river.suse.de/job/libzypp-bindings-HEAD/ws/build/swig/ruby/libzypp_ruby.cc>:4491:7:
error: no matching function for call to 'zypp::Dep::Dep()'
/usr/include/zypp/Dep.h:89:5: note: candidates are:
zypp::Dep::Dep(zypp::Dep::for_use_in_switch)
/usr/include/zypp/Dep.h:76:5: note: zypp::Dep::Dep(const
std::string&)
/usr/include/zypp/Dep.h:30:3: note: zypp::Dep::Dep(const
zypp::Dep&)
<http://river.suse.de/job/libzypp-bindings-HEAD/ws/build/swig/ruby/libzypp_ruby.cc>:
In function 'VALUE _wrap_ResObject_constPtr_dep(int, VALUE*, VALUE)':
<http://river.suse.de/job/libzypp-bindings-HEAD/ws/build/swig/ruby/libzypp_ruby.cc>:35823:7:
error: no matching function for call to 'zypp::Dep::Dep()'
/usr/include/zypp/Dep.h:89:5: note: candidates are:
zypp::Dep::Dep(zypp::Dep::for_use_in_switch)
/usr/include/zypp/Dep.h:76:5: note: zypp::Dep::Dep(const
std::string&)
/usr/include/zypp/Dep.h:30:3: note: zypp::Dep::Dep(const
zypp::Dep&)
<http://river.suse.de/job/libzypp-bindings-HEAD/ws/build/swig/ruby/libzypp_ruby.cc>:
In function 'VALUE _wrap_ResObject_Ptr_dep(int, VALUE*, VALUE)':
<http://river.suse.de/job/libzypp-bindings-HEAD/ws/build/swig/ruby/libzypp_ruby.cc>:38306:7:
error: no matching function for call to 'zypp::Dep::Dep()'
/usr/include/zypp/Dep.h:89:5: note: candidates are:
zypp::Dep::Dep(zypp::Dep::for_use_in_switch)
/usr/include/zypp/Dep.h:76:5: note: zypp::Dep::Dep(const
std::string&)
/usr/include/zypp/Dep.h:30:3: note: zypp::Dep::Dep(const
zypp::Dep&)
<http://river.suse.de/job/libzypp-bindings-HEAD/ws/build/swig/ruby/libzypp_ruby.cc>:
In function 'VALUE _wrap_Package_constPtr_dep(int, VALUE*, VALUE)':
<http://river.suse.de/job/libzypp-bindings-HEAD/ws/build/swig/ruby/libzypp_ruby.cc>:41479:7:
error: no matching function for call to 'zypp::Dep::Dep()'
/usr/include/zypp/Dep.h:89:5: note: candidates are:
zypp::Dep::Dep(zypp::Dep::for_use_in_switch)
/usr/include/zypp/Dep.h:76:5: note: zypp::Dep::Dep(const
std::string&)
/usr/include/zypp/Dep.h:30:3: note: zypp::Dep::Dep(const
zypp::Dep&)
<http://river.suse.de/job/libzypp-bindings-HEAD/ws/build/swig/ruby/libzypp_ruby.cc>:
In function 'VALUE _wrap_Package_Ptr_dep(int, VALUE*, VALUE)':
<http://river.suse.de/job/libzypp-bindings-HEAD/ws/build/swig/ruby/libzypp_ruby.cc>:44556:7:
error: no matching function for call to 'zypp::Dep::Dep()'
/usr/include/zypp/Dep.h:89:5: note: candidates are:
zypp::Dep::Dep(zypp::Dep::for_use_in_switch)
/usr/include/zypp/Dep.h:76:5: note: zypp::Dep::Dep(const
std::string&)
/usr/include/zypp/Dep.h:30:3: note: zypp::Dep::Dep(const
zypp::Dep&)
<http://river.suse.de/job/libzypp-bindings-HEAD/ws/build/swig/ruby/libzypp_ruby.cc>:
In function 'VALUE _wrap_Patch_constPtr_dep(int, VALUE*, VALUE)':
<http://river.suse.de/job/libzypp-bindings-HEAD/ws/build/swig/ruby/libzypp_ruby.cc>:47710:7:
error: no matching function for call to 'zypp::Dep::Dep()'
/usr/include/zypp/Dep.h:89:5: note: candidates are:
zypp::Dep::Dep(zypp::Dep::for_use_in_switch)
/usr/include/zypp/Dep.h:76:5: note: zypp::Dep::Dep(const
std::string&)
/usr/include/zypp/Dep.h:30:3: note: zypp::Dep::Dep(const
zypp::Dep&)
<http://river.suse.de/job/libzypp-bindings-HEAD/ws/build/swig/ruby/libzypp_ruby.cc>:
In function 'VALUE _wrap_Patch_Ptr_dep(int, VALUE*, VALUE)':
<http://river.suse.de/job/libzypp-bindings-HEAD/ws/build/swig/ruby/libzypp_ruby.cc>:50644:7:
error: no matching function for call to 'zypp::Dep::Dep()'
/usr/include/zypp/Dep.h:89:5: note: candidates are:
zypp::Dep::Dep(zypp::Dep::for_use_in_switch)
/usr/include/zypp/Dep.h:76:5: note: zypp::Dep::Dep(const
std::string&)
/usr/include/zypp/Dep.h:30:3: note: zypp::Dep::Dep(const
zypp::Dep&)
<http://river.suse.de/job/libzypp-bindings-HEAD/ws/build/swig/ruby/libzypp_ruby.cc>:
In function 'VALUE _wrap_SrcPackage_constPtr_dep(int, VALUE*, VALUE)':
<http://river.suse.de/job/libzypp-bindings-HEAD/ws/build/swig/ruby/libzypp_ruby.cc>:53413:7:
error: no matching function for call to 'zypp::Dep::Dep()'
/usr/include/zypp/Dep.h:89:5: note: candidates are:
zypp::Dep::Dep(zypp::Dep::for_use_in_switch)
/usr/include/zypp/Dep.h:76:5: note: zypp::Dep::Dep(const
std::string&)
/usr/include/zypp/Dep.h:30:3: note: zypp::Dep::Dep(const
zypp::Dep&)
<http://river.suse.de/job/libzypp-bindings-HEAD/ws/build/swig/ruby/libzypp_ruby.cc>:
In function 'VALUE _wrap_SrcPackage_Ptr_dep(int, VALUE*, VALUE)':
<http://river.suse.de/job/libzypp-bindings-HEAD/ws/build/swig/ruby/libzypp_ruby.cc>:55962:7:
error: no matching function for call to 'zypp::Dep::Dep()'
/usr/include/zypp/Dep.h:89:5: note: candidates are:
zypp::Dep::Dep(zypp::Dep::for_use_in_switch)
/usr/include/zypp/Dep.h:76:5: note: zypp::Dep::Dep(const
std::string&)
/usr/include/zypp/Dep.h:30:3: note: zypp::Dep::Dep(const
zypp::Dep&)
<http://river.suse.de/job/libzypp-bindings-HEAD/ws/build/swig/ruby/libzypp_ruby.cc>:
In function 'VALUE _wrap_Pattern_constPtr_dep(int, VALUE*, VALUE)':
<http://river.suse.de/job/libzypp-bindings-HEAD/ws/build/swig/ruby/libzypp_ruby.cc>:59116:7:
error: no matching function for call to 'zypp::Dep::Dep()'
/usr/include/zypp/Dep.h:89:5: note: candidates are:
zypp::Dep::Dep(zypp::Dep::for_use_in_switch)
/usr/include/zypp/Dep.h:76:5: note: zypp::Dep::Dep(const
std::string&)
/usr/include/zypp/Dep.h:30:3: note: zypp::Dep::Dep(const
zypp::Dep&)
<http://river.suse.de/job/libzypp-bindings-HEAD/ws/build/swig/ruby/libzypp_ruby.cc>:
In function 'VALUE _wrap_Pattern_Ptr_dep(int, VALUE*, VALUE)':
<http://river.suse.de/job/libzypp-bindings-HEAD/ws/build/swig/ruby/libzypp_ruby.cc>:62050:7:
error: no matching function for call to 'zypp::Dep::Dep()'
/usr/include/zypp/Dep.h:89:5: note: candidates are:
zypp::Dep::Dep(zypp::Dep::for_use_in_switch)
/usr/include/zypp/Dep.h:76:5: note: zypp::Dep::Dep(const
std::string&)
/usr/include/zypp/Dep.h:30:3: note: zypp::Dep::Dep(const
zypp::Dep&)
<http://river.suse.de/job/libzypp-bindings-HEAD/ws/build/swig/ruby/libzypp_ruby.cc>:
In function 'VALUE _wrap_Product_constPtr_dep(int, VALUE*, VALUE)':
<http://river.suse.de/job/libzypp-bindings-HEAD/ws/build/swig/ruby/libzypp_ruby.cc>:65362:7:
error: no matching function for call to 'zypp::Dep::Dep()'
/usr/include/zypp/Dep.h:89:5: note: candidates are:
zypp::Dep::Dep(zypp::Dep::for_use_in_switch)
/usr/include/zypp/Dep.h:76:5: note: zypp::Dep::Dep(const
std::string&)
/usr/include/zypp/Dep.h:30:3: note: zypp::Dep::Dep(const
zypp::Dep&)
<http://river.suse.de/job/libzypp-bindings-HEAD/ws/build/swig/ruby/libzypp_ruby.cc>:
In function 'VALUE _wrap_Product_Ptr_dep(int, VALUE*, VALUE)':
<http://river.suse.de/job/libzypp-bindings-HEAD/ws/build/swig/ruby/libzypp_ruby.cc>:68454:7:
error: no matching function for call to 'zypp::Dep::Dep()'
/usr/include/zypp/Dep.h:89:5: note: candidates are:
zypp::Dep::Dep(zypp::Dep::for_use_in_switch)
/usr/include/zypp/Dep.h:76:5: note: zypp::Dep::Dep(const
std::string&)
/usr/include/zypp/Dep.h:30:3: note: zypp::Dep::Dep(const
zypp::Dep&)
<http://river.suse.de/job/libzypp-bindings-HEAD/ws/build/swig/ruby/libzypp_ruby.cc>:
In function 'VALUE _wrap_PoolItem_dep(int, VALUE*, VALUE)':
<http://river.suse.de/job/libzypp-bindings-HEAD/ws/build/swig/ruby/libzypp_ruby.cc>:96304:7:
error: no matching function for call to 'zypp::Dep::Dep()'
/usr/include/zypp/Dep.h:89:5: note: candidates are:
zypp::Dep::Dep(zypp::Dep::for_use_in_switch)
/usr/include/zypp/Dep.h:76:5: note: zypp::Dep::Dep(const
std::string&)
/usr/include/zypp/Dep.h:30:3: note: zypp::Dep::Dep(const
zypp::Dep&)
<http://river.suse.de/job/libzypp-bindings-HEAD/ws/build/swig/ruby/libzypp_ruby.cc>:
In function 'VALUE _wrap_ZYppFactoryException_locker_pid(int, VALUE*, VALUE)':
<http://river.suse.de/job/libzypp-bindings-HEAD/ws/build/swig/ruby/libzypp_ruby.cc>:110093:71:
warning: 'pid_t zypp::ZYppFactoryException::locker_pid() const' is deprecated
(declared at /usr/include/zypp/ZYppFactory.h:33)
ICECC[10893] 12:11:01: Compiled on 10.10.0.19
make[2]: *** [swig/ruby/CMakeFiles/zypp_ruby.dir/libzypp_ruby.cc.o] Error 1
make[1]: *** [swig/ruby/CMakeFiles/zypp_ruby.dir/all] Error 2
<http://river.suse.de/job/libzypp-bindings-HEAD/ws/build/swig/perl5/libzypp_perl.cc>:
In function 'void _wrap_Resolvable_dep(PerlInterpreter*, CV*)':
<http://river.suse.de/job/libzypp-bindings-HEAD/ws/build/swig/perl5/libzypp_perl.cc>:3835:9:
error: no matching function for call to 'zypp::Dep::Dep()'
/usr/include/zypp/Dep.h:89:5: note: candidates are:
zypp::Dep::Dep(zypp::Dep::for_use_in_switch)
/usr/include/zypp/Dep.h:76:5: note: zypp::Dep::Dep(const
std::string&)
/usr/include/zypp/Dep.h:30:3: note: zypp::Dep::Dep(const
zypp::Dep&)
<http://river.suse.de/job/libzypp-bindings-HEAD/ws/build/swig/perl5/libzypp_perl.cc>:
In function 'void _wrap_ResObject_constPtr_dep(PerlInterpreter*, CV*)':
<http://river.suse.de/job/libzypp-bindings-HEAD/ws/build/swig/perl5/libzypp_perl.cc>:35416:9:
error: no matching function for call to 'zypp::Dep::Dep()'
/usr/include/zypp/Dep.h:89:5: note: candidates are:
zypp::Dep::Dep(zypp::Dep::for_use_in_switch)
/usr/include/zypp/Dep.h:76:5: note: zypp::Dep::Dep(const
std::string&)
/usr/include/zypp/Dep.h:30:3: note: zypp::Dep::Dep(const
zypp::Dep&)
<http://river.suse.de/job/libzypp-bindings-HEAD/ws/build/swig/perl5/libzypp_perl.cc>:
In function 'void _wrap_ResObject_Ptr_dep(PerlInterpreter*, CV*)':
<http://river.suse.de/job/libzypp-bindings-HEAD/ws/build/swig/perl5/libzypp_perl.cc>:37877:9:
error: no matching function for call to 'zypp::Dep::Dep()'
/usr/include/zypp/Dep.h:89:5: note: candidates are:
zypp::Dep::Dep(zypp::Dep::for_use_in_switch)
/usr/include/zypp/Dep.h:76:5: note: zypp::Dep::Dep(const
std::string&)
/usr/include/zypp/Dep.h:30:3: note: zypp::Dep::Dep(const
zypp::Dep&)
<http://river.suse.de/job/libzypp-bindings-HEAD/ws/build/swig/perl5/libzypp_perl.cc>:
In function 'void _wrap_Package_constPtr_dep(PerlInterpreter*, CV*)':
<http://river.suse.de/job/libzypp-bindings-HEAD/ws/build/swig/perl5/libzypp_perl.cc>:40932:9:
error: no matching function for call to 'zypp::Dep::Dep()'
/usr/include/zypp/Dep.h:89:5: note: candidates are:
zypp::Dep::Dep(zypp::Dep::for_use_in_switch)
/usr/include/zypp/Dep.h:76:5: note: zypp::Dep::Dep(const
std::string&)
/usr/include/zypp/Dep.h:30:3: note: zypp::Dep::Dep(const
zypp::Dep&)
<http://river.suse.de/job/libzypp-bindings-HEAD/ws/build/swig/perl5/libzypp_perl.cc>:
In function 'void _wrap_Package_Ptr_dep(PerlInterpreter*, CV*)':
<http://river.suse.de/job/libzypp-bindings-HEAD/ws/build/swig/perl5/libzypp_perl.cc>:43897:9:
error: no matching function for call to 'zypp::Dep::Dep()'
/usr/include/zypp/Dep.h:89:5: note: candidates are:
zypp::Dep::Dep(zypp::Dep::for_use_in_switch)
/usr/include/zypp/Dep.h:76:5: note: zypp::Dep::Dep(const
std::string&)
/usr/include/zypp/Dep.h:30:3: note: zypp::Dep::Dep(const
zypp::Dep&)
<http://river.suse.de/job/libzypp-bindings-HEAD/ws/build/swig/perl5/libzypp_perl.cc>:
In function 'void _wrap_Patch_constPtr_dep(PerlInterpreter*, CV*)':
<http://river.suse.de/job/libzypp-bindings-HEAD/ws/build/swig/perl5/libzypp_perl.cc>:47026:9:
error: no matching function for call to 'zypp::Dep::Dep()'
/usr/include/zypp/Dep.h:89:5: note: candidates are:
zypp::Dep::Dep(zypp::Dep::for_use_in_switch)
/usr/include/zypp/Dep.h:76:5: note: zypp::Dep::Dep(const
std::string&)
/usr/include/zypp/Dep.h:30:3: note: zypp::Dep::Dep(const
zypp::Dep&)
<http://river.suse.de/job/libzypp-bindings-HEAD/ws/build/swig/perl5/libzypp_perl.cc>:
In function 'void _wrap_Patch_Ptr_dep(PerlInterpreter*, CV*)':
<http://river.suse.de/job/libzypp-bindings-HEAD/ws/build/swig/perl5/libzypp_perl.cc>:49907:9:
error: no matching function for call to 'zypp::Dep::Dep()'
/usr/include/zypp/Dep.h:89:5: note: candidates are:
zypp::Dep::Dep(zypp::Dep::for_use_in_switch)
/usr/include/zypp/Dep.h:76:5: note: zypp::Dep::Dep(const
std::string&)
/usr/include/zypp/Dep.h:30:3: note: zypp::Dep::Dep(const
zypp::Dep&)
<http://river.suse.de/job/libzypp-bindings-HEAD/ws/build/swig/perl5/libzypp_perl.cc>:
In function 'void _wrap_SrcPackage_constPtr_dep(PerlInterpreter*, CV*)':
<http://river.suse.de/job/libzypp-bindings-HEAD/ws/build/swig/perl5/libzypp_perl.cc>:52672:9:
error: no matching function for call to 'zypp::Dep::Dep()'
/usr/include/zypp/Dep.h:89:5: note: candidates are:
zypp::Dep::Dep(zypp::Dep::for_use_in_switch)
/usr/include/zypp/Dep.h:76:5: note: zypp::Dep::Dep(const
std::string&)
/usr/include/zypp/Dep.h:30:3: note: zypp::Dep::Dep(const
zypp::Dep&)
<http://river.suse.de/job/libzypp-bindings-HEAD/ws/build/swig/perl5/libzypp_perl.cc>:
In function 'void _wrap_SrcPackage_Ptr_dep(PerlInterpreter*, CV*)':
<http://river.suse.de/job/libzypp-bindings-HEAD/ws/build/swig/perl5/libzypp_perl.cc>:55189:9:
error: no matching function for call to 'zypp::Dep::Dep()'
/usr/include/zypp/Dep.h:89:5: note: candidates are:
zypp::Dep::Dep(zypp::Dep::for_use_in_switch)
/usr/include/zypp/Dep.h:76:5: note: zypp::Dep::Dep(const
std::string&)
/usr/include/zypp/Dep.h:30:3: note: zypp::Dep::Dep(const
zypp::Dep&)
<http://river.suse.de/job/libzypp-bindings-HEAD/ws/build/swig/perl5/libzypp_perl.cc>:
In function 'void _wrap_Pattern_constPtr_dep(PerlInterpreter*, CV*)':
<http://river.suse.de/job/libzypp-bindings-HEAD/ws/build/swig/perl5/libzypp_perl.cc>:58318:9:
error: no matching function for call to 'zypp::Dep::Dep()'
/usr/include/zypp/Dep.h:89:5: note: candidates are:
zypp::Dep::Dep(zypp::Dep::for_use_in_switch)
/usr/include/zypp/Dep.h:76:5: note: zypp::Dep::Dep(const
std::string&)
/usr/include/zypp/Dep.h:30:3: note: zypp::Dep::Dep(const
zypp::Dep&)
<http://river.suse.de/job/libzypp-bindings-HEAD/ws/build/swig/perl5/libzypp_perl.cc>:
In function 'void _wrap_Pattern_Ptr_dep(PerlInterpreter*, CV*)':
<http://river.suse.de/job/libzypp-bindings-HEAD/ws/build/swig/perl5/libzypp_perl.cc>:61199:9:
error: no matching function for call to 'zypp::Dep::Dep()'
/usr/include/zypp/Dep.h:89:5: note: candidates are:
zypp::Dep::Dep(zypp::Dep::for_use_in_switch)
/usr/include/zypp/Dep.h:76:5: note: zypp::Dep::Dep(const
std::string&)
/usr/include/zypp/Dep.h:30:3: note: zypp::Dep::Dep(const
zypp::Dep&)
<http://river.suse.de/job/libzypp-bindings-HEAD/ws/build/swig/perl5/libzypp_perl.cc>:
In function 'void _wrap_Product_constPtr_dep(PerlInterpreter*, CV*)':
<http://river.suse.de/job/libzypp-bindings-HEAD/ws/build/swig/perl5/libzypp_perl.cc>:64427:9:
error: no matching function for call to 'zypp::Dep::Dep()'
/usr/include/zypp/Dep.h:89:5: note: candidates are:
zypp::Dep::Dep(zypp::Dep::for_use_in_switch)
/usr/include/zypp/Dep.h:76:5: note: zypp::Dep::Dep(const
std::string&)
/usr/include/zypp/Dep.h:30:3: note: zypp::Dep::Dep(const
zypp::Dep&)
<http://river.suse.de/job/libzypp-bindings-HEAD/ws/build/swig/perl5/libzypp_perl.cc>:
In function 'void _wrap_Product_Ptr_dep(PerlInterpreter*, CV*)':
<http://river.suse.de/job/libzypp-bindings-HEAD/ws/build/swig/perl5/libzypp_perl.cc>:67407:9:
error: no matching function for call to 'zypp::Dep::Dep()'
/usr/include/zypp/Dep.h:89:5: note: candidates are:
zypp::Dep::Dep(zypp::Dep::for_use_in_switch)
/usr/include/zypp/Dep.h:76:5: note: zypp::Dep::Dep(const
std::string&)
/usr/include/zypp/Dep.h:30:3: note: zypp::Dep::Dep(const
zypp::Dep&)
<http://river.suse.de/job/libzypp-bindings-HEAD/ws/build/swig/perl5/libzypp_perl.cc>:
In function 'void _wrap_PoolItem_dep(PerlInterpreter*, CV*)':
<http://river.suse.de/job/libzypp-bindings-HEAD/ws/build/swig/perl5/libzypp_perl.cc>:96595:9:
error: no matching function for call to 'zypp::Dep::Dep()'
/usr/include/zypp/Dep.h:89:5: note: candidates are:
zypp::Dep::Dep(zypp::Dep::for_use_in_switch)
/usr/include/zypp/Dep.h:76:5: note: zypp::Dep::Dep(const
std::string&)
/usr/include/zypp/Dep.h:30:3: note: zypp::Dep::Dep(const
zypp::Dep&)
<http://river.suse.de/job/libzypp-bindings-HEAD/ws/build/swig/perl5/libzypp_perl.cc>:
In function 'void _wrap_ZYppFactoryException_locker_pid(PerlInterpreter*,
CV*)':
<http://river.suse.de/job/libzypp-bindings-HEAD/ws/build/swig/perl5/libzypp_perl.cc>:110116:69:
warning: 'pid_t zypp::ZYppFactoryException::locker_pid() const' is deprecated
(declared at /usr/include/zypp/ZYppFactory.h:33)
ICECC[10915] 12:11:07: Compiled on 10.11.0.134
make[2]: *** [swig/perl5/CMakeFiles/zypp_perl.dir/libzypp_perl.cc.o] Error 1
make[1]: *** [swig/perl5/CMakeFiles/zypp_perl.dir/all] Error 2
make: *** [all] Error 2
Archiving artifacts

--
To unsubscribe, e-mail: zypp-commit+unsubscribe@xxxxxxxxxxxx
For additional commands, e-mail: zypp-commit+help@xxxxxxxxxxxx

< Previous Next >
List Navigation
This Thread
Follow Ups
References