Mailinglist Archive: zypp-commit (130 mails)

< Previous Next >
[zypp-commit] Build failed in Hudson: libzypp-11.2 #195
See <http://river.suse.de/job/libzypp-11.2/195/>

------------------------------------------
[...truncated 4601 lines...]
/usr/bin/cmake -E cmake_progress_report
<http://river.suse.de/job/libzypp-11.2/ws/rpm/rpmbuild/libzypp-6.33.4/build/CMakeFiles>

[ 47%] Building CXX object zypp/CMakeFiles/zypp.dir/thread/Mutex.cc.o
cd
<http://river.suse.de/job/libzypp-11.2/ws/rpm/rpmbuild/libzypp-6.33.4/build/zypp>
&& /opt/icecream/bin/g++ -Dzypp_EXPORTS -D_FILE_OFFSET_BITS=64
-DVERSION=\"6.33.4\" -D_RPM_4_4_COMPAT -DLOCALEDIR=\"/usr/share/locale\"
-DTEXTDOMAIN=\"zypp\" -O2 -g -m64 -fmessage-length=0 -D_FORTIFY_SOURCE=2
-fstack-protector -funwind-tables -fasynchronous-unwind-tables -fPIC -g -Wall
-Werror=format-security -Woverloaded-virtual -Wnon-virtual-dtor -Wl,-as-needed
-O2 -g -m64 -fmessage-length=0 -D_FORTIFY_SOURCE=2 -fstack-protector
-funwind-tables -fasynchronous-unwind-tables -fPIC -g -Wall
-Werror=format-security -Woverloaded-virtual -Wnon-virtual-dtor -Wl,-as-needed
-O3 -fPIC
-I<http://river.suse.de/job/libzypp-11.2/ws/rpm/rpmbuild/libzypp-6.33.4>
-I<http://river.suse.de/job/libzypp-11.2/ws/rpm/rpmbuild/libzypp-6.33.4/build>
-I/usr/include/rpm -I/usr/include/hal -I/usr/include/dbus-1.0
-I/usr/lib64/dbus-1.0/include
-I<http://river.suse.de/job/libzypp-11.2/ws/rpm/rpmbuild/libzypp-6.33.4/build/zypp>
-DZYPP_BASE_LOGGER_LOGGROUP=\"zypp\" -o
CMakeFiles/zypp.dir/thread/Mutex.cc.o -c
<http://river.suse.de/job/libzypp-11.2/ws/rpm/rpmbuild/libzypp-6.33.4/zypp/thread/Mutex.cc>
/usr/bin/cmake -E cmake_progress_report
<http://river.suse.de/job/libzypp-11.2/ws/rpm/rpmbuild/libzypp-6.33.4/build/CMakeFiles>
30
[ 49%] Building CXX object zypp/CMakeFiles/zypp.dir/ws/WebpinResult.cc.o
cd
<http://river.suse.de/job/libzypp-11.2/ws/rpm/rpmbuild/libzypp-6.33.4/build/zypp>
&& /opt/icecream/bin/g++ -Dzypp_EXPORTS -D_FILE_OFFSET_BITS=64
-DVERSION=\"6.33.4\" -D_RPM_4_4_COMPAT -DLOCALEDIR=\"/usr/share/locale\"
-DTEXTDOMAIN=\"zypp\" -O2 -g -m64 -fmessage-length=0 -D_FORTIFY_SOURCE=2
-fstack-protector -funwind-tables -fasynchronous-unwind-tables -fPIC -g -Wall
-Werror=format-security -Woverloaded-virtual -Wnon-virtual-dtor -Wl,-as-needed
-O2 -g -m64 -fmessage-length=0 -D_FORTIFY_SOURCE=2 -fstack-protector
-funwind-tables -fasynchronous-unwind-tables -fPIC -g -Wall
-Werror=format-security -Woverloaded-virtual -Wnon-virtual-dtor -Wl,-as-needed
-O3 -fPIC
-I<http://river.suse.de/job/libzypp-11.2/ws/rpm/rpmbuild/libzypp-6.33.4>
-I<http://river.suse.de/job/libzypp-11.2/ws/rpm/rpmbuild/libzypp-6.33.4/build>
-I/usr/include/rpm -I/usr/include/hal -I/usr/include/dbus-1.0
-I/usr/lib64/dbus-1.0/include
-I<http://river.suse.de/job/libzypp-11.2/ws/rpm/rpmbuild/libzypp-6.33.4/build/zypp>
-DZYPP_BASE_LOGGER_LOGGROUP=\"zypp\" -o
CMakeFiles/zypp.dir/ws/WebpinResult.cc.o -c
<http://river.suse.de/job/libzypp-11.2/ws/rpm/rpmbuild/libzypp-6.33.4/zypp/ws/WebpinResult.cc>
/usr/bin/cmake -E cmake_progress_report
<http://river.suse.de/job/libzypp-11.2/ws/rpm/rpmbuild/libzypp-6.33.4/build/CMakeFiles>

[ 49%] Building CXX object zypp/CMakeFiles/zypp.dir/ByteCount.cc.o
cd
<http://river.suse.de/job/libzypp-11.2/ws/rpm/rpmbuild/libzypp-6.33.4/build/zypp>
&& /opt/icecream/bin/g++ -Dzypp_EXPORTS -D_FILE_OFFSET_BITS=64
-DVERSION=\"6.33.4\" -D_RPM_4_4_COMPAT -DLOCALEDIR=\"/usr/share/locale\"
-DTEXTDOMAIN=\"zypp\" -O2 -g -m64 -fmessage-length=0 -D_FORTIFY_SOURCE=2
-fstack-protector -funwind-tables -fasynchronous-unwind-tables -fPIC -g -Wall
-Werror=format-security -Woverloaded-virtual -Wnon-virtual-dtor -Wl,-as-needed
-O2 -g -m64 -fmessage-length=0 -D_FORTIFY_SOURCE=2 -fstack-protector
-funwind-tables -fasynchronous-unwind-tables -fPIC -g -Wall
-Werror=format-security -Woverloaded-virtual -Wnon-virtual-dtor -Wl,-as-needed
-O3 -fPIC
-I<http://river.suse.de/job/libzypp-11.2/ws/rpm/rpmbuild/libzypp-6.33.4>
-I<http://river.suse.de/job/libzypp-11.2/ws/rpm/rpmbuild/libzypp-6.33.4/build>
-I/usr/include/rpm -I/usr/include/hal -I/usr/include/dbus-1.0
-I/usr/lib64/dbus-1.0/include
-I<http://river.suse.de/job/libzypp-11.2/ws/rpm/rpmbuild/libzypp-6.33.4/build/zypp>
-DZYPP_BASE_LOGGER_LOGGROUP=\"zypp\" -o CMakeFiles/zypp.dir/ByteCount.cc.o
-c
<http://river.suse.de/job/libzypp-11.2/ws/rpm/rpmbuild/libzypp-6.33.4/zypp/ByteCount.cc>
/usr/bin/cmake -E cmake_progress_report
<http://river.suse.de/job/libzypp-11.2/ws/rpm/rpmbuild/libzypp-6.33.4/build/CMakeFiles>

[ 49%] Building CXX object zypp/CMakeFiles/zypp.dir/Capabilities.cc.o
cd
<http://river.suse.de/job/libzypp-11.2/ws/rpm/rpmbuild/libzypp-6.33.4/build/zypp>
&& /opt/icecream/bin/g++ -Dzypp_EXPORTS -D_FILE_OFFSET_BITS=64
-DVERSION=\"6.33.4\" -D_RPM_4_4_COMPAT -DLOCALEDIR=\"/usr/share/locale\"
-DTEXTDOMAIN=\"zypp\" -O2 -g -m64 -fmessage-length=0 -D_FORTIFY_SOURCE=2
-fstack-protector -funwind-tables -fasynchronous-unwind-tables -fPIC -g -Wall
-Werror=format-security -Woverloaded-virtual -Wnon-virtual-dtor -Wl,-as-needed
-O2 -g -m64 -fmessage-length=0 -D_FORTIFY_SOURCE=2 -fstack-protector
-funwind-tables -fasynchronous-unwind-tables -fPIC -g -Wall
-Werror=format-security -Woverloaded-virtual -Wnon-virtual-dtor -Wl,-as-needed
-O3 -fPIC
-I<http://river.suse.de/job/libzypp-11.2/ws/rpm/rpmbuild/libzypp-6.33.4>
-I<http://river.suse.de/job/libzypp-11.2/ws/rpm/rpmbuild/libzypp-6.33.4/build>
-I/usr/include/rpm -I/usr/include/hal -I/usr/include/dbus-1.0
-I/usr/lib64/dbus-1.0/include
-I<http://river.suse.de/job/libzypp-11.2/ws/rpm/rpmbuild/libzypp-6.33.4/build/zypp>
-DZYPP_BASE_LOGGER_LOGGROUP=\"zypp\" -o
CMakeFiles/zypp.dir/Capabilities.cc.o -c
<http://river.suse.de/job/libzypp-11.2/ws/rpm/rpmbuild/libzypp-6.33.4/zypp/Capabilities.cc>
/usr/bin/cmake -E cmake_progress_report
<http://river.suse.de/job/libzypp-11.2/ws/rpm/rpmbuild/libzypp-6.33.4/build/CMakeFiles>

[ 49%] Building CXX object zypp/CMakeFiles/zypp.dir/Capability.cc.o
cd
<http://river.suse.de/job/libzypp-11.2/ws/rpm/rpmbuild/libzypp-6.33.4/build/zypp>
&& /opt/icecream/bin/g++ -Dzypp_EXPORTS -D_FILE_OFFSET_BITS=64
-DVERSION=\"6.33.4\" -D_RPM_4_4_COMPAT -DLOCALEDIR=\"/usr/share/locale\"
-DTEXTDOMAIN=\"zypp\" -O2 -g -m64 -fmessage-length=0 -D_FORTIFY_SOURCE=2
-fstack-protector -funwind-tables -fasynchronous-unwind-tables -fPIC -g -Wall
-Werror=format-security -Woverloaded-virtual -Wnon-virtual-dtor -Wl,-as-needed
-O2 -g -m64 -fmessage-length=0 -D_FORTIFY_SOURCE=2 -fstack-protector
-funwind-tables -fasynchronous-unwind-tables -fPIC -g -Wall
-Werror=format-security -Woverloaded-virtual -Wnon-virtual-dtor -Wl,-as-needed
-O3 -fPIC
-I<http://river.suse.de/job/libzypp-11.2/ws/rpm/rpmbuild/libzypp-6.33.4>
-I<http://river.suse.de/job/libzypp-11.2/ws/rpm/rpmbuild/libzypp-6.33.4/build>
-I/usr/include/rpm -I/usr/include/hal -I/usr/include/dbus-1.0
-I/usr/lib64/dbus-1.0/include
-I<http://river.suse.de/job/libzypp-11.2/ws/rpm/rpmbuild/libzypp-6.33.4/build/zypp>
-DZYPP_BASE_LOGGER_LOGGROUP=\"zypp\" -o CMakeFiles/zypp.dir/Capability.cc.o
-c
<http://river.suse.de/job/libzypp-11.2/ws/rpm/rpmbuild/libzypp-6.33.4/zypp/Capability.cc>
<http://river.suse.de/job/libzypp-11.2/ws/rpm/rpmbuild/libzypp-6.33.4/zypp/Capability.cc>:307:2:
warning: #warning MIGRATE TO SAT
<http://river.suse.de/job/libzypp-11.2/ws/rpm/rpmbuild/libzypp-6.33.4/zypp/Capability.cc>:308:2:
warning: #warning TESTCASE
/usr/bin/cmake -E cmake_progress_report
<http://river.suse.de/job/libzypp-11.2/ws/rpm/rpmbuild/libzypp-6.33.4/build/CMakeFiles>
31
[ 50%] Building CXX object zypp/CMakeFiles/zypp.dir/CapMatch.cc.o
cd
<http://river.suse.de/job/libzypp-11.2/ws/rpm/rpmbuild/libzypp-6.33.4/build/zypp>
&& /opt/icecream/bin/g++ -Dzypp_EXPORTS -D_FILE_OFFSET_BITS=64
-DVERSION=\"6.33.4\" -D_RPM_4_4_COMPAT -DLOCALEDIR=\"/usr/share/locale\"
-DTEXTDOMAIN=\"zypp\" -O2 -g -m64 -fmessage-length=0 -D_FORTIFY_SOURCE=2
-fstack-protector -funwind-tables -fasynchronous-unwind-tables -fPIC -g -Wall
-Werror=format-security -Woverloaded-virtual -Wnon-virtual-dtor -Wl,-as-needed
-O2 -g -m64 -fmessage-length=0 -D_FORTIFY_SOURCE=2 -fstack-protector
-funwind-tables -fasynchronous-unwind-tables -fPIC -g -Wall
-Werror=format-security -Woverloaded-virtual -Wnon-virtual-dtor -Wl,-as-needed
-O3 -fPIC
-I<http://river.suse.de/job/libzypp-11.2/ws/rpm/rpmbuild/libzypp-6.33.4>
-I<http://river.suse.de/job/libzypp-11.2/ws/rpm/rpmbuild/libzypp-6.33.4/build>
-I/usr/include/rpm -I/usr/include/hal -I/usr/include/dbus-1.0
-I/usr/lib64/dbus-1.0/include
-I<http://river.suse.de/job/libzypp-11.2/ws/rpm/rpmbuild/libzypp-6.33.4/build/zypp>
-DZYPP_BASE_LOGGER_LOGGROUP=\"zypp\" -o CMakeFiles/zypp.dir/CapMatch.cc.o -c
<http://river.suse.de/job/libzypp-11.2/ws/rpm/rpmbuild/libzypp-6.33.4/zypp/CapMatch.cc>
/usr/bin/cmake -E cmake_progress_report
<http://river.suse.de/job/libzypp-11.2/ws/rpm/rpmbuild/libzypp-6.33.4/build/CMakeFiles>

[ 50%] Building CXX object zypp/CMakeFiles/zypp.dir/Changelog.cc.o
cd
<http://river.suse.de/job/libzypp-11.2/ws/rpm/rpmbuild/libzypp-6.33.4/build/zypp>
&& /opt/icecream/bin/g++ -Dzypp_EXPORTS -D_FILE_OFFSET_BITS=64
-DVERSION=\"6.33.4\" -D_RPM_4_4_COMPAT -DLOCALEDIR=\"/usr/share/locale\"
-DTEXTDOMAIN=\"zypp\" -O2 -g -m64 -fmessage-length=0 -D_FORTIFY_SOURCE=2
-fstack-protector -funwind-tables -fasynchronous-unwind-tables -fPIC -g -Wall
-Werror=format-security -Woverloaded-virtual -Wnon-virtual-dtor -Wl,-as-needed
-O2 -g -m64 -fmessage-length=0 -D_FORTIFY_SOURCE=2 -fstack-protector
-funwind-tables -fasynchronous-unwind-tables -fPIC -g -Wall
-Werror=format-security -Woverloaded-virtual -Wnon-virtual-dtor -Wl,-as-needed
-O3 -fPIC
-I<http://river.suse.de/job/libzypp-11.2/ws/rpm/rpmbuild/libzypp-6.33.4>
-I<http://river.suse.de/job/libzypp-11.2/ws/rpm/rpmbuild/libzypp-6.33.4/build>
-I/usr/include/rpm -I/usr/include/hal -I/usr/include/dbus-1.0
-I/usr/lib64/dbus-1.0/include
-I<http://river.suse.de/job/libzypp-11.2/ws/rpm/rpmbuild/libzypp-6.33.4/build/zypp>
-DZYPP_BASE_LOGGER_LOGGROUP=\"zypp\" -o CMakeFiles/zypp.dir/Changelog.cc.o
-c
<http://river.suse.de/job/libzypp-11.2/ws/rpm/rpmbuild/libzypp-6.33.4/zypp/Changelog.cc>
/usr/bin/cmake -E cmake_progress_report
<http://river.suse.de/job/libzypp-11.2/ws/rpm/rpmbuild/libzypp-6.33.4/build/CMakeFiles>

[ 50%] Building CXX object zypp/CMakeFiles/zypp.dir/CheckSum.cc.o
cd
<http://river.suse.de/job/libzypp-11.2/ws/rpm/rpmbuild/libzypp-6.33.4/build/zypp>
&& /opt/icecream/bin/g++ -Dzypp_EXPORTS -D_FILE_OFFSET_BITS=64
-DVERSION=\"6.33.4\" -D_RPM_4_4_COMPAT -DLOCALEDIR=\"/usr/share/locale\"
-DTEXTDOMAIN=\"zypp\" -O2 -g -m64 -fmessage-length=0 -D_FORTIFY_SOURCE=2
-fstack-protector -funwind-tables -fasynchronous-unwind-tables -fPIC -g -Wall
-Werror=format-security -Woverloaded-virtual -Wnon-virtual-dtor -Wl,-as-needed
-O2 -g -m64 -fmessage-length=0 -D_FORTIFY_SOURCE=2 -fstack-protector
-funwind-tables -fasynchronous-unwind-tables -fPIC -g -Wall
-Werror=format-security -Woverloaded-virtual -Wnon-virtual-dtor -Wl,-as-needed
-O3 -fPIC
-I<http://river.suse.de/job/libzypp-11.2/ws/rpm/rpmbuild/libzypp-6.33.4>
-I<http://river.suse.de/job/libzypp-11.2/ws/rpm/rpmbuild/libzypp-6.33.4/build>
-I/usr/include/rpm -I/usr/include/hal -I/usr/include/dbus-1.0
-I/usr/lib64/dbus-1.0/include
-I<http://river.suse.de/job/libzypp-11.2/ws/rpm/rpmbuild/libzypp-6.33.4/build/zypp>
-DZYPP_BASE_LOGGER_LOGGROUP=\"zypp\" -o CMakeFiles/zypp.dir/CheckSum.cc.o -c
<http://river.suse.de/job/libzypp-11.2/ws/rpm/rpmbuild/libzypp-6.33.4/zypp/CheckSum.cc>
/usr/bin/cmake -E cmake_progress_report
<http://river.suse.de/job/libzypp-11.2/ws/rpm/rpmbuild/libzypp-6.33.4/build/CMakeFiles>
32
[ 52%] Building CXX object zypp/CMakeFiles/zypp.dir/Date.cc.o
cd
<http://river.suse.de/job/libzypp-11.2/ws/rpm/rpmbuild/libzypp-6.33.4/build/zypp>
&& /opt/icecream/bin/g++ -Dzypp_EXPORTS -D_FILE_OFFSET_BITS=64
-DVERSION=\"6.33.4\" -D_RPM_4_4_COMPAT -DLOCALEDIR=\"/usr/share/locale\"
-DTEXTDOMAIN=\"zypp\" -O2 -g -m64 -fmessage-length=0 -D_FORTIFY_SOURCE=2
-fstack-protector -funwind-tables -fasynchronous-unwind-tables -fPIC -g -Wall
-Werror=format-security -Woverloaded-virtual -Wnon-virtual-dtor -Wl,-as-needed
-O2 -g -m64 -fmessage-length=0 -D_FORTIFY_SOURCE=2 -fstack-protector
-funwind-tables -fasynchronous-unwind-tables -fPIC -g -Wall
-Werror=format-security -Woverloaded-virtual -Wnon-virtual-dtor -Wl,-as-needed
-O3 -fPIC
-I<http://river.suse.de/job/libzypp-11.2/ws/rpm/rpmbuild/libzypp-6.33.4>
-I<http://river.suse.de/job/libzypp-11.2/ws/rpm/rpmbuild/libzypp-6.33.4/build>
-I/usr/include/rpm -I/usr/include/hal -I/usr/include/dbus-1.0
-I/usr/lib64/dbus-1.0/include
-I<http://river.suse.de/job/libzypp-11.2/ws/rpm/rpmbuild/libzypp-6.33.4/build/zypp>
-DZYPP_BASE_LOGGER_LOGGROUP=\"zypp\" -o CMakeFiles/zypp.dir/Date.cc.o -c
<http://river.suse.de/job/libzypp-11.2/ws/rpm/rpmbuild/libzypp-6.33.4/zypp/Date.cc>
/usr/bin/cmake -E cmake_progress_report
<http://river.suse.de/job/libzypp-11.2/ws/rpm/rpmbuild/libzypp-6.33.4/build/CMakeFiles>

[ 52%] Building CXX object zypp/CMakeFiles/zypp.dir/Dep.cc.o
cd
<http://river.suse.de/job/libzypp-11.2/ws/rpm/rpmbuild/libzypp-6.33.4/build/zypp>
&& /opt/icecream/bin/g++ -Dzypp_EXPORTS -D_FILE_OFFSET_BITS=64
-DVERSION=\"6.33.4\" -D_RPM_4_4_COMPAT -DLOCALEDIR=\"/usr/share/locale\"
-DTEXTDOMAIN=\"zypp\" -O2 -g -m64 -fmessage-length=0 -D_FORTIFY_SOURCE=2
-fstack-protector -funwind-tables -fasynchronous-unwind-tables -fPIC -g -Wall
-Werror=format-security -Woverloaded-virtual -Wnon-virtual-dtor -Wl,-as-needed
-O2 -g -m64 -fmessage-length=0 -D_FORTIFY_SOURCE=2 -fstack-protector
-funwind-tables -fasynchronous-unwind-tables -fPIC -g -Wall
-Werror=format-security -Woverloaded-virtual -Wnon-virtual-dtor -Wl,-as-needed
-O3 -fPIC
-I<http://river.suse.de/job/libzypp-11.2/ws/rpm/rpmbuild/libzypp-6.33.4>
-I<http://river.suse.de/job/libzypp-11.2/ws/rpm/rpmbuild/libzypp-6.33.4/build>
-I/usr/include/rpm -I/usr/include/hal -I/usr/include/dbus-1.0
-I/usr/lib64/dbus-1.0/include
-I<http://river.suse.de/job/libzypp-11.2/ws/rpm/rpmbuild/libzypp-6.33.4/build/zypp>
-DZYPP_BASE_LOGGER_LOGGROUP=\"zypp\" -o CMakeFiles/zypp.dir/Dep.cc.o -c
<http://river.suse.de/job/libzypp-11.2/ws/rpm/rpmbuild/libzypp-6.33.4/zypp/Dep.cc>
/usr/bin/cmake -E cmake_progress_report
<http://river.suse.de/job/libzypp-11.2/ws/rpm/rpmbuild/libzypp-6.33.4/build/CMakeFiles>

[ 52%] Building CXX object zypp/CMakeFiles/zypp.dir/Digest.cc.o
cd
<http://river.suse.de/job/libzypp-11.2/ws/rpm/rpmbuild/libzypp-6.33.4/build/zypp>
&& /opt/icecream/bin/g++ -Dzypp_EXPORTS -D_FILE_OFFSET_BITS=64
-DVERSION=\"6.33.4\" -D_RPM_4_4_COMPAT -DLOCALEDIR=\"/usr/share/locale\"
-DTEXTDOMAIN=\"zypp\" -O2 -g -m64 -fmessage-length=0 -D_FORTIFY_SOURCE=2
-fstack-protector -funwind-tables -fasynchronous-unwind-tables -fPIC -g -Wall
-Werror=format-security -Woverloaded-virtual -Wnon-virtual-dtor -Wl,-as-needed
-O2 -g -m64 -fmessage-length=0 -D_FORTIFY_SOURCE=2 -fstack-protector
-funwind-tables -fasynchronous-unwind-tables -fPIC -g -Wall
-Werror=format-security -Woverloaded-virtual -Wnon-virtual-dtor -Wl,-as-needed
-O3 -fPIC
-I<http://river.suse.de/job/libzypp-11.2/ws/rpm/rpmbuild/libzypp-6.33.4>
-I<http://river.suse.de/job/libzypp-11.2/ws/rpm/rpmbuild/libzypp-6.33.4/build>
-I/usr/include/rpm -I/usr/include/hal -I/usr/include/dbus-1.0
-I/usr/lib64/dbus-1.0/include
-I<http://river.suse.de/job/libzypp-11.2/ws/rpm/rpmbuild/libzypp-6.33.4/build/zypp>
-DZYPP_BASE_LOGGER_LOGGROUP=\"zypp\" -o CMakeFiles/zypp.dir/Digest.cc.o -c
<http://river.suse.de/job/libzypp-11.2/ws/rpm/rpmbuild/libzypp-6.33.4/zypp/Digest.cc>
/usr/bin/cmake -E cmake_progress_report
<http://river.suse.de/job/libzypp-11.2/ws/rpm/rpmbuild/libzypp-6.33.4/build/CMakeFiles>

[ 52%] Building CXX object zypp/CMakeFiles/zypp.dir/DiskUsage.cc.o
cd
<http://river.suse.de/job/libzypp-11.2/ws/rpm/rpmbuild/libzypp-6.33.4/build/zypp>
&& /opt/icecream/bin/g++ -Dzypp_EXPORTS -D_FILE_OFFSET_BITS=64
-DVERSION=\"6.33.4\" -D_RPM_4_4_COMPAT -DLOCALEDIR=\"/usr/share/locale\"
-DTEXTDOMAIN=\"zypp\" -O2 -g -m64 -fmessage-length=0 -D_FORTIFY_SOURCE=2
-fstack-protector -funwind-tables -fasynchronous-unwind-tables -fPIC -g -Wall
-Werror=format-security -Woverloaded-virtual -Wnon-virtual-dtor -Wl,-as-needed
-O2 -g -m64 -fmessage-length=0 -D_FORTIFY_SOURCE=2 -fstack-protector
-funwind-tables -fasynchronous-unwind-tables -fPIC -g -Wall
-Werror=format-security -Woverloaded-virtual -Wnon-virtual-dtor -Wl,-as-needed
-O3 -fPIC
-I<http://river.suse.de/job/libzypp-11.2/ws/rpm/rpmbuild/libzypp-6.33.4>
-I<http://river.suse.de/job/libzypp-11.2/ws/rpm/rpmbuild/libzypp-6.33.4/build>
-I/usr/include/rpm -I/usr/include/hal -I/usr/include/dbus-1.0
-I/usr/lib64/dbus-1.0/include
-I<http://river.suse.de/job/libzypp-11.2/ws/rpm/rpmbuild/libzypp-6.33.4/build/zypp>
-DZYPP_BASE_LOGGER_LOGGROUP=\"zypp\" -o CMakeFiles/zypp.dir/DiskUsage.cc.o
-c
<http://river.suse.de/job/libzypp-11.2/ws/rpm/rpmbuild/libzypp-6.33.4/zypp/DiskUsage.cc>
/usr/bin/cmake -E cmake_progress_report
<http://river.suse.de/job/libzypp-11.2/ws/rpm/rpmbuild/libzypp-6.33.4/build/CMakeFiles>
33
[ 54%] Building CXX object zypp/CMakeFiles/zypp.dir/DiskUsageCounter.cc.o
cd
<http://river.suse.de/job/libzypp-11.2/ws/rpm/rpmbuild/libzypp-6.33.4/build/zypp>
&& /opt/icecream/bin/g++ -Dzypp_EXPORTS -D_FILE_OFFSET_BITS=64
-DVERSION=\"6.33.4\" -D_RPM_4_4_COMPAT -DLOCALEDIR=\"/usr/share/locale\"
-DTEXTDOMAIN=\"zypp\" -O2 -g -m64 -fmessage-length=0 -D_FORTIFY_SOURCE=2
-fstack-protector -funwind-tables -fasynchronous-unwind-tables -fPIC -g -Wall
-Werror=format-security -Woverloaded-virtual -Wnon-virtual-dtor -Wl,-as-needed
-O2 -g -m64 -fmessage-length=0 -D_FORTIFY_SOURCE=2 -fstack-protector
-funwind-tables -fasynchronous-unwind-tables -fPIC -g -Wall
-Werror=format-security -Woverloaded-virtual -Wnon-virtual-dtor -Wl,-as-needed
-O3 -fPIC
-I<http://river.suse.de/job/libzypp-11.2/ws/rpm/rpmbuild/libzypp-6.33.4>
-I<http://river.suse.de/job/libzypp-11.2/ws/rpm/rpmbuild/libzypp-6.33.4/build>
-I/usr/include/rpm -I/usr/include/hal -I/usr/include/dbus-1.0
-I/usr/lib64/dbus-1.0/include
-I<http://river.suse.de/job/libzypp-11.2/ws/rpm/rpmbuild/libzypp-6.33.4/build/zypp>
-DZYPP_BASE_LOGGER_LOGGROUP=\"zypp\" -o
CMakeFiles/zypp.dir/DiskUsageCounter.cc.o -c
<http://river.suse.de/job/libzypp-11.2/ws/rpm/rpmbuild/libzypp-6.33.4/zypp/DiskUsageCounter.cc>
/usr/bin/cmake -E cmake_progress_report
<http://river.suse.de/job/libzypp-11.2/ws/rpm/rpmbuild/libzypp-6.33.4/build/CMakeFiles>

[ 54%] Building CXX object zypp/CMakeFiles/zypp.dir/DownloadMode.cc.o
cd
<http://river.suse.de/job/libzypp-11.2/ws/rpm/rpmbuild/libzypp-6.33.4/build/zypp>
&& /opt/icecream/bin/g++ -Dzypp_EXPORTS -D_FILE_OFFSET_BITS=64
-DVERSION=\"6.33.4\" -D_RPM_4_4_COMPAT -DLOCALEDIR=\"/usr/share/locale\"
-DTEXTDOMAIN=\"zypp\" -O2 -g -m64 -fmessage-length=0 -D_FORTIFY_SOURCE=2
-fstack-protector -funwind-tables -fasynchronous-unwind-tables -fPIC -g -Wall
-Werror=format-security -Woverloaded-virtual -Wnon-virtual-dtor -Wl,-as-needed
-O2 -g -m64 -fmessage-length=0 -D_FORTIFY_SOURCE=2 -fstack-protector
-funwind-tables -fasynchronous-unwind-tables -fPIC -g -Wall
-Werror=format-security -Woverloaded-virtual -Wnon-virtual-dtor -Wl,-as-needed
-O3 -fPIC
-I<http://river.suse.de/job/libzypp-11.2/ws/rpm/rpmbuild/libzypp-6.33.4>
-I<http://river.suse.de/job/libzypp-11.2/ws/rpm/rpmbuild/libzypp-6.33.4/build>
-I/usr/include/rpm -I/usr/include/hal -I/usr/include/dbus-1.0
-I/usr/lib64/dbus-1.0/include
-I<http://river.suse.de/job/libzypp-11.2/ws/rpm/rpmbuild/libzypp-6.33.4/build/zypp>
-DZYPP_BASE_LOGGER_LOGGROUP=\"zypp\" -o
CMakeFiles/zypp.dir/DownloadMode.cc.o -c
<http://river.suse.de/job/libzypp-11.2/ws/rpm/rpmbuild/libzypp-6.33.4/zypp/DownloadMode.cc>
/usr/bin/cmake -E cmake_progress_report
<http://river.suse.de/job/libzypp-11.2/ws/rpm/rpmbuild/libzypp-6.33.4/build/CMakeFiles>

[ 54%] Building CXX object zypp/CMakeFiles/zypp.dir/Edition.cc.o
cd
<http://river.suse.de/job/libzypp-11.2/ws/rpm/rpmbuild/libzypp-6.33.4/build/zypp>
&& /opt/icecream/bin/g++ -Dzypp_EXPORTS -D_FILE_OFFSET_BITS=64
-DVERSION=\"6.33.4\" -D_RPM_4_4_COMPAT -DLOCALEDIR=\"/usr/share/locale\"
-DTEXTDOMAIN=\"zypp\" -O2 -g -m64 -fmessage-length=0 -D_FORTIFY_SOURCE=2
-fstack-protector -funwind-tables -fasynchronous-unwind-tables -fPIC -g -Wall
-Werror=format-security -Woverloaded-virtual -Wnon-virtual-dtor -Wl,-as-needed
-O2 -g -m64 -fmessage-length=0 -D_FORTIFY_SOURCE=2 -fstack-protector
-funwind-tables -fasynchronous-unwind-tables -fPIC -g -Wall
-Werror=format-security -Woverloaded-virtual -Wnon-virtual-dtor -Wl,-as-needed
-O3 -fPIC
-I<http://river.suse.de/job/libzypp-11.2/ws/rpm/rpmbuild/libzypp-6.33.4>
-I<http://river.suse.de/job/libzypp-11.2/ws/rpm/rpmbuild/libzypp-6.33.4/build>
-I/usr/include/rpm -I/usr/include/hal -I/usr/include/dbus-1.0
-I/usr/lib64/dbus-1.0/include
-I<http://river.suse.de/job/libzypp-11.2/ws/rpm/rpmbuild/libzypp-6.33.4/build/zypp>
-DZYPP_BASE_LOGGER_LOGGROUP=\"zypp\" -o CMakeFiles/zypp.dir/Edition.cc.o -c
<http://river.suse.de/job/libzypp-11.2/ws/rpm/rpmbuild/libzypp-6.33.4/zypp/Edition.cc>
/usr/bin/cmake -E cmake_progress_report
<http://river.suse.de/job/libzypp-11.2/ws/rpm/rpmbuild/libzypp-6.33.4/build/CMakeFiles>

[ 54%] Building CXX object zypp/CMakeFiles/zypp.dir/ExternalProgram.cc.o
cd
<http://river.suse.de/job/libzypp-11.2/ws/rpm/rpmbuild/libzypp-6.33.4/build/zypp>
&& /opt/icecream/bin/g++ -Dzypp_EXPORTS -D_FILE_OFFSET_BITS=64
-DVERSION=\"6.33.4\" -D_RPM_4_4_COMPAT -DLOCALEDIR=\"/usr/share/locale\"
-DTEXTDOMAIN=\"zypp\" -O2 -g -m64 -fmessage-length=0 -D_FORTIFY_SOURCE=2
-fstack-protector -funwind-tables -fasynchronous-unwind-tables -fPIC -g -Wall
-Werror=format-security -Woverloaded-virtual -Wnon-virtual-dtor -Wl,-as-needed
-O2 -g -m64 -fmessage-length=0 -D_FORTIFY_SOURCE=2 -fstack-protector
-funwind-tables -fasynchronous-unwind-tables -fPIC -g -Wall
-Werror=format-security -Woverloaded-virtual -Wnon-virtual-dtor -Wl,-as-needed
-O3 -fPIC
-I<http://river.suse.de/job/libzypp-11.2/ws/rpm/rpmbuild/libzypp-6.33.4>
-I<http://river.suse.de/job/libzypp-11.2/ws/rpm/rpmbuild/libzypp-6.33.4/build>
-I/usr/include/rpm -I/usr/include/hal -I/usr/include/dbus-1.0
-I/usr/lib64/dbus-1.0/include
-I<http://river.suse.de/job/libzypp-11.2/ws/rpm/rpmbuild/libzypp-6.33.4/build/zypp>
-DZYPP_BASE_LOGGER_LOGGROUP=\"zypp\" -o
CMakeFiles/zypp.dir/ExternalProgram.cc.o -c
<http://river.suse.de/job/libzypp-11.2/ws/rpm/rpmbuild/libzypp-6.33.4/zypp/ExternalProgram.cc>
<http://river.suse.de/job/libzypp-11.2/ws/rpm/rpmbuild/libzypp-6.33.4/zypp/ExternalProgram.cc>:
In member function 'void zypp::ExternalProgram::start_program(const char*
const*, const std::map<std::basic_string<char, std::char_traits<char>,
std::allocator<char> >, std::basic_string<char, std::char_traits<char>,
std::allocator<char> >, std::less<std::basic_string<char,
std::char_traits<char>, std::allocator<char> > >,
std::allocator<std::pair<const std::basic_string<char, std::char_traits<char>,
std::allocator<char> >, std::basic_string<char, std::char_traits<char>,
std::allocator<char> > > > >&, zypp::ExternalProgram::Stderr_Disposition, int,
bool, const char*)':
<http://river.suse.de/job/libzypp-11.2/ws/rpm/rpmbuild/libzypp-6.33.4/zypp/ExternalProgram.cc>:267:
warning: ignoring return value of 'int ttyname_r(int, char*, size_t)',
declared with attribute warn_unused_result
/usr/bin/cmake -E cmake_progress_report
<http://river.suse.de/job/libzypp-11.2/ws/rpm/rpmbuild/libzypp-6.33.4/build/CMakeFiles>
34
[ 55%] Building CXX object zypp/CMakeFiles/zypp.dir/Fetcher.cc.o
cd
<http://river.suse.de/job/libzypp-11.2/ws/rpm/rpmbuild/libzypp-6.33.4/build/zypp>
&& /opt/icecream/bin/g++ -Dzypp_EXPORTS -D_FILE_OFFSET_BITS=64
-DVERSION=\"6.33.4\" -D_RPM_4_4_COMPAT -DLOCALEDIR=\"/usr/share/locale\"
-DTEXTDOMAIN=\"zypp\" -O2 -g -m64 -fmessage-length=0 -D_FORTIFY_SOURCE=2
-fstack-protector -funwind-tables -fasynchronous-unwind-tables -fPIC -g -Wall
-Werror=format-security -Woverloaded-virtual -Wnon-virtual-dtor -Wl,-as-needed
-O2 -g -m64 -fmessage-length=0 -D_FORTIFY_SOURCE=2 -fstack-protector
-funwind-tables -fasynchronous-unwind-tables -fPIC -g -Wall
-Werror=format-security -Woverloaded-virtual -Wnon-virtual-dtor -Wl,-as-needed
-O3 -fPIC
-I<http://river.suse.de/job/libzypp-11.2/ws/rpm/rpmbuild/libzypp-6.33.4>
-I<http://river.suse.de/job/libzypp-11.2/ws/rpm/rpmbuild/libzypp-6.33.4/build>
-I/usr/include/rpm -I/usr/include/hal -I/usr/include/dbus-1.0
-I/usr/lib64/dbus-1.0/include
-I<http://river.suse.de/job/libzypp-11.2/ws/rpm/rpmbuild/libzypp-6.33.4/build/zypp>
-DZYPP_BASE_LOGGER_LOGGROUP=\"zypp\" -o CMakeFiles/zypp.dir/Fetcher.cc.o -c
<http://river.suse.de/job/libzypp-11.2/ws/rpm/rpmbuild/libzypp-6.33.4/zypp/Fetcher.cc>
/usr/bin/cmake -E cmake_progress_report
<http://river.suse.de/job/libzypp-11.2/ws/rpm/rpmbuild/libzypp-6.33.4/build/CMakeFiles>

[ 55%] Building CXX object zypp/CMakeFiles/zypp.dir/FileChecker.cc.o
cd
<http://river.suse.de/job/libzypp-11.2/ws/rpm/rpmbuild/libzypp-6.33.4/build/zypp>
&& /opt/icecream/bin/g++ -Dzypp_EXPORTS -D_FILE_OFFSET_BITS=64
-DVERSION=\"6.33.4\" -D_RPM_4_4_COMPAT -DLOCALEDIR=\"/usr/share/locale\"
-DTEXTDOMAIN=\"zypp\" -O2 -g -m64 -fmessage-length=0 -D_FORTIFY_SOURCE=2
-fstack-protector -funwind-tables -fasynchronous-unwind-tables -fPIC -g -Wall
-Werror=format-security -Woverloaded-virtual -Wnon-virtual-dtor -Wl,-as-needed
-O2 -g -m64 -fmessage-length=0 -D_FORTIFY_SOURCE=2 -fstack-protector
-funwind-tables -fasynchronous-unwind-tables -fPIC -g -Wall
-Werror=format-security -Woverloaded-virtual -Wnon-virtual-dtor -Wl,-as-needed
-O3 -fPIC
-I<http://river.suse.de/job/libzypp-11.2/ws/rpm/rpmbuild/libzypp-6.33.4>
-I<http://river.suse.de/job/libzypp-11.2/ws/rpm/rpmbuild/libzypp-6.33.4/build>
-I/usr/include/rpm -I/usr/include/hal -I/usr/include/dbus-1.0
-I/usr/lib64/dbus-1.0/include
-I<http://river.suse.de/job/libzypp-11.2/ws/rpm/rpmbuild/libzypp-6.33.4/build/zypp>
-DZYPP_BASE_LOGGER_LOGGROUP=\"zypp\" -o CMakeFiles/zypp.dir/FileChecker.cc.o
-c
<http://river.suse.de/job/libzypp-11.2/ws/rpm/rpmbuild/libzypp-6.33.4/zypp/FileChecker.cc>
/usr/bin/cmake -E cmake_progress_report
<http://river.suse.de/job/libzypp-11.2/ws/rpm/rpmbuild/libzypp-6.33.4/build/CMakeFiles>

[ 55%] Building CXX object zypp/CMakeFiles/zypp.dir/Glob.cc.o
cd
<http://river.suse.de/job/libzypp-11.2/ws/rpm/rpmbuild/libzypp-6.33.4/build/zypp>
&& /opt/icecream/bin/g++ -Dzypp_EXPORTS -D_FILE_OFFSET_BITS=64
-DVERSION=\"6.33.4\" -D_RPM_4_4_COMPAT -DLOCALEDIR=\"/usr/share/locale\"
-DTEXTDOMAIN=\"zypp\" -O2 -g -m64 -fmessage-length=0 -D_FORTIFY_SOURCE=2
-fstack-protector -funwind-tables -fasynchronous-unwind-tables -fPIC -g -Wall
-Werror=format-security -Woverloaded-virtual -Wnon-virtual-dtor -Wl,-as-needed
-O2 -g -m64 -fmessage-length=0 -D_FORTIFY_SOURCE=2 -fstack-protector
-funwind-tables -fasynchronous-unwind-tables -fPIC -g -Wall
-Werror=format-security -Woverloaded-virtual -Wnon-virtual-dtor -Wl,-as-needed
-O3 -fPIC
-I<http://river.suse.de/job/libzypp-11.2/ws/rpm/rpmbuild/libzypp-6.33.4>
-I<http://river.suse.de/job/libzypp-11.2/ws/rpm/rpmbuild/libzypp-6.33.4/build>
-I/usr/include/rpm -I/usr/include/hal -I/usr/include/dbus-1.0
-I/usr/lib64/dbus-1.0/include
-I<http://river.suse.de/job/libzypp-11.2/ws/rpm/rpmbuild/libzypp-6.33.4/build/zypp>
-DZYPP_BASE_LOGGER_LOGGROUP=\"zypp\" -o CMakeFiles/zypp.dir/Glob.cc.o -c
<http://river.suse.de/job/libzypp-11.2/ws/rpm/rpmbuild/libzypp-6.33.4/zypp/Glob.cc>
/usr/bin/cmake -E cmake_progress_report
<http://river.suse.de/job/libzypp-11.2/ws/rpm/rpmbuild/libzypp-6.33.4/build/CMakeFiles>
35
[ 57%] Building CXX object zypp/CMakeFiles/zypp.dir/HistoryLog.cc.o
cd
<http://river.suse.de/job/libzypp-11.2/ws/rpm/rpmbuild/libzypp-6.33.4/build/zypp>
&& /opt/icecream/bin/g++ -Dzypp_EXPORTS -D_FILE_OFFSET_BITS=64
-DVERSION=\"6.33.4\" -D_RPM_4_4_COMPAT -DLOCALEDIR=\"/usr/share/locale\"
-DTEXTDOMAIN=\"zypp\" -O2 -g -m64 -fmessage-length=0 -D_FORTIFY_SOURCE=2
-fstack-protector -funwind-tables -fasynchronous-unwind-tables -fPIC -g -Wall
-Werror=format-security -Woverloaded-virtual -Wnon-virtual-dtor -Wl,-as-needed
-O2 -g -m64 -fmessage-length=0 -D_FORTIFY_SOURCE=2 -fstack-protector
-funwind-tables -fasynchronous-unwind-tables -fPIC -g -Wall
-Werror=format-security -Woverloaded-virtual -Wnon-virtual-dtor -Wl,-as-needed
-O3 -fPIC
-I<http://river.suse.de/job/libzypp-11.2/ws/rpm/rpmbuild/libzypp-6.33.4>
-I<http://river.suse.de/job/libzypp-11.2/ws/rpm/rpmbuild/libzypp-6.33.4/build>
-I/usr/include/rpm -I/usr/include/hal -I/usr/include/dbus-1.0
-I/usr/lib64/dbus-1.0/include
-I<http://river.suse.de/job/libzypp-11.2/ws/rpm/rpmbuild/libzypp-6.33.4/build/zypp>
-DZYPP_BASE_LOGGER_LOGGROUP=\"zypp\" -o CMakeFiles/zypp.dir/HistoryLog.cc.o
-c
<http://river.suse.de/job/libzypp-11.2/ws/rpm/rpmbuild/libzypp-6.33.4/zypp/HistoryLog.cc>
/usr/bin/cmake -E cmake_progress_report
<http://river.suse.de/job/libzypp-11.2/ws/rpm/rpmbuild/libzypp-6.33.4/build/CMakeFiles>

[ 57%] Building CXX object zypp/CMakeFiles/zypp.dir/HistoryLogData.cc.o
cd
<http://river.suse.de/job/libzypp-11.2/ws/rpm/rpmbuild/libzypp-6.33.4/build/zypp>
&& /opt/icecream/bin/g++ -Dzypp_EXPORTS -D_FILE_OFFSET_BITS=64
-DVERSION=\"6.33.4\" -D_RPM_4_4_COMPAT -DLOCALEDIR=\"/usr/share/locale\"
-DTEXTDOMAIN=\"zypp\" -O2 -g -m64 -fmessage-length=0 -D_FORTIFY_SOURCE=2
-fstack-protector -funwind-tables -fasynchronous-unwind-tables -fPIC -g -Wall
-Werror=format-security -Woverloaded-virtual -Wnon-virtual-dtor -Wl,-as-needed
-O2 -g -m64 -fmessage-length=0 -D_FORTIFY_SOURCE=2 -fstack-protector
-funwind-tables -fasynchronous-unwind-tables -fPIC -g -Wall
-Werror=format-security -Woverloaded-virtual -Wnon-virtual-dtor -Wl,-as-needed
-O3 -fPIC
-I<http://river.suse.de/job/libzypp-11.2/ws/rpm/rpmbuild/libzypp-6.33.4>
-I<http://river.suse.de/job/libzypp-11.2/ws/rpm/rpmbuild/libzypp-6.33.4/build>
-I/usr/include/rpm -I/usr/include/hal -I/usr/include/dbus-1.0
-I/usr/lib64/dbus-1.0/include
-I<http://river.suse.de/job/libzypp-11.2/ws/rpm/rpmbuild/libzypp-6.33.4/build/zypp>
-DZYPP_BASE_LOGGER_LOGGROUP=\"zypp\" -o
CMakeFiles/zypp.dir/HistoryLogData.cc.o -c
<http://river.suse.de/job/libzypp-11.2/ws/rpm/rpmbuild/libzypp-6.33.4/zypp/HistoryLogData.cc>
/usr/bin/cmake -E cmake_progress_report
<http://river.suse.de/job/libzypp-11.2/ws/rpm/rpmbuild/libzypp-6.33.4/build/CMakeFiles>

[ 57%] Building CXX object zypp/CMakeFiles/zypp.dir/IdString.cc.o
cd
<http://river.suse.de/job/libzypp-11.2/ws/rpm/rpmbuild/libzypp-6.33.4/build/zypp>
&& /opt/icecream/bin/g++ -Dzypp_EXPORTS -D_FILE_OFFSET_BITS=64
-DVERSION=\"6.33.4\" -D_RPM_4_4_COMPAT -DLOCALEDIR=\"/usr/share/locale\"
-DTEXTDOMAIN=\"zypp\" -O2 -g -m64 -fmessage-length=0 -D_FORTIFY_SOURCE=2
-fstack-protector -funwind-tables -fasynchronous-unwind-tables -fPIC -g -Wall
-Werror=format-security -Woverloaded-virtual -Wnon-virtual-dtor -Wl,-as-needed
-O2 -g -m64 -fmessage-length=0 -D_FORTIFY_SOURCE=2 -fstack-protector
-funwind-tables -fasynchronous-unwind-tables -fPIC -g -Wall
-Werror=format-security -Woverloaded-virtual -Wnon-virtual-dtor -Wl,-as-needed
-O3 -fPIC
-I<http://river.suse.de/job/libzypp-11.2/ws/rpm/rpmbuild/libzypp-6.33.4>
-I<http://river.suse.de/job/libzypp-11.2/ws/rpm/rpmbuild/libzypp-6.33.4/build>
-I/usr/include/rpm -I/usr/include/hal -I/usr/include/dbus-1.0
-I/usr/lib64/dbus-1.0/include
-I<http://river.suse.de/job/libzypp-11.2/ws/rpm/rpmbuild/libzypp-6.33.4/build/zypp>
-DZYPP_BASE_LOGGER_LOGGROUP=\"zypp\" -o CMakeFiles/zypp.dir/IdString.cc.o -c
<http://river.suse.de/job/libzypp-11.2/ws/rpm/rpmbuild/libzypp-6.33.4/zypp/IdString.cc>
ICECC[8749] 07:49:04: got exception 14 (10.10.4.228)
/usr/bin/cmake -E cmake_progress_report
<http://river.suse.de/job/libzypp-11.2/ws/rpm/rpmbuild/libzypp-6.33.4/build/CMakeFiles>

[ 57%] Building CXX object zypp/CMakeFiles/zypp.dir/InstanceId.cc.o
cd
<http://river.suse.de/job/libzypp-11.2/ws/rpm/rpmbuild/libzypp-6.33.4/build/zypp>
&& /opt/icecream/bin/g++ -Dzypp_EXPORTS -D_FILE_OFFSET_BITS=64
-DVERSION=\"6.33.4\" -D_RPM_4_4_COMPAT -DLOCALEDIR=\"/usr/share/locale\"
-DTEXTDOMAIN=\"zypp\" -O2 -g -m64 -fmessage-length=0 -D_FORTIFY_SOURCE=2
-fstack-protector -funwind-tables -fasynchronous-unwind-tables -fPIC -g -Wall
-Werror=format-security -Woverloaded-virtual -Wnon-virtual-dtor -Wl,-as-needed
-O2 -g -m64 -fmessage-length=0 -D_FORTIFY_SOURCE=2 -fstack-protector
-funwind-tables -fasynchronous-unwind-tables -fPIC -g -Wall
-Werror=format-security -Woverloaded-virtual -Wnon-virtual-dtor -Wl,-as-needed
-O3 -fPIC
-I<http://river.suse.de/job/libzypp-11.2/ws/rpm/rpmbuild/libzypp-6.33.4>
-I<http://river.suse.de/job/libzypp-11.2/ws/rpm/rpmbuild/libzypp-6.33.4/build>
-I/usr/include/rpm -I/usr/include/hal -I/usr/include/dbus-1.0
-I/usr/lib64/dbus-1.0/include
-I<http://river.suse.de/job/libzypp-11.2/ws/rpm/rpmbuild/libzypp-6.33.4/build/zypp>
-DZYPP_BASE_LOGGER_LOGGROUP=\"zypp\" -o CMakeFiles/zypp.dir/InstanceId.cc.o
-c
<http://river.suse.de/job/libzypp-11.2/ws/rpm/rpmbuild/libzypp-6.33.4/zypp/InstanceId.cc>
ICECC[8777] 07:49:15: no server found behind given hostname 10.10.11.103:10245
ICECC[8777] 07:49:15: got exception 2 (10.10.11.103)
/usr/bin/cmake -E cmake_progress_report
<http://river.suse.de/job/libzypp-11.2/ws/rpm/rpmbuild/libzypp-6.33.4/build/CMakeFiles>
36
[ 59%] Building CXX object zypp/CMakeFiles/zypp.dir/KeyRing.cc.o
cd
<http://river.suse.de/job/libzypp-11.2/ws/rpm/rpmbuild/libzypp-6.33.4/build/zypp>
&& /opt/icecream/bin/g++ -Dzypp_EXPORTS -D_FILE_OFFSET_BITS=64
-DVERSION=\"6.33.4\" -D_RPM_4_4_COMPAT -DLOCALEDIR=\"/usr/share/locale\"
-DTEXTDOMAIN=\"zypp\" -O2 -g -m64 -fmessage-length=0 -D_FORTIFY_SOURCE=2
-fstack-protector -funwind-tables -fasynchronous-unwind-tables -fPIC -g -Wall
-Werror=format-security -Woverloaded-virtual -Wnon-virtual-dtor -Wl,-as-needed
-O2 -g -m64 -fmessage-length=0 -D_FORTIFY_SOURCE=2 -fstack-protector
-funwind-tables -fasynchronous-unwind-tables -fPIC -g -Wall
-Werror=format-security -Woverloaded-virtual -Wnon-virtual-dtor -Wl,-as-needed
-O3 -fPIC
-I<http://river.suse.de/job/libzypp-11.2/ws/rpm/rpmbuild/libzypp-6.33.4>
-I<http://river.suse.de/job/libzypp-11.2/ws/rpm/rpmbuild/libzypp-6.33.4/build>
-I/usr/include/rpm -I/usr/include/hal -I/usr/include/dbus-1.0
-I/usr/lib64/dbus-1.0/include
-I<http://river.suse.de/job/libzypp-11.2/ws/rpm/rpmbuild/libzypp-6.33.4/build/zypp>
-DZYPP_BASE_LOGGER_LOGGROUP=\"zypp\" -o CMakeFiles/zypp.dir/KeyRing.cc.o -c
<http://river.suse.de/job/libzypp-11.2/ws/rpm/rpmbuild/libzypp-6.33.4/zypp/KeyRing.cc>
/usr/bin/cmake -E cmake_progress_report
<http://river.suse.de/job/libzypp-11.2/ws/rpm/rpmbuild/libzypp-6.33.4/build/CMakeFiles>

[ 59%] Building CXX object zypp/CMakeFiles/zypp.dir/Locks.cc.o
cd
<http://river.suse.de/job/libzypp-11.2/ws/rpm/rpmbuild/libzypp-6.33.4/build/zypp>
&& /opt/icecream/bin/g++ -Dzypp_EXPORTS -D_FILE_OFFSET_BITS=64
-DVERSION=\"6.33.4\" -D_RPM_4_4_COMPAT -DLOCALEDIR=\"/usr/share/locale\"
-DTEXTDOMAIN=\"zypp\" -O2 -g -m64 -fmessage-length=0 -D_FORTIFY_SOURCE=2
-fstack-protector -funwind-tables -fasynchronous-unwind-tables -fPIC -g -Wall
-Werror=format-security -Woverloaded-virtual -Wnon-virtual-dtor -Wl,-as-needed
-O2 -g -m64 -fmessage-length=0 -D_FORTIFY_SOURCE=2 -fstack-protector
-funwind-tables -fasynchronous-unwind-tables -fPIC -g -Wall
-Werror=format-security -Woverloaded-virtual -Wnon-virtual-dtor -Wl,-as-needed
-O3 -fPIC
-I<http://river.suse.de/job/libzypp-11.2/ws/rpm/rpmbuild/libzypp-6.33.4>
-I<http://river.suse.de/job/libzypp-11.2/ws/rpm/rpmbuild/libzypp-6.33.4/build>
-I/usr/include/rpm -I/usr/include/hal -I/usr/include/dbus-1.0
-I/usr/lib64/dbus-1.0/include
-I<http://river.suse.de/job/libzypp-11.2/ws/rpm/rpmbuild/libzypp-6.33.4/build/zypp>
-DZYPP_BASE_LOGGER_LOGGROUP=\"zypp\" -o CMakeFiles/zypp.dir/Locks.cc.o -c
<http://river.suse.de/job/libzypp-11.2/ws/rpm/rpmbuild/libzypp-6.33.4/zypp/Locks.cc>
/usr/bin/cmake -E cmake_progress_report
<http://river.suse.de/job/libzypp-11.2/ws/rpm/rpmbuild/libzypp-6.33.4/build/CMakeFiles>

[ 59%] Building CXX object zypp/CMakeFiles/zypp.dir/MediaProducts.cc.o
cd
<http://river.suse.de/job/libzypp-11.2/ws/rpm/rpmbuild/libzypp-6.33.4/build/zypp>
&& /opt/icecream/bin/g++ -Dzypp_EXPORTS -D_FILE_OFFSET_BITS=64
-DVERSION=\"6.33.4\" -D_RPM_4_4_COMPAT -DLOCALEDIR=\"/usr/share/locale\"
-DTEXTDOMAIN=\"zypp\" -O2 -g -m64 -fmessage-length=0 -D_FORTIFY_SOURCE=2
-fstack-protector -funwind-tables -fasynchronous-unwind-tables -fPIC -g -Wall
-Werror=format-security -Woverloaded-virtual -Wnon-virtual-dtor -Wl,-as-needed
-O2 -g -m64 -fmessage-length=0 -D_FORTIFY_SOURCE=2 -fstack-protector
-funwind-tables -fasynchronous-unwind-tables -fPIC -g -Wall
-Werror=format-security -Woverloaded-virtual -Wnon-virtual-dtor -Wl,-as-needed
-O3 -fPIC
-I<http://river.suse.de/job/libzypp-11.2/ws/rpm/rpmbuild/libzypp-6.33.4>
-I<http://river.suse.de/job/libzypp-11.2/ws/rpm/rpmbuild/libzypp-6.33.4/build>
-I/usr/include/rpm -I/usr/include/hal -I/usr/include/dbus-1.0
-I/usr/lib64/dbus-1.0/include
-I<http://river.suse.de/job/libzypp-11.2/ws/rpm/rpmbuild/libzypp-6.33.4/build/zypp>
-DZYPP_BASE_LOGGER_LOGGROUP=\"zypp\" -o
CMakeFiles/zypp.dir/MediaProducts.cc.o -c
<http://river.suse.de/job/libzypp-11.2/ws/rpm/rpmbuild/libzypp-6.33.4/zypp/MediaProducts.cc>
/usr/bin/cmake -E cmake_progress_report
<http://river.suse.de/job/libzypp-11.2/ws/rpm/rpmbuild/libzypp-6.33.4/build/CMakeFiles>
37
[ 60%] Building CXX object zypp/CMakeFiles/zypp.dir/MediaSetAccess.cc.o
cd
<http://river.suse.de/job/libzypp-11.2/ws/rpm/rpmbuild/libzypp-6.33.4/build/zypp>
&& /opt/icecream/bin/g++ -Dzypp_EXPORTS -D_FILE_OFFSET_BITS=64
-DVERSION=\"6.33.4\" -D_RPM_4_4_COMPAT -DLOCALEDIR=\"/usr/share/locale\"
-DTEXTDOMAIN=\"zypp\" -O2 -g -m64 -fmessage-length=0 -D_FORTIFY_SOURCE=2
-fstack-protector -funwind-tables -fasynchronous-unwind-tables -fPIC -g -Wall
-Werror=format-security -Woverloaded-virtual -Wnon-virtual-dtor -Wl,-as-needed
-O2 -g -m64 -fmessage-length=0 -D_FORTIFY_SOURCE=2 -fstack-protector
-funwind-tables -fasynchronous-unwind-tables -fPIC -g -Wall
-Werror=format-security -Woverloaded-virtual -Wnon-virtual-dtor -Wl,-as-needed
-O3 -fPIC
-I<http://river.suse.de/job/libzypp-11.2/ws/rpm/rpmbuild/libzypp-6.33.4>
-I<http://river.suse.de/job/libzypp-11.2/ws/rpm/rpmbuild/libzypp-6.33.4/build>
-I/usr/include/rpm -I/usr/include/hal -I/usr/include/dbus-1.0
-I/usr/lib64/dbus-1.0/include
-I<http://river.suse.de/job/libzypp-11.2/ws/rpm/rpmbuild/libzypp-6.33.4/build/zypp>
-DZYPP_BASE_LOGGER_LOGGROUP=\"zypp\" -o
CMakeFiles/zypp.dir/MediaSetAccess.cc.o -c
<http://river.suse.de/job/libzypp-11.2/ws/rpm/rpmbuild/libzypp-6.33.4/zypp/MediaSetAccess.cc>
/usr/bin/cmake -E cmake_progress_report
<http://river.suse.de/job/libzypp-11.2/ws/rpm/rpmbuild/libzypp-6.33.4/build/CMakeFiles>

[ 60%] Building CXX object zypp/CMakeFiles/zypp.dir/OnMediaLocation.cc.o
cd
<http://river.suse.de/job/libzypp-11.2/ws/rpm/rpmbuild/libzypp-6.33.4/build/zypp>
&& /opt/icecream/bin/g++ -Dzypp_EXPORTS -D_FILE_OFFSET_BITS=64
-DVERSION=\"6.33.4\" -D_RPM_4_4_COMPAT -DLOCALEDIR=\"/usr/share/locale\"
-DTEXTDOMAIN=\"zypp\" -O2 -g -m64 -fmessage-length=0 -D_FORTIFY_SOURCE=2
-fstack-protector -funwind-tables -fasynchronous-unwind-tables -fPIC -g -Wall
-Werror=format-security -Woverloaded-virtual -Wnon-virtual-dtor -Wl,-as-needed
-O2 -g -m64 -fmessage-length=0 -D_FORTIFY_SOURCE=2 -fstack-protector
-funwind-tables -fasynchronous-unwind-tables -fPIC -g -Wall
-Werror=format-security -Woverloaded-virtual -Wnon-virtual-dtor -Wl,-as-needed
-O3 -fPIC
-I<http://river.suse.de/job/libzypp-11.2/ws/rpm/rpmbuild/libzypp-6.33.4>
-I<http://river.suse.de/job/libzypp-11.2/ws/rpm/rpmbuild/libzypp-6.33.4/build>
-I/usr/include/rpm -I/usr/include/hal -I/usr/include/dbus-1.0
-I/usr/lib64/dbus-1.0/include
-I<http://river.suse.de/job/libzypp-11.2/ws/rpm/rpmbuild/libzypp-6.33.4/build/zypp>
-DZYPP_BASE_LOGGER_LOGGROUP=\"zypp\" -o
CMakeFiles/zypp.dir/OnMediaLocation.cc.o -c
<http://river.suse.de/job/libzypp-11.2/ws/rpm/rpmbuild/libzypp-6.33.4/zypp/OnMediaLocation.cc>
/usr/bin/cmake -E cmake_progress_report
<http://river.suse.de/job/libzypp-11.2/ws/rpm/rpmbuild/libzypp-6.33.4/build/CMakeFiles>

[ 60%] Building CXX object zypp/CMakeFiles/zypp.dir/Package.cc.o
cd
<http://river.suse.de/job/libzypp-11.2/ws/rpm/rpmbuild/libzypp-6.33.4/build/zypp>
&& /opt/icecream/bin/g++ -Dzypp_EXPORTS -D_FILE_OFFSET_BITS=64
-DVERSION=\"6.33.4\" -D_RPM_4_4_COMPAT -DLOCALEDIR=\"/usr/share/locale\"
-DTEXTDOMAIN=\"zypp\" -O2 -g -m64 -fmessage-length=0 -D_FORTIFY_SOURCE=2
-fstack-protector -funwind-tables -fasynchronous-unwind-tables -fPIC -g -Wall
-Werror=format-security -Woverloaded-virtual -Wnon-virtual-dtor -Wl,-as-needed
-O2 -g -m64 -fmessage-length=0 -D_FORTIFY_SOURCE=2 -fstack-protector
-funwind-tables -fasynchronous-unwind-tables -fPIC -g -Wall
-Werror=format-security -Woverloaded-virtual -Wnon-virtual-dtor -Wl,-as-needed
-O3 -fPIC
-I<http://river.suse.de/job/libzypp-11.2/ws/rpm/rpmbuild/libzypp-6.33.4>
-I<http://river.suse.de/job/libzypp-11.2/ws/rpm/rpmbuild/libzypp-6.33.4/build>
-I/usr/include/rpm -I/usr/include/hal -I/usr/include/dbus-1.0
-I/usr/lib64/dbus-1.0/include
-I<http://river.suse.de/job/libzypp-11.2/ws/rpm/rpmbuild/libzypp-6.33.4/build/zypp>
-DZYPP_BASE_LOGGER_LOGGROUP=\"zypp\" -o CMakeFiles/zypp.dir/Package.cc.o -c
<http://river.suse.de/job/libzypp-11.2/ws/rpm/rpmbuild/libzypp-6.33.4/zypp/Package.cc>
/usr/bin/cmake -E cmake_progress_report
<http://river.suse.de/job/libzypp-11.2/ws/rpm/rpmbuild/libzypp-6.33.4/build/CMakeFiles>

[ 60%] Building CXX object zypp/CMakeFiles/zypp.dir/Patch.cc.o
cd
<http://river.suse.de/job/libzypp-11.2/ws/rpm/rpmbuild/libzypp-6.33.4/build/zypp>
&& /opt/icecream/bin/g++ -Dzypp_EXPORTS -D_FILE_OFFSET_BITS=64
-DVERSION=\"6.33.4\" -D_RPM_4_4_COMPAT -DLOCALEDIR=\"/usr/share/locale\"
-DTEXTDOMAIN=\"zypp\" -O2 -g -m64 -fmessage-length=0 -D_FORTIFY_SOURCE=2
-fstack-protector -funwind-tables -fasynchronous-unwind-tables -fPIC -g -Wall
-Werror=format-security -Woverloaded-virtual -Wnon-virtual-dtor -Wl,-as-needed
-O2 -g -m64 -fmessage-length=0 -D_FORTIFY_SOURCE=2 -fstack-protector
-funwind-tables -fasynchronous-unwind-tables -fPIC -g -Wall
-Werror=format-security -Woverloaded-virtual -Wnon-virtual-dtor -Wl,-as-needed
-O3 -fPIC
-I<http://river.suse.de/job/libzypp-11.2/ws/rpm/rpmbuild/libzypp-6.33.4>
-I<http://river.suse.de/job/libzypp-11.2/ws/rpm/rpmbuild/libzypp-6.33.4/build>
-I/usr/include/rpm -I/usr/include/hal -I/usr/include/dbus-1.0
-I/usr/lib64/dbus-1.0/include
-I<http://river.suse.de/job/libzypp-11.2/ws/rpm/rpmbuild/libzypp-6.33.4/build/zypp>
-DZYPP_BASE_LOGGER_LOGGROUP=\"zypp\" -o CMakeFiles/zypp.dir/Patch.cc.o -c
<http://river.suse.de/job/libzypp-11.2/ws/rpm/rpmbuild/libzypp-6.33.4/zypp/Patch.cc>
<http://river.suse.de/job/libzypp-11.2/ws/rpm/rpmbuild/libzypp-6.33.4/zypp/Patch.cc>:145:2:
warning: #warning definition of patch contents is poor - needs review
/usr/bin/cmake -E cmake_progress_report
<http://river.suse.de/job/libzypp-11.2/ws/rpm/rpmbuild/libzypp-6.33.4/build/CMakeFiles>
38
[ 62%] Building CXX object zypp/CMakeFiles/zypp.dir/PathInfo.cc.o
cd
<http://river.suse.de/job/libzypp-11.2/ws/rpm/rpmbuild/libzypp-6.33.4/build/zypp>
&& /opt/icecream/bin/g++ -Dzypp_EXPORTS -D_FILE_OFFSET_BITS=64
-DVERSION=\"6.33.4\" -D_RPM_4_4_COMPAT -DLOCALEDIR=\"/usr/share/locale\"
-DTEXTDOMAIN=\"zypp\" -O2 -g -m64 -fmessage-length=0 -D_FORTIFY_SOURCE=2
-fstack-protector -funwind-tables -fasynchronous-unwind-tables -fPIC -g -Wall
-Werror=format-security -Woverloaded-virtual -Wnon-virtual-dtor -Wl,-as-needed
-O2 -g -m64 -fmessage-length=0 -D_FORTIFY_SOURCE=2 -fstack-protector
-funwind-tables -fasynchronous-unwind-tables -fPIC -g -Wall
-Werror=format-security -Woverloaded-virtual -Wnon-virtual-dtor -Wl,-as-needed
-O3 -fPIC
-I<http://river.suse.de/job/libzypp-11.2/ws/rpm/rpmbuild/libzypp-6.33.4>
-I<http://river.suse.de/job/libzypp-11.2/ws/rpm/rpmbuild/libzypp-6.33.4/build>
-I/usr/include/rpm -I/usr/include/hal -I/usr/include/dbus-1.0
-I/usr/lib64/dbus-1.0/include
-I<http://river.suse.de/job/libzypp-11.2/ws/rpm/rpmbuild/libzypp-6.33.4/build/zypp>
-DZYPP_BASE_LOGGER_LOGGROUP=\"zypp\" -o CMakeFiles/zypp.dir/PathInfo.cc.o -c
<http://river.suse.de/job/libzypp-11.2/ws/rpm/rpmbuild/libzypp-6.33.4/zypp/PathInfo.cc>
/usr/bin/cmake -E cmake_progress_report
<http://river.suse.de/job/libzypp-11.2/ws/rpm/rpmbuild/libzypp-6.33.4/build/CMakeFiles>

[ 62%] Building CXX object zypp/CMakeFiles/zypp.dir/Pathname.cc.o
cd
<http://river.suse.de/job/libzypp-11.2/ws/rpm/rpmbuild/libzypp-6.33.4/build/zypp>
&& /opt/icecream/bin/g++ -Dzypp_EXPORTS -D_FILE_OFFSET_BITS=64
-DVERSION=\"6.33.4\" -D_RPM_4_4_COMPAT -DLOCALEDIR=\"/usr/share/locale\"
-DTEXTDOMAIN=\"zypp\" -O2 -g -m64 -fmessage-length=0 -D_FORTIFY_SOURCE=2
-fstack-protector -funwind-tables -fasynchronous-unwind-tables -fPIC -g -Wall
-Werror=format-security -Woverloaded-virtual -Wnon-virtual-dtor -Wl,-as-needed
-O2 -g -m64 -fmessage-length=0 -D_FORTIFY_SOURCE=2 -fstack-protector
-funwind-tables -fasynchronous-unwind-tables -fPIC -g -Wall
-Werror=format-security -Woverloaded-virtual -Wnon-virtual-dtor -Wl,-as-needed
-O3 -fPIC
-I<http://river.suse.de/job/libzypp-11.2/ws/rpm/rpmbuild/libzypp-6.33.4>
-I<http://river.suse.de/job/libzypp-11.2/ws/rpm/rpmbuild/libzypp-6.33.4/build>
-I/usr/include/rpm -I/usr/include/hal -I/usr/include/dbus-1.0
-I/usr/lib64/dbus-1.0/include
-I<http://river.suse.de/job/libzypp-11.2/ws/rpm/rpmbuild/libzypp-6.33.4/build/zypp>
-DZYPP_BASE_LOGGER_LOGGROUP=\"zypp\" -o CMakeFiles/zypp.dir/Pathname.cc.o -c
<http://river.suse.de/job/libzypp-11.2/ws/rpm/rpmbuild/libzypp-6.33.4/zypp/Pathname.cc>
/usr/bin/cmake -E cmake_progress_report
<http://river.suse.de/job/libzypp-11.2/ws/rpm/rpmbuild/libzypp-6.33.4/build/CMakeFiles>

[ 62%] Building CXX object zypp/CMakeFiles/zypp.dir/Pattern.cc.o
cd
<http://river.suse.de/job/libzypp-11.2/ws/rpm/rpmbuild/libzypp-6.33.4/build/zypp>
&& /opt/icecream/bin/g++ -Dzypp_EXPORTS -D_FILE_OFFSET_BITS=64
-DVERSION=\"6.33.4\" -D_RPM_4_4_COMPAT -DLOCALEDIR=\"/usr/share/locale\"
-DTEXTDOMAIN=\"zypp\" -O2 -g -m64 -fmessage-length=0 -D_FORTIFY_SOURCE=2
-fstack-protector -funwind-tables -fasynchronous-unwind-tables -fPIC -g -Wall
-Werror=format-security -Woverloaded-virtual -Wnon-virtual-dtor -Wl,-as-needed
-O2 -g -m64 -fmessage-length=0 -D_FORTIFY_SOURCE=2 -fstack-protector
-funwind-tables -fasynchronous-unwind-tables -fPIC -g -Wall
-Werror=format-security -Woverloaded-virtual -Wnon-virtual-dtor -Wl,-as-needed
-O3 -fPIC
-I<http://river.suse.de/job/libzypp-11.2/ws/rpm/rpmbuild/libzypp-6.33.4>
-I<http://river.suse.de/job/libzypp-11.2/ws/rpm/rpmbuild/libzypp-6.33.4/build>
-I/usr/include/rpm -I/usr/include/hal -I/usr/include/dbus-1.0
-I/usr/lib64/dbus-1.0/include
-I<http://river.suse.de/job/libzypp-11.2/ws/rpm/rpmbuild/libzypp-6.33.4/build/zypp>
-DZYPP_BASE_LOGGER_LOGGROUP=\"zypp\" -o CMakeFiles/zypp.dir/Pattern.cc.o -c
<http://river.suse.de/job/libzypp-11.2/ws/rpm/rpmbuild/libzypp-6.33.4/zypp/Pattern.cc>
/usr/bin/cmake -E cmake_progress_report
<http://river.suse.de/job/libzypp-11.2/ws/rpm/rpmbuild/libzypp-6.33.4/build/CMakeFiles>

[ 62%] Building CXX object zypp/CMakeFiles/zypp.dir/PoolItem.cc.o
cd
<http://river.suse.de/job/libzypp-11.2/ws/rpm/rpmbuild/libzypp-6.33.4/build/zypp>
&& /opt/icecream/bin/g++ -Dzypp_EXPORTS -D_FILE_OFFSET_BITS=64
-DVERSION=\"6.33.4\" -D_RPM_4_4_COMPAT -DLOCALEDIR=\"/usr/share/locale\"
-DTEXTDOMAIN=\"zypp\" -O2 -g -m64 -fmessage-length=0 -D_FORTIFY_SOURCE=2
-fstack-protector -funwind-tables -fasynchronous-unwind-tables -fPIC -g -Wall
-Werror=format-security -Woverloaded-virtual -Wnon-virtual-dtor -Wl,-as-needed
-O2 -g -m64 -fmessage-length=0 -D_FORTIFY_SOURCE=2 -fstack-protector
-funwind-tables -fasynchronous-unwind-tables -fPIC -g -Wall
-Werror=format-security -Woverloaded-virtual -Wnon-virtual-dtor -Wl,-as-needed
-O3 -fPIC
-I<http://river.suse.de/job/libzypp-11.2/ws/rpm/rpmbuild/libzypp-6.33.4>
-I<http://river.suse.de/job/libzypp-11.2/ws/rpm/rpmbuild/libzypp-6.33.4/build>
-I/usr/include/rpm -I/usr/include/hal -I/usr/include/dbus-1.0
-I/usr/lib64/dbus-1.0/include
-I<http://river.suse.de/job/libzypp-11.2/ws/rpm/rpmbuild/libzypp-6.33.4/build/zypp>
-DZYPP_BASE_LOGGER_LOGGROUP=\"zypp\" -o CMakeFiles/zypp.dir/PoolItem.cc.o -c
<http://river.suse.de/job/libzypp-11.2/ws/rpm/rpmbuild/libzypp-6.33.4/zypp/PoolItem.cc>
/usr/bin/cmake -E cmake_progress_report
<http://river.suse.de/job/libzypp-11.2/ws/rpm/rpmbuild/libzypp-6.33.4/build/CMakeFiles>
39
[ 63%] Building CXX object zypp/CMakeFiles/zypp.dir/PoolItemBest.cc.o
cd
<http://river.suse.de/job/libzypp-11.2/ws/rpm/rpmbuild/libzypp-6.33.4/build/zypp>
&& /opt/icecream/bin/g++ -Dzypp_EXPORTS -D_FILE_OFFSET_BITS=64
-DVERSION=\"6.33.4\" -D_RPM_4_4_COMPAT -DLOCALEDIR=\"/usr/share/locale\"
-DTEXTDOMAIN=\"zypp\" -O2 -g -m64 -fmessage-length=0 -D_FORTIFY_SOURCE=2
-fstack-protector -funwind-tables -fasynchronous-unwind-tables -fPIC -g -Wall
-Werror=format-security -Woverloaded-virtual -Wnon-virtual-dtor -Wl,-as-needed
-O2 -g -m64 -fmessage-length=0 -D_FORTIFY_SOURCE=2 -fstack-protector
-funwind-tables -fasynchronous-unwind-tables -fPIC -g -Wall
-Werror=format-security -Woverloaded-virtual -Wnon-virtual-dtor -Wl,-as-needed
-O3 -fPIC
-I<http://river.suse.de/job/libzypp-11.2/ws/rpm/rpmbuild/libzypp-6.33.4>
-I<http://river.suse.de/job/libzypp-11.2/ws/rpm/rpmbuild/libzypp-6.33.4/build>
-I/usr/include/rpm -I/usr/include/hal -I/usr/include/dbus-1.0
-I/usr/lib64/dbus-1.0/include
-I<http://river.suse.de/job/libzypp-11.2/ws/rpm/rpmbuild/libzypp-6.33.4/build/zypp>
-DZYPP_BASE_LOGGER_LOGGROUP=\"zypp\" -o
CMakeFiles/zypp.dir/PoolItemBest.cc.o -c
<http://river.suse.de/job/libzypp-11.2/ws/rpm/rpmbuild/libzypp-6.33.4/zypp/PoolItemBest.cc>
/usr/bin/cmake -E cmake_progress_report
<http://river.suse.de/job/libzypp-11.2/ws/rpm/rpmbuild/libzypp-6.33.4/build/CMakeFiles>

[ 63%] Building CXX object zypp/CMakeFiles/zypp.dir/PoolQuery.cc.o
cd
<http://river.suse.de/job/libzypp-11.2/ws/rpm/rpmbuild/libzypp-6.33.4/build/zypp>
&& /opt/icecream/bin/g++ -Dzypp_EXPORTS -D_FILE_OFFSET_BITS=64
-DVERSION=\"6.33.4\" -D_RPM_4_4_COMPAT -DLOCALEDIR=\"/usr/share/locale\"
-DTEXTDOMAIN=\"zypp\" -O2 -g -m64 -fmessage-length=0 -D_FORTIFY_SOURCE=2
-fstack-protector -funwind-tables -fasynchronous-unwind-tables -fPIC -g -Wall
-Werror=format-security -Woverloaded-virtual -Wnon-virtual-dtor -Wl,-as-needed
-O2 -g -m64 -fmessage-length=0 -D_FORTIFY_SOURCE=2 -fstack-protector
-funwind-tables -fasynchronous-unwind-tables -fPIC -g -Wall
-Werror=format-security -Woverloaded-virtual -Wnon-virtual-dtor -Wl,-as-needed
-O3 -fPIC
-I<http://river.suse.de/job/libzypp-11.2/ws/rpm/rpmbuild/libzypp-6.33.4>
-I<http://river.suse.de/job/libzypp-11.2/ws/rpm/rpmbuild/libzypp-6.33.4/build>
-I/usr/include/rpm -I/usr/include/hal -I/usr/include/dbus-1.0
-I/usr/lib64/dbus-1.0/include
-I<http://river.suse.de/job/libzypp-11.2/ws/rpm/rpmbuild/libzypp-6.33.4/build/zypp>
-DZYPP_BASE_LOGGER_LOGGROUP=\"zypp\" -o CMakeFiles/zypp.dir/PoolQuery.cc.o
-c
<http://river.suse.de/job/libzypp-11.2/ws/rpm/rpmbuild/libzypp-6.33.4/zypp/PoolQuery.cc>
/usr/bin/cmake -E cmake_progress_report
<http://river.suse.de/job/libzypp-11.2/ws/rpm/rpmbuild/libzypp-6.33.4/build/CMakeFiles>

[ 63%] Building CXX object zypp/CMakeFiles/zypp.dir/PoolQueryResult.cc.o
cd
<http://river.suse.de/job/libzypp-11.2/ws/rpm/rpmbuild/libzypp-6.33.4/build/zypp>
&& /opt/icecream/bin/g++ -Dzypp_EXPORTS -D_FILE_OFFSET_BITS=64
-DVERSION=\"6.33.4\" -D_RPM_4_4_COMPAT -DLOCALEDIR=\"/usr/share/locale\"
-DTEXTDOMAIN=\"zypp\" -O2 -g -m64 -fmessage-length=0 -D_FORTIFY_SOURCE=2
-fstack-protector -funwind-tables -fasynchronous-unwind-tables -fPIC -g -Wall
-Werror=format-security -Woverloaded-virtual -Wnon-virtual-dtor -Wl,-as-needed
-O2 -g -m64 -fmessage-length=0 -D_FORTIFY_SOURCE=2 -fstack-protector
-funwind-tables -fasynchronous-unwind-tables -fPIC -g -Wall
-Werror=format-security -Woverloaded-virtual -Wnon-virtual-dtor -Wl,-as-needed
-O3 -fPIC
-I<http://river.suse.de/job/libzypp-11.2/ws/rpm/rpmbuild/libzypp-6.33.4>
-I<http://river.suse.de/job/libzypp-11.2/ws/rpm/rpmbuild/libzypp-6.33.4/build>
-I/usr/include/rpm -I/usr/include/hal -I/usr/include/dbus-1.0
-I/usr/lib64/dbus-1.0/include
-I<http://river.suse.de/job/libzypp-11.2/ws/rpm/rpmbuild/libzypp-6.33.4/build/zypp>
-DZYPP_BASE_LOGGER_LOGGROUP=\"zypp\" -o
CMakeFiles/zypp.dir/PoolQueryResult.cc.o -c
<http://river.suse.de/job/libzypp-11.2/ws/rpm/rpmbuild/libzypp-6.33.4/zypp/PoolQueryResult.cc>
/usr/bin/cmake -E cmake_progress_report
<http://river.suse.de/job/libzypp-11.2/ws/rpm/rpmbuild/libzypp-6.33.4/build/CMakeFiles>
40
[ 65%] Building CXX object zypp/CMakeFiles/zypp.dir/ProblemSolution.cc.o
cd
<http://river.suse.de/job/libzypp-11.2/ws/rpm/rpmbuild/libzypp-6.33.4/build/zypp>
&& /opt/icecream/bin/g++ -Dzypp_EXPORTS -D_FILE_OFFSET_BITS=64
-DVERSION=\"6.33.4\" -D_RPM_4_4_COMPAT -DLOCALEDIR=\"/usr/share/locale\"
-DTEXTDOMAIN=\"zypp\" -O2 -g -m64 -fmessage-length=0 -D_FORTIFY_SOURCE=2
-fstack-protector -funwind-tables -fasynchronous-unwind-tables -fPIC -g -Wall
-Werror=format-security -Woverloaded-virtual -Wnon-virtual-dtor -Wl,-as-needed
-O2 -g -m64 -fmessage-length=0 -D_FORTIFY_SOURCE=2 -fstack-protector
-funwind-tables -fasynchronous-unwind-tables -fPIC -g -Wall
-Werror=format-security -Woverloaded-virtual -Wnon-virtual-dtor -Wl,-as-needed
-O3 -fPIC
-I<http://river.suse.de/job/libzypp-11.2/ws/rpm/rpmbuild/libzypp-6.33.4>
-I<http://river.suse.de/job/libzypp-11.2/ws/rpm/rpmbuild/libzypp-6.33.4/build>
-I/usr/include/rpm -I/usr/include/hal -I/usr/include/dbus-1.0
-I/usr/lib64/dbus-1.0/include
-I<http://river.suse.de/job/libzypp-11.2/ws/rpm/rpmbuild/libzypp-6.33.4/build/zypp>
-DZYPP_BASE_LOGGER_LOGGROUP=\"zypp\" -o
CMakeFiles/zypp.dir/ProblemSolution.cc.o -c
<http://river.suse.de/job/libzypp-11.2/ws/rpm/rpmbuild/libzypp-6.33.4/zypp/ProblemSolution.cc>
/usr/bin/cmake -E cmake_progress_report
<http://river.suse.de/job/libzypp-11.2/ws/rpm/rpmbuild/libzypp-6.33.4/build/CMakeFiles>

[ 65%] Building CXX object zypp/CMakeFiles/zypp.dir/Product.cc.o
cd
<http://river.suse.de/job/libzypp-11.2/ws/rpm/rpmbuild/libzypp-6.33.4/build/zypp>
&& /opt/icecream/bin/g++ -Dzypp_EXPORTS -D_FILE_OFFSET_BITS=64
-DVERSION=\"6.33.4\" -D_RPM_4_4_COMPAT -DLOCALEDIR=\"/usr/share/locale\"
-DTEXTDOMAIN=\"zypp\" -O2 -g -m64 -fmessage-length=0 -D_FORTIFY_SOURCE=2
-fstack-protector -funwind-tables -fasynchronous-unwind-tables -fPIC -g -Wall
-Werror=format-security -Woverloaded-virtual -Wnon-virtual-dtor -Wl,-as-needed
-O2 -g -m64 -fmessage-length=0 -D_FORTIFY_SOURCE=2 -fstack-protector
-funwind-tables -fasynchronous-unwind-tables -fPIC -g -Wall
-Werror=format-security -Woverloaded-virtual -Wnon-virtual-dtor -Wl,-as-needed
-O3 -fPIC
-I<http://river.suse.de/job/libzypp-11.2/ws/rpm/rpmbuild/libzypp-6.33.4>
-I<http://river.suse.de/job/libzypp-11.2/ws/rpm/rpmbuild/libzypp-6.33.4/build>
-I/usr/include/rpm -I/usr/include/hal -I/usr/include/dbus-1.0
-I/usr/lib64/dbus-1.0/include
-I<http://river.suse.de/job/libzypp-11.2/ws/rpm/rpmbuild/libzypp-6.33.4/build/zypp>
-DZYPP_BASE_LOGGER_LOGGROUP=\"zypp\" -o CMakeFiles/zypp.dir/Product.cc.o -c
<http://river.suse.de/job/libzypp-11.2/ws/rpm/rpmbuild/libzypp-6.33.4/zypp/Product.cc>
/usr/bin/cmake -E cmake_progress_report
<http://river.suse.de/job/libzypp-11.2/ws/rpm/rpmbuild/libzypp-6.33.4/build/CMakeFiles>

[ 65%] Building CXX object zypp/CMakeFiles/zypp.dir/ProgressData.cc.o
cd
<http://river.suse.de/job/libzypp-11.2/ws/rpm/rpmbuild/libzypp-6.33.4/build/zypp>
&& /opt/icecream/bin/g++ -Dzypp_EXPORTS -D_FILE_OFFSET_BITS=64
-DVERSION=\"6.33.4\" -D_RPM_4_4_COMPAT -DLOCALEDIR=\"/usr/share/locale\"
-DTEXTDOMAIN=\"zypp\" -O2 -g -m64 -fmessage-length=0 -D_FORTIFY_SOURCE=2
-fstack-protector -funwind-tables -fasynchronous-unwind-tables -fPIC -g -Wall
-Werror=format-security -Woverloaded-virtual -Wnon-virtual-dtor -Wl,-as-needed
-O2 -g -m64 -fmessage-length=0 -D_FORTIFY_SOURCE=2 -fstack-protector
-funwind-tables -fasynchronous-unwind-tables -fPIC -g -Wall
-Werror=format-security -Woverloaded-virtual -Wnon-virtual-dtor -Wl,-as-needed
-O3 -fPIC
-I<http://river.suse.de/job/libzypp-11.2/ws/rpm/rpmbuild/libzypp-6.33.4>
-I<http://river.suse.de/job/libzypp-11.2/ws/rpm/rpmbuild/libzypp-6.33.4/build>
-I/usr/include/rpm -I/usr/include/hal -I/usr/include/dbus-1.0
-I/usr/lib64/dbus-1.0/include
-I<http://river.suse.de/job/libzypp-11.2/ws/rpm/rpmbuild/libzypp-6.33.4/build/zypp>
-DZYPP_BASE_LOGGER_LOGGROUP=\"zypp\" -o
CMakeFiles/zypp.dir/ProgressData.cc.o -c
<http://river.suse.de/job/libzypp-11.2/ws/rpm/rpmbuild/libzypp-6.33.4/zypp/ProgressData.cc>
/usr/bin/cmake -E cmake_progress_report
<http://river.suse.de/job/libzypp-11.2/ws/rpm/rpmbuild/libzypp-6.33.4/build/CMakeFiles>

[ 65%] Building CXX object zypp/CMakeFiles/zypp.dir/ProvideFilePolicy.cc.o
cd
<http://river.suse.de/job/libzypp-11.2/ws/rpm/rpmbuild/libzypp-6.33.4/build/zypp>
&& /opt/icecream/bin/g++ -Dzypp_EXPORTS -D_FILE_OFFSET_BITS=64
-DVERSION=\"6.33.4\" -D_RPM_4_4_COMPAT -DLOCALEDIR=\"/usr/share/locale\"
-DTEXTDOMAIN=\"zypp\" -O2 -g -m64 -fmessage-length=0 -D_FORTIFY_SOURCE=2
-fstack-protector -funwind-tables -fasynchronous-unwind-tables -fPIC -g -Wall
-Werror=format-security -Woverloaded-virtual -Wnon-virtual-dtor -Wl,-as-needed
-O2 -g -m64 -fmessage-length=0 -D_FORTIFY_SOURCE=2 -fstack-protector
-funwind-tables -fasynchronous-unwind-tables -fPIC -g -Wall
-Werror=format-security -Woverloaded-virtual -Wnon-virtual-dtor -Wl,-as-needed
-O3 -fPIC
-I<http://river.suse.de/job/libzypp-11.2/ws/rpm/rpmbuild/libzypp-6.33.4>
-I<http://river.suse.de/job/libzypp-11.2/ws/rpm/rpmbuild/libzypp-6.33.4/build>
-I/usr/include/rpm -I/usr/include/hal -I/usr/include/dbus-1.0
-I/usr/lib64/dbus-1.0/include
-I<http://river.suse.de/job/libzypp-11.2/ws/rpm/rpmbuild/libzypp-6.33.4/build/zypp>
-DZYPP_BASE_LOGGER_LOGGROUP=\"zypp\" -o
CMakeFiles/zypp.dir/ProvideFilePolicy.cc.o -c
<http://river.suse.de/job/libzypp-11.2/ws/rpm/rpmbuild/libzypp-6.33.4/zypp/ProvideFilePolicy.cc>
/usr/bin/cmake -E cmake_progress_report
<http://river.suse.de/job/libzypp-11.2/ws/rpm/rpmbuild/libzypp-6.33.4/build/CMakeFiles>
41
[ 67%] Building CXX object zypp/CMakeFiles/zypp.dir/PublicKey.cc.o
cd
<http://river.suse.de/job/libzypp-11.2/ws/rpm/rpmbuild/libzypp-6.33.4/build/zypp>
&& /opt/icecream/bin/g++ -Dzypp_EXPORTS -D_FILE_OFFSET_BITS=64
-DVERSION=\"6.33.4\" -D_RPM_4_4_COMPAT -DLOCALEDIR=\"/usr/share/locale\"
-DTEXTDOMAIN=\"zypp\" -O2 -g -m64 -fmessage-length=0 -D_FORTIFY_SOURCE=2
-fstack-protector -funwind-tables -fasynchronous-unwind-tables -fPIC -g -Wall
-Werror=format-security -Woverloaded-virtual -Wnon-virtual-dtor -Wl,-as-needed
-O2 -g -m64 -fmessage-length=0 -D_FORTIFY_SOURCE=2 -fstack-protector
-funwind-tables -fasynchronous-unwind-tables -fPIC -g -Wall
-Werror=format-security -Woverloaded-virtual -Wnon-virtual-dtor -Wl,-as-needed
-O3 -fPIC
-I<http://river.suse.de/job/libzypp-11.2/ws/rpm/rpmbuild/libzypp-6.33.4>
-I<http://river.suse.de/job/libzypp-11.2/ws/rpm/rpmbuild/libzypp-6.33.4/build>
-I/usr/include/rpm -I/usr/include/hal -I/usr/include/dbus-1.0
-I/usr/lib64/dbus-1.0/include
-I<http://river.suse.de/job/libzypp-11.2/ws/rpm/rpmbuild/libzypp-6.33.4/build/zypp>
-DZYPP_BASE_LOGGER_LOGGROUP=\"zypp\" -o CMakeFiles/zypp.dir/PublicKey.cc.o
-c
<http://river.suse.de/job/libzypp-11.2/ws/rpm/rpmbuild/libzypp-6.33.4/zypp/PublicKey.cc>
/usr/bin/cmake -E cmake_progress_report
<http://river.suse.de/job/libzypp-11.2/ws/rpm/rpmbuild/libzypp-6.33.4/build/CMakeFiles>

[ 67%] Building CXX object zypp/CMakeFiles/zypp.dir/Range.cc.o
cd
<http://river.suse.de/job/libzypp-11.2/ws/rpm/rpmbuild/libzypp-6.33.4/build/zypp>
&& /opt/icecream/bin/g++ -Dzypp_EXPORTS -D_FILE_OFFSET_BITS=64
-DVERSION=\"6.33.4\" -D_RPM_4_4_COMPAT -DLOCALEDIR=\"/usr/share/locale\"
-DTEXTDOMAIN=\"zypp\" -O2 -g -m64 -fmessage-length=0 -D_FORTIFY_SOURCE=2
-fstack-protector -funwind-tables -fasynchronous-unwind-tables -fPIC -g -Wall
-Werror=format-security -Woverloaded-virtual -Wnon-virtual-dtor -Wl,-as-needed
-O2 -g -m64 -fmessage-length=0 -D_FORTIFY_SOURCE=2 -fstack-protector
-funwind-tables -fasynchronous-unwind-tables -fPIC -g -Wall
-Werror=format-security -Woverloaded-virtual -Wnon-virtual-dtor -Wl,-as-needed
-O3 -fPIC
-I<http://river.suse.de/job/libzypp-11.2/ws/rpm/rpmbuild/libzypp-6.33.4>
-I<http://river.suse.de/job/libzypp-11.2/ws/rpm/rpmbuild/libzypp-6.33.4/build>
-I/usr/include/rpm -I/usr/include/hal -I/usr/include/dbus-1.0
-I/usr/lib64/dbus-1.0/include
-I<http://river.suse.de/job/libzypp-11.2/ws/rpm/rpmbuild/libzypp-6.33.4/build/zypp>
-DZYPP_BASE_LOGGER_LOGGROUP=\"zypp\" -o CMakeFiles/zypp.dir/Range.cc.o -c
<http://river.suse.de/job/libzypp-11.2/ws/rpm/rpmbuild/libzypp-6.33.4/zypp/Range.cc>
/usr/bin/cmake -E cmake_progress_report
<http://river.suse.de/job/libzypp-11.2/ws/rpm/rpmbuild/libzypp-6.33.4/build/CMakeFiles>

[ 67%] Building CXX object zypp/CMakeFiles/zypp.dir/Rel.cc.o
cd
<http://river.suse.de/job/libzypp-11.2/ws/rpm/rpmbuild/libzypp-6.33.4/build/zypp>
&& /opt/icecream/bin/g++ -Dzypp_EXPORTS -D_FILE_OFFSET_BITS=64
-DVERSION=\"6.33.4\" -D_RPM_4_4_COMPAT -DLOCALEDIR=\"/usr/share/locale\"
-DTEXTDOMAIN=\"zypp\" -O2 -g -m64 -fmessage-length=0 -D_FORTIFY_SOURCE=2
-fstack-protector -funwind-tables -fasynchronous-unwind-tables -fPIC -g -Wall
-Werror=format-security -Woverloaded-virtual -Wnon-virtual-dtor -Wl,-as-needed
-O2 -g -m64 -fmessage-length=0 -D_FORTIFY_SOURCE=2 -fstack-protector
-funwind-tables -fasynchronous-unwind-tables -fPIC -g -Wall
-Werror=format-security -Woverloaded-virtual -Wnon-virtual-dtor -Wl,-as-needed
-O3 -fPIC
-I<http://river.suse.de/job/libzypp-11.2/ws/rpm/rpmbuild/libzypp-6.33.4>
-I<http://river.suse.de/job/libzypp-11.2/ws/rpm/rpmbuild/libzypp-6.33.4/build>
-I/usr/include/rpm -I/usr/include/hal -I/usr/include/dbus-1.0
-I/usr/lib64/dbus-1.0/include
-I<http://river.suse.de/job/libzypp-11.2/ws/rpm/rpmbuild/libzypp-6.33.4/build/zypp>
-DZYPP_BASE_LOGGER_LOGGROUP=\"zypp\" -o CMakeFiles/zypp.dir/Rel.cc.o -c
<http://river.suse.de/job/libzypp-11.2/ws/rpm/rpmbuild/libzypp-6.33.4/zypp/Rel.cc>
/usr/bin/cmake -E cmake_progress_report
<http://river.suse.de/job/libzypp-11.2/ws/rpm/rpmbuild/libzypp-6.33.4/build/CMakeFiles>

[ 67%] Building CXX object zypp/CMakeFiles/zypp.dir/RepoInfo.cc.o
cd
<http://river.suse.de/job/libzypp-11.2/ws/rpm/rpmbuild/libzypp-6.33.4/build/zypp>
&& /opt/icecream/bin/g++ -Dzypp_EXPORTS -D_FILE_OFFSET_BITS=64
-DVERSION=\"6.33.4\" -D_RPM_4_4_COMPAT -DLOCALEDIR=\"/usr/share/locale\"
-DTEXTDOMAIN=\"zypp\" -O2 -g -m64 -fmessage-length=0 -D_FORTIFY_SOURCE=2
-fstack-protector -funwind-tables -fasynchronous-unwind-tables -fPIC -g -Wall
-Werror=format-security -Woverloaded-virtual -Wnon-virtual-dtor -Wl,-as-needed
-O2 -g -m64 -fmessage-length=0 -D_FORTIFY_SOURCE=2 -fstack-protector
-funwind-tables -fasynchronous-unwind-tables -fPIC -g -Wall
-Werror=format-security -Woverloaded-virtual -Wnon-virtual-dtor -Wl,-as-needed
-O3 -fPIC
-I<http://river.suse.de/job/libzypp-11.2/ws/rpm/rpmbuild/libzypp-6.33.4>
-I<http://river.suse.de/job/libzypp-11.2/ws/rpm/rpmbuild/libzypp-6.33.4/build>
-I/usr/include/rpm -I/usr/include/hal -I/usr/include/dbus-1.0
-I/usr/lib64/dbus-1.0/include
-I<http://river.suse.de/job/libzypp-11.2/ws/rpm/rpmbuild/libzypp-6.33.4/build/zypp>
-DZYPP_BASE_LOGGER_LOGGROUP=\"zypp\" -o CMakeFiles/zypp.dir/RepoInfo.cc.o -c
<http://river.suse.de/job/libzypp-11.2/ws/rpm/rpmbuild/libzypp-6.33.4/zypp/RepoInfo.cc>
/usr/bin/cmake -E cmake_progress_report
<http://river.suse.de/job/libzypp-11.2/ws/rpm/rpmbuild/libzypp-6.33.4/build/CMakeFiles>
42
[ 68%] Building CXX object zypp/CMakeFiles/zypp.dir/RepoManager.cc.o
cd
<http://river.suse.de/job/libzypp-11.2/ws/rpm/rpmbuild/libzypp-6.33.4/build/zypp>
&& /opt/icecream/bin/g++ -Dzypp_EXPORTS -D_FILE_OFFSET_BITS=64
-DVERSION=\"6.33.4\" -D_RPM_4_4_COMPAT -DLOCALEDIR=\"/usr/share/locale\"
-DTEXTDOMAIN=\"zypp\" -O2 -g -m64 -fmessage-length=0 -D_FORTIFY_SOURCE=2
-fstack-protector -funwind-tables -fasynchronous-unwind-tables -fPIC -g -Wall
-Werror=format-security -Woverloaded-virtual -Wnon-virtual-dtor -Wl,-as-needed
-O2 -g -m64 -fmessage-length=0 -D_FORTIFY_SOURCE=2 -fstack-protector
-funwind-tables -fasynchronous-unwind-tables -fPIC -g -Wall
-Werror=format-security -Woverloaded-virtual -Wnon-virtual-dtor -Wl,-as-needed
-O3 -fPIC
-I<http://river.suse.de/job/libzypp-11.2/ws/rpm/rpmbuild/libzypp-6.33.4>
-I<http://river.suse.de/job/libzypp-11.2/ws/rpm/rpmbuild/libzypp-6.33.4/build>
-I/usr/include/rpm -I/usr/include/hal -I/usr/include/dbus-1.0
-I/usr/lib64/dbus-1.0/include
-I<http://river.suse.de/job/libzypp-11.2/ws/rpm/rpmbuild/libzypp-6.33.4/build/zypp>
-DZYPP_BASE_LOGGER_LOGGROUP=\"zypp\" -o CMakeFiles/zypp.dir/RepoManager.cc.o
-c
<http://river.suse.de/job/libzypp-11.2/ws/rpm/rpmbuild/libzypp-6.33.4/zypp/RepoManager.cc>
/usr/bin/cmake -E cmake_progress_report
<http://river.suse.de/job/libzypp-11.2/ws/rpm/rpmbuild/libzypp-6.33.4/build/CMakeFiles>

[ 68%] Building CXX object zypp/CMakeFiles/zypp.dir/Repository.cc.o
cd
<http://river.suse.de/job/libzypp-11.2/ws/rpm/rpmbuild/libzypp-6.33.4/build/zypp>
&& /opt/icecream/bin/g++ -Dzypp_EXPORTS -D_FILE_OFFSET_BITS=64
-DVERSION=\"6.33.4\" -D_RPM_4_4_COMPAT -DLOCALEDIR=\"/usr/share/locale\"
-DTEXTDOMAIN=\"zypp\" -O2 -g -m64 -fmessage-length=0 -D_FORTIFY_SOURCE=2
-fstack-protector -funwind-tables -fasynchronous-unwind-tables -fPIC -g -Wall
-Werror=format-security -Woverloaded-virtual -Wnon-virtual-dtor -Wl,-as-needed
-O2 -g -m64 -fmessage-length=0 -D_FORTIFY_SOURCE=2 -fstack-protector
-funwind-tables -fasynchronous-unwind-tables -fPIC -g -Wall
-Werror=format-security -Woverloaded-virtual -Wnon-virtual-dtor -Wl,-as-needed
-O3 -fPIC
-I<http://river.suse.de/job/libzypp-11.2/ws/rpm/rpmbuild/libzypp-6.33.4>
-I<http://river.suse.de/job/libzypp-11.2/ws/rpm/rpmbuild/libzypp-6.33.4/build>
-I/usr/include/rpm -I/usr/include/hal -I/usr/include/dbus-1.0
-I/usr/lib64/dbus-1.0/include
-I<http://river.suse.de/job/libzypp-11.2/ws/rpm/rpmbuild/libzypp-6.33.4/build/zypp>
-DZYPP_BASE_LOGGER_LOGGROUP=\"zypp\" -o CMakeFiles/zypp.dir/Repository.cc.o
-c
<http://river.suse.de/job/libzypp-11.2/ws/rpm/rpmbuild/libzypp-6.33.4/zypp/Repository.cc>
/usr/bin/cmake -E cmake_progress_report
<http://river.suse.de/job/libzypp-11.2/ws/rpm/rpmbuild/libzypp-6.33.4/build/CMakeFiles>

[ 68%] Building CXX object zypp/CMakeFiles/zypp.dir/RepoStatus.cc.o
cd
<http://river.suse.de/job/libzypp-11.2/ws/rpm/rpmbuild/libzypp-6.33.4/build/zypp>
&& /opt/icecream/bin/g++ -Dzypp_EXPORTS -D_FILE_OFFSET_BITS=64
-DVERSION=\"6.33.4\" -D_RPM_4_4_COMPAT -DLOCALEDIR=\"/usr/share/locale\"
-DTEXTDOMAIN=\"zypp\" -O2 -g -m64 -fmessage-length=0 -D_FORTIFY_SOURCE=2
-fstack-protector -funwind-tables -fasynchronous-unwind-tables -fPIC -g -Wall
-Werror=format-security -Woverloaded-virtual -Wnon-virtual-dtor -Wl,-as-needed
-O2 -g -m64 -fmessage-length=0 -D_FORTIFY_SOURCE=2 -fstack-protector
-funwind-tables -fasynchronous-unwind-tables -fPIC -g -Wall
-Werror=format-security -Woverloaded-virtual -Wnon-virtual-dtor -Wl,-as-needed
-O3 -fPIC
-I<http://river.suse.de/job/libzypp-11.2/ws/rpm/rpmbuild/libzypp-6.33.4>
-I<http://river.suse.de/job/libzypp-11.2/ws/rpm/rpmbuild/libzypp-6.33.4/build>
-I/usr/include/rpm -I/usr/include/hal -I/usr/include/dbus-1.0
-I/usr/lib64/dbus-1.0/include
-I<http://river.suse.de/job/libzypp-11.2/ws/rpm/rpmbuild/libzypp-6.33.4/build/zypp>
-DZYPP_BASE_LOGGER_LOGGROUP=\"zypp\" -o CMakeFiles/zypp.dir/RepoStatus.cc.o
-c
<http://river.suse.de/job/libzypp-11.2/ws/rpm/rpmbuild/libzypp-6.33.4/zypp/RepoStatus.cc>
/usr/bin/cmake -E cmake_progress_report
<http://river.suse.de/job/libzypp-11.2/ws/rpm/rpmbuild/libzypp-6.33.4/build/CMakeFiles>
43
[ 70%] Building CXX object zypp/CMakeFiles/zypp.dir/ResKind.cc.o
cd
<http://river.suse.de/job/libzypp-11.2/ws/rpm/rpmbuild/libzypp-6.33.4/build/zypp>
&& /opt/icecream/bin/g++ -Dzypp_EXPORTS -D_FILE_OFFSET_BITS=64
-DVERSION=\"6.33.4\" -D_RPM_4_4_COMPAT -DLOCALEDIR=\"/usr/share/locale\"
-DTEXTDOMAIN=\"zypp\" -O2 -g -m64 -fmessage-length=0 -D_FORTIFY_SOURCE=2
-fstack-protector -funwind-tables -fasynchronous-unwind-tables -fPIC -g -Wall
-Werror=format-security -Woverloaded-virtual -Wnon-virtual-dtor -Wl,-as-needed
-O2 -g -m64 -fmessage-length=0 -D_FORTIFY_SOURCE=2 -fstack-protector
-funwind-tables -fasynchronous-unwind-tables -fPIC -g -Wall
-Werror=format-security -Woverloaded-virtual -Wnon-virtual-dtor -Wl,-as-needed
-O3 -fPIC
-I<http://river.suse.de/job/libzypp-11.2/ws/rpm/rpmbuild/libzypp-6.33.4>
-I<http://river.suse.de/job/libzypp-11.2/ws/rpm/rpmbuild/libzypp-6.33.4/build>
-I/usr/include/rpm -I/usr/include/hal -I/usr/include/dbus-1.0
-I/usr/lib64/dbus-1.0/include
-I<http://river.suse.de/job/libzypp-11.2/ws/rpm/rpmbuild/libzypp-6.33.4/build/zypp>
-DZYPP_BASE_LOGGER_LOGGROUP=\"zypp\" -o CMakeFiles/zypp.dir/ResKind.cc.o -c
<http://river.suse.de/job/libzypp-11.2/ws/rpm/rpmbuild/libzypp-6.33.4/zypp/ResKind.cc>
/usr/bin/cmake -E cmake_progress_report
<http://river.suse.de/job/libzypp-11.2/ws/rpm/rpmbuild/libzypp-6.33.4/build/CMakeFiles>

[ 70%] Building CXX object zypp/CMakeFiles/zypp.dir/ResObject.cc.o
cd
<http://river.suse.de/job/libzypp-11.2/ws/rpm/rpmbuild/libzypp-6.33.4/build/zypp>
&& /opt/icecream/bin/g++ -Dzypp_EXPORTS -D_FILE_OFFSET_BITS=64
-DVERSION=\"6.33.4\" -D_RPM_4_4_COMPAT -DLOCALEDIR=\"/usr/share/locale\"
-DTEXTDOMAIN=\"zypp\" -O2 -g -m64 -fmessage-length=0 -D_FORTIFY_SOURCE=2
-fstack-protector -funwind-tables -fasynchronous-unwind-tables -fPIC -g -Wall
-Werror=format-security -Woverloaded-virtual -Wnon-virtual-dtor -Wl,-as-needed
-O2 -g -m64 -fmessage-length=0 -D_FORTIFY_SOURCE=2 -fstack-protector
-funwind-tables -fasynchronous-unwind-tables -fPIC -g -Wall
-Werror=format-security -Woverloaded-virtual -Wnon-virtual-dtor -Wl,-as-needed
-O3 -fPIC
-I<http://river.suse.de/job/libzypp-11.2/ws/rpm/rpmbuild/libzypp-6.33.4>
-I<http://river.suse.de/job/libzypp-11.2/ws/rpm/rpmbuild/libzypp-6.33.4/build>
-I/usr/include/rpm -I/usr/include/hal -I/usr/include/dbus-1.0
-I/usr/lib64/dbus-1.0/include
-I<http://river.suse.de/job/libzypp-11.2/ws/rpm/rpmbuild/libzypp-6.33.4/build/zypp>
-DZYPP_BASE_LOGGER_LOGGROUP=\"zypp\" -o CMakeFiles/zypp.dir/ResObject.cc.o
-c
<http://river.suse.de/job/libzypp-11.2/ws/rpm/rpmbuild/libzypp-6.33.4/zypp/ResObject.cc>
<http://river.suse.de/job/libzypp-11.2/ws/rpm/rpmbuild/libzypp-6.33.4/zypp/ResObject.cc>:99:2:
warning: #warning DUMMY diskusage
/usr/bin/cmake -E cmake_progress_report
<http://river.suse.de/job/libzypp-11.2/ws/rpm/rpmbuild/libzypp-6.33.4/build/CMakeFiles>

[ 70%] Building CXX object zypp/CMakeFiles/zypp.dir/Resolvable.cc.o
cd
<http://river.suse.de/job/libzypp-11.2/ws/rpm/rpmbuild/libzypp-6.33.4/build/zypp>
&& /opt/icecream/bin/g++ -Dzypp_EXPORTS -D_FILE_OFFSET_BITS=64
-DVERSION=\"6.33.4\" -D_RPM_4_4_COMPAT -DLOCALEDIR=\"/usr/share/locale\"
-DTEXTDOMAIN=\"zypp\" -O2 -g -m64 -fmessage-length=0 -D_FORTIFY_SOURCE=2
-fstack-protector -funwind-tables -fasynchronous-unwind-tables -fPIC -g -Wall
-Werror=format-security -Woverloaded-virtual -Wnon-virtual-dtor -Wl,-as-needed
-O2 -g -m64 -fmessage-length=0 -D_FORTIFY_SOURCE=2 -fstack-protector
-funwind-tables -fasynchronous-unwind-tables -fPIC -g -Wall
-Werror=format-security -Woverloaded-virtual -Wnon-virtual-dtor -Wl,-as-needed
-O3 -fPIC
-I<http://river.suse.de/job/libzypp-11.2/ws/rpm/rpmbuild/libzypp-6.33.4>
-I<http://river.suse.de/job/libzypp-11.2/ws/rpm/rpmbuild/libzypp-6.33.4/build>
-I/usr/include/rpm -I/usr/include/hal -I/usr/include/dbus-1.0
-I/usr/lib64/dbus-1.0/include
-I<http://river.suse.de/job/libzypp-11.2/ws/rpm/rpmbuild/libzypp-6.33.4/build/zypp>
-DZYPP_BASE_LOGGER_LOGGROUP=\"zypp\" -o CMakeFiles/zypp.dir/Resolvable.cc.o
-c
<http://river.suse.de/job/libzypp-11.2/ws/rpm/rpmbuild/libzypp-6.33.4/zypp/Resolvable.cc>
ICECC[8951] 07:50:30: got exception 17 (10.10.2.76)
/usr/bin/cmake -E cmake_progress_report
<http://river.suse.de/job/libzypp-11.2/ws/rpm/rpmbuild/libzypp-6.33.4/build/CMakeFiles>

[ 70%] Building CXX object zypp/CMakeFiles/zypp.dir/Resolver.cc.o
cd
<http://river.suse.de/job/libzypp-11.2/ws/rpm/rpmbuild/libzypp-6.33.4/build/zypp>
&& /opt/icecream/bin/g++ -Dzypp_EXPORTS -D_FILE_OFFSET_BITS=64
-DVERSION=\"6.33.4\" -D_RPM_4_4_COMPAT -DLOCALEDIR=\"/usr/share/locale\"
-DTEXTDOMAIN=\"zypp\" -O2 -g -m64 -fmessage-length=0 -D_FORTIFY_SOURCE=2
-fstack-protector -funwind-tables -fasynchronous-unwind-tables -fPIC -g -Wall
-Werror=format-security -Woverloaded-virtual -Wnon-virtual-dtor -Wl,-as-needed
-O2 -g -m64 -fmessage-length=0 -D_FORTIFY_SOURCE=2 -fstack-protector
-funwind-tables -fasynchronous-unwind-tables -fPIC -g -Wall
-Werror=format-security -Woverloaded-virtual -Wnon-virtual-dtor -Wl,-as-needed
-O3 -fPIC
-I<http://river.suse.de/job/libzypp-11.2/ws/rpm/rpmbuild/libzypp-6.33.4>
-I<http://river.suse.de/job/libzypp-11.2/ws/rpm/rpmbuild/libzypp-6.33.4/build>
-I/usr/include/rpm -I/usr/include/hal -I/usr/include/dbus-1.0
-I/usr/lib64/dbus-1.0/include
-I<http://river.suse.de/job/libzypp-11.2/ws/rpm/rpmbuild/libzypp-6.33.4/build/zypp>
-DZYPP_BASE_LOGGER_LOGGROUP=\"zypp\" -o CMakeFiles/zypp.dir/Resolver.cc.o -c
<http://river.suse.de/job/libzypp-11.2/ws/rpm/rpmbuild/libzypp-6.33.4/zypp/Resolver.cc>
ICECC[8959] 07:50:33: got exception 17 (10.10.2.76)
/usr/bin/cmake -E cmake_progress_report
<http://river.suse.de/job/libzypp-11.2/ws/rpm/rpmbuild/libzypp-6.33.4/build/CMakeFiles>
44
[ 72%] Building CXX object zypp/CMakeFiles/zypp.dir/ResolverProblem.cc.o
cd
<http://river.suse.de/job/libzypp-11.2/ws/rpm/rpmbuild/libzypp-6.33.4/build/zypp>
&& /opt/icecream/bin/g++ -Dzypp_EXPORTS -D_FILE_OFFSET_BITS=64
-DVERSION=\"6.33.4\" -D_RPM_4_4_COMPAT -DLOCALEDIR=\"/usr/share/locale\"
-DTEXTDOMAIN=\"zypp\" -O2 -g -m64 -fmessage-length=0 -D_FORTIFY_SOURCE=2
-fstack-protector -funwind-tables -fasynchronous-unwind-tables -fPIC -g -Wall
-Werror=format-security -Woverloaded-virtual -Wnon-virtual-dtor -Wl,-as-needed
-O2 -g -m64 -fmessage-length=0 -D_FORTIFY_SOURCE=2 -fstack-protector
-funwind-tables -fasynchronous-unwind-tables -fPIC -g -Wall
-Werror=format-security -Woverloaded-virtual -Wnon-virtual-dtor -Wl,-as-needed
-O3 -fPIC
-I<http://river.suse.de/job/libzypp-11.2/ws/rpm/rpmbuild/libzypp-6.33.4>
-I<http://river.suse.de/job/libzypp-11.2/ws/rpm/rpmbuild/libzypp-6.33.4/build>
-I/usr/include/rpm -I/usr/include/hal -I/usr/include/dbus-1.0
-I/usr/lib64/dbus-1.0/include
-I<http://river.suse.de/job/libzypp-11.2/ws/rpm/rpmbuild/libzypp-6.33.4/build/zypp>
-DZYPP_BASE_LOGGER_LOGGROUP=\"zypp\" -o
CMakeFiles/zypp.dir/ResolverProblem.cc.o -c
<http://river.suse.de/job/libzypp-11.2/ws/rpm/rpmbuild/libzypp-6.33.4/zypp/ResolverProblem.cc>
ICECC[8967] 07:50:36: got exception 17 (10.10.2.76)
/usr/bin/cmake -E cmake_progress_report
<http://river.suse.de/job/libzypp-11.2/ws/rpm/rpmbuild/libzypp-6.33.4/build/CMakeFiles>

[ 72%] Building CXX object zypp/CMakeFiles/zypp.dir/ResPool.cc.o
cd
<http://river.suse.de/job/libzypp-11.2/ws/rpm/rpmbuild/libzypp-6.33.4/build/zypp>
&& /opt/icecream/bin/g++ -Dzypp_EXPORTS -D_FILE_OFFSET_BITS=64
-DVERSION=\"6.33.4\" -D_RPM_4_4_COMPAT -DLOCALEDIR=\"/usr/share/locale\"
-DTEXTDOMAIN=\"zypp\" -O2 -g -m64 -fmessage-length=0 -D_FORTIFY_SOURCE=2
-fstack-protector -funwind-tables -fasynchronous-unwind-tables -fPIC -g -Wall
-Werror=format-security -Woverloaded-virtual -Wnon-virtual-dtor -Wl,-as-needed
-O2 -g -m64 -fmessage-length=0 -D_FORTIFY_SOURCE=2 -fstack-protector
-funwind-tables -fasynchronous-unwind-tables -fPIC -g -Wall
-Werror=format-security -Woverloaded-virtual -Wnon-virtual-dtor -Wl,-as-needed
-O3 -fPIC
-I<http://river.suse.de/job/libzypp-11.2/ws/rpm/rpmbuild/libzypp-6.33.4>
-I<http://river.suse.de/job/libzypp-11.2/ws/rpm/rpmbuild/libzypp-6.33.4/build>
-I/usr/include/rpm -I/usr/include/hal -I/usr/include/dbus-1.0
-I/usr/lib64/dbus-1.0/include
-I<http://river.suse.de/job/libzypp-11.2/ws/rpm/rpmbuild/libzypp-6.33.4/build/zypp>
-DZYPP_BASE_LOGGER_LOGGROUP=\"zypp\" -o CMakeFiles/zypp.dir/ResPool.cc.o -c
<http://river.suse.de/job/libzypp-11.2/ws/rpm/rpmbuild/libzypp-6.33.4/zypp/ResPool.cc>
ICECC[8975] 07:50:39: got exception 17 (10.10.2.76)
/usr/bin/cmake -E cmake_progress_report
<http://river.suse.de/job/libzypp-11.2/ws/rpm/rpmbuild/libzypp-6.33.4/build/CMakeFiles>

[ 72%] Building CXX object zypp/CMakeFiles/zypp.dir/ResPoolProxy.cc.o
cd
<http://river.suse.de/job/libzypp-11.2/ws/rpm/rpmbuild/libzypp-6.33.4/build/zypp>
&& /opt/icecream/bin/g++ -Dzypp_EXPORTS -D_FILE_OFFSET_BITS=64
-DVERSION=\"6.33.4\" -D_RPM_4_4_COMPAT -DLOCALEDIR=\"/usr/share/locale\"
-DTEXTDOMAIN=\"zypp\" -O2 -g -m64 -fmessage-length=0 -D_FORTIFY_SOURCE=2
-fstack-protector -funwind-tables -fasynchronous-unwind-tables -fPIC -g -Wall
-Werror=format-security -Woverloaded-virtual -Wnon-virtual-dtor -Wl,-as-needed
-O2 -g -m64 -fmessage-length=0 -D_FORTIFY_SOURCE=2 -fstack-protector
-funwind-tables -fasynchronous-unwind-tables -fPIC -g -Wall
-Werror=format-security -Woverloaded-virtual -Wnon-virtual-dtor -Wl,-as-needed
-O3 -fPIC
-I<http://river.suse.de/job/libzypp-11.2/ws/rpm/rpmbuild/libzypp-6.33.4>
-I<http://river.suse.de/job/libzypp-11.2/ws/rpm/rpmbuild/libzypp-6.33.4/build>
-I/usr/include/rpm -I/usr/include/hal -I/usr/include/dbus-1.0
-I/usr/lib64/dbus-1.0/include
-I<http://river.suse.de/job/libzypp-11.2/ws/rpm/rpmbuild/libzypp-6.33.4/build/zypp>
-DZYPP_BASE_LOGGER_LOGGROUP=\"zypp\" -o
CMakeFiles/zypp.dir/ResPoolProxy.cc.o -c
<http://river.suse.de/job/libzypp-11.2/ws/rpm/rpmbuild/libzypp-6.33.4/zypp/ResPoolProxy.cc>
ICECC[8983] 07:50:44: got exception 17 (10.10.2.76)
/usr/bin/cmake -E cmake_progress_report
<http://river.suse.de/job/libzypp-11.2/ws/rpm/rpmbuild/libzypp-6.33.4/build/CMakeFiles>
45
[ 73%] Building CXX object zypp/CMakeFiles/zypp.dir/ResStatus.cc.o
cd
<http://river.suse.de/job/libzypp-11.2/ws/rpm/rpmbuild/libzypp-6.33.4/build/zypp>
&& /opt/icecream/bin/g++ -Dzypp_EXPORTS -D_FILE_OFFSET_BITS=64
-DVERSION=\"6.33.4\" -D_RPM_4_4_COMPAT -DLOCALEDIR=\"/usr/share/locale\"
-DTEXTDOMAIN=\"zypp\" -O2 -g -m64 -fmessage-length=0 -D_FORTIFY_SOURCE=2
-fstack-protector -funwind-tables -fasynchronous-unwind-tables -fPIC -g -Wall
-Werror=format-security -Woverloaded-virtual -Wnon-virtual-dtor -Wl,-as-needed
-O2 -g -m64 -fmessage-length=0 -D_FORTIFY_SOURCE=2 -fstack-protector
-funwind-tables -fasynchronous-unwind-tables -fPIC -g -Wall
-Werror=format-security -Woverloaded-virtual -Wnon-virtual-dtor -Wl,-as-needed
-O3 -fPIC
-I<http://river.suse.de/job/libzypp-11.2/ws/rpm/rpmbuild/libzypp-6.33.4>
-I<http://river.suse.de/job/libzypp-11.2/ws/rpm/rpmbuild/libzypp-6.33.4/build>
-I/usr/include/rpm -I/usr/include/hal -I/usr/include/dbus-1.0
-I/usr/lib64/dbus-1.0/include
-I<http://river.suse.de/job/libzypp-11.2/ws/rpm/rpmbuild/libzypp-6.33.4/build/zypp>
-DZYPP_BASE_LOGGER_LOGGROUP=\"zypp\" -o CMakeFiles/zypp.dir/ResStatus.cc.o
-c
<http://river.suse.de/job/libzypp-11.2/ws/rpm/rpmbuild/libzypp-6.33.4/zypp/ResStatus.cc>
/usr/bin/cmake -E cmake_progress_report
<http://river.suse.de/job/libzypp-11.2/ws/rpm/rpmbuild/libzypp-6.33.4/build/CMakeFiles>

[ 73%] Building CXX object zypp/CMakeFiles/zypp.dir/ServiceInfo.cc.o
cd
<http://river.suse.de/job/libzypp-11.2/ws/rpm/rpmbuild/libzypp-6.33.4/build/zypp>
&& /opt/icecream/bin/g++ -Dzypp_EXPORTS -D_FILE_OFFSET_BITS=64
-DVERSION=\"6.33.4\" -D_RPM_4_4_COMPAT -DLOCALEDIR=\"/usr/share/locale\"
-DTEXTDOMAIN=\"zypp\" -O2 -g -m64 -fmessage-length=0 -D_FORTIFY_SOURCE=2
-fstack-protector -funwind-tables -fasynchronous-unwind-tables -fPIC -g -Wall
-Werror=format-security -Woverloaded-virtual -Wnon-virtual-dtor -Wl,-as-needed
-O2 -g -m64 -fmessage-length=0 -D_FORTIFY_SOURCE=2 -fstack-protector
-funwind-tables -fasynchronous-unwind-tables -fPIC -g -Wall
-Werror=format-security -Woverloaded-virtual -Wnon-virtual-dtor -Wl,-as-needed
-O3 -fPIC
-I<http://river.suse.de/job/libzypp-11.2/ws/rpm/rpmbuild/libzypp-6.33.4>
-I<http://river.suse.de/job/libzypp-11.2/ws/rpm/rpmbuild/libzypp-6.33.4/build>
-I/usr/include/rpm -I/usr/include/hal -I/usr/include/dbus-1.0
-I/usr/lib64/dbus-1.0/include
-I<http://river.suse.de/job/libzypp-11.2/ws/rpm/rpmbuild/libzypp-6.33.4/build/zypp>
-DZYPP_BASE_LOGGER_LOGGROUP=\"zypp\" -o CMakeFiles/zypp.dir/ServiceInfo.cc.o
-c
<http://river.suse.de/job/libzypp-11.2/ws/rpm/rpmbuild/libzypp-6.33.4/zypp/ServiceInfo.cc>
/usr/bin/cmake -E cmake_progress_report
<http://river.suse.de/job/libzypp-11.2/ws/rpm/rpmbuild/libzypp-6.33.4/build/CMakeFiles>

[ 73%] Building CXX object zypp/CMakeFiles/zypp.dir/Signature.cc.o
cd
<http://river.suse.de/job/libzypp-11.2/ws/rpm/rpmbuild/libzypp-6.33.4/build/zypp>
&& /opt/icecream/bin/g++ -Dzypp_EXPORTS -D_FILE_OFFSET_BITS=64
-DVERSION=\"6.33.4\" -D_RPM_4_4_COMPAT -DLOCALEDIR=\"/usr/share/locale\"
-DTEXTDOMAIN=\"zypp\" -O2 -g -m64 -fmessage-length=0 -D_FORTIFY_SOURCE=2
-fstack-protector -funwind-tables -fasynchronous-unwind-tables -fPIC -g -Wall
-Werror=format-security -Woverloaded-virtual -Wnon-virtual-dtor -Wl,-as-needed
-O2 -g -m64 -fmessage-length=0 -D_FORTIFY_SOURCE=2 -fstack-protector
-funwind-tables -fasynchronous-unwind-tables -fPIC -g -Wall
-Werror=format-security -Woverloaded-virtual -Wnon-virtual-dtor -Wl,-as-needed
-O3 -fPIC
-I<http://river.suse.de/job/libzypp-11.2/ws/rpm/rpmbuild/libzypp-6.33.4>
-I<http://river.suse.de/job/libzypp-11.2/ws/rpm/rpmbuild/libzypp-6.33.4/build>
-I/usr/include/rpm -I/usr/include/hal -I/usr/include/dbus-1.0
-I/usr/lib64/dbus-1.0/include
-I<http://river.suse.de/job/libzypp-11.2/ws/rpm/rpmbuild/libzypp-6.33.4/build/zypp>
-DZYPP_BASE_LOGGER_LOGGROUP=\"zypp\" -o CMakeFiles/zypp.dir/Signature.cc.o
-c
<http://river.suse.de/job/libzypp-11.2/ws/rpm/rpmbuild/libzypp-6.33.4/zypp/Signature.cc>
/usr/bin/cmake -E cmake_progress_report
<http://river.suse.de/job/libzypp-11.2/ws/rpm/rpmbuild/libzypp-6.33.4/build/CMakeFiles>

[ 73%] Building CXX object zypp/CMakeFiles/zypp.dir/SrcPackage.cc.o
cd
<http://river.suse.de/job/libzypp-11.2/ws/rpm/rpmbuild/libzypp-6.33.4/build/zypp>
&& /opt/icecream/bin/g++ -Dzypp_EXPORTS -D_FILE_OFFSET_BITS=64
-DVERSION=\"6.33.4\" -D_RPM_4_4_COMPAT -DLOCALEDIR=\"/usr/share/locale\"
-DTEXTDOMAIN=\"zypp\" -O2 -g -m64 -fmessage-length=0 -D_FORTIFY_SOURCE=2
-fstack-protector -funwind-tables -fasynchronous-unwind-tables -fPIC -g -Wall
-Werror=format-security -Woverloaded-virtual -Wnon-virtual-dtor -Wl,-as-needed
-O2 -g -m64 -fmessage-length=0 -D_FORTIFY_SOURCE=2 -fstack-protector
-funwind-tables -fasynchronous-unwind-tables -fPIC -g -Wall
-Werror=format-security -Woverloaded-virtual -Wnon-virtual-dtor -Wl,-as-needed
-O3 -fPIC
-I<http://river.suse.de/job/libzypp-11.2/ws/rpm/rpmbuild/libzypp-6.33.4>
-I<http://river.suse.de/job/libzypp-11.2/ws/rpm/rpmbuild/libzypp-6.33.4/build>
-I/usr/include/rpm -I/usr/include/hal -I/usr/include/dbus-1.0
-I/usr/lib64/dbus-1.0/include
-I<http://river.suse.de/job/libzypp-11.2/ws/rpm/rpmbuild/libzypp-6.33.4/build/zypp>
-DZYPP_BASE_LOGGER_LOGGROUP=\"zypp\" -o CMakeFiles/zypp.dir/SrcPackage.cc.o
-c
<http://river.suse.de/job/libzypp-11.2/ws/rpm/rpmbuild/libzypp-6.33.4/zypp/SrcPackage.cc>
/usr/bin/cmake -E cmake_progress_report
<http://river.suse.de/job/libzypp-11.2/ws/rpm/rpmbuild/libzypp-6.33.4/build/CMakeFiles>
46
[ 75%] Building CXX object zypp/CMakeFiles/zypp.dir/SysContent.cc.o
cd
<http://river.suse.de/job/libzypp-11.2/ws/rpm/rpmbuild/libzypp-6.33.4/build/zypp>
&& /opt/icecream/bin/g++ -Dzypp_EXPORTS -D_FILE_OFFSET_BITS=64
-DVERSION=\"6.33.4\" -D_RPM_4_4_COMPAT -DLOCALEDIR=\"/usr/share/locale\"
-DTEXTDOMAIN=\"zypp\" -O2 -g -m64 -fmessage-length=0 -D_FORTIFY_SOURCE=2
-fstack-protector -funwind-tables -fasynchronous-unwind-tables -fPIC -g -Wall
-Werror=format-security -Woverloaded-virtual -Wnon-virtual-dtor -Wl,-as-needed
-O2 -g -m64 -fmessage-length=0 -D_FORTIFY_SOURCE=2 -fstack-protector
-funwind-tables -fasynchronous-unwind-tables -fPIC -g -Wall
-Werror=format-security -Woverloaded-virtual -Wnon-virtual-dtor -Wl,-as-needed
-O3 -fPIC
-I<http://river.suse.de/job/libzypp-11.2/ws/rpm/rpmbuild/libzypp-6.33.4>
-I<http://river.suse.de/job/libzypp-11.2/ws/rpm/rpmbuild/libzypp-6.33.4/build>
-I/usr/include/rpm -I/usr/include/hal -I/usr/include/dbus-1.0
-I/usr/lib64/dbus-1.0/include
-I<http://river.suse.de/job/libzypp-11.2/ws/rpm/rpmbuild/libzypp-6.33.4/build/zypp>
-DZYPP_BASE_LOGGER_LOGGROUP=\"zypp\" -o CMakeFiles/zypp.dir/SysContent.cc.o
-c
<http://river.suse.de/job/libzypp-11.2/ws/rpm/rpmbuild/libzypp-6.33.4/zypp/SysContent.cc>
/usr/bin/cmake -E cmake_progress_report
<http://river.suse.de/job/libzypp-11.2/ws/rpm/rpmbuild/libzypp-6.33.4/build/CMakeFiles>

[ 75%] Building CXX object zypp/CMakeFiles/zypp.dir/Target.cc.o
cd
<http://river.suse.de/job/libzypp-11.2/ws/rpm/rpmbuild/libzypp-6.33.4/build/zypp>
&& /opt/icecream/bin/g++ -Dzypp_EXPORTS -D_FILE_OFFSET_BITS=64
-DVERSION=\"6.33.4\" -D_RPM_4_4_COMPAT -DLOCALEDIR=\"/usr/share/locale\"
-DTEXTDOMAIN=\"zypp\" -O2 -g -m64 -fmessage-length=0 -D_FORTIFY_SOURCE=2
-fstack-protector -funwind-tables -fasynchronous-unwind-tables -fPIC -g -Wall
-Werror=format-security -Woverloaded-virtual -Wnon-virtual-dtor -Wl,-as-needed
-O2 -g -m64 -fmessage-length=0 -D_FORTIFY_SOURCE=2 -fstack-protector
-funwind-tables -fasynchronous-unwind-tables -fPIC -g -Wall
-Werror=format-security -Woverloaded-virtual -Wnon-virtual-dtor -Wl,-as-needed
-O3 -fPIC
-I<http://river.suse.de/job/libzypp-11.2/ws/rpm/rpmbuild/libzypp-6.33.4>
-I<http://river.suse.de/job/libzypp-11.2/ws/rpm/rpmbuild/libzypp-6.33.4/build>
-I/usr/include/rpm -I/usr/include/hal -I/usr/include/dbus-1.0
-I/usr/lib64/dbus-1.0/include
-I<http://river.suse.de/job/libzypp-11.2/ws/rpm/rpmbuild/libzypp-6.33.4/build/zypp>
-DZYPP_BASE_LOGGER_LOGGROUP=\"zypp\" -o CMakeFiles/zypp.dir/Target.cc.o -c
<http://river.suse.de/job/libzypp-11.2/ws/rpm/rpmbuild/libzypp-6.33.4/zypp/Target.cc>
/usr/bin/cmake -E cmake_progress_report
<http://river.suse.de/job/libzypp-11.2/ws/rpm/rpmbuild/libzypp-6.33.4/build/CMakeFiles>

[ 75%] Building CXX object zypp/CMakeFiles/zypp.dir/TmpPath.cc.o
cd
<http://river.suse.de/job/libzypp-11.2/ws/rpm/rpmbuild/libzypp-6.33.4/build/zypp>
&& /opt/icecream/bin/g++ -Dzypp_EXPORTS -D_FILE_OFFSET_BITS=64
-DVERSION=\"6.33.4\" -D_RPM_4_4_COMPAT -DLOCALEDIR=\"/usr/share/locale\"
-DTEXTDOMAIN=\"zypp\" -O2 -g -m64 -fmessage-length=0 -D_FORTIFY_SOURCE=2
-fstack-protector -funwind-tables -fasynchronous-unwind-tables -fPIC -g -Wall
-Werror=format-security -Woverloaded-virtual -Wnon-virtual-dtor -Wl,-as-needed
-O2 -g -m64 -fmessage-length=0 -D_FORTIFY_SOURCE=2 -fstack-protector
-funwind-tables -fasynchronous-unwind-tables -fPIC -g -Wall
-Werror=format-security -Woverloaded-virtual -Wnon-virtual-dtor -Wl,-as-needed
-O3 -fPIC
-I<http://river.suse.de/job/libzypp-11.2/ws/rpm/rpmbuild/libzypp-6.33.4>
-I<http://river.suse.de/job/libzypp-11.2/ws/rpm/rpmbuild/libzypp-6.33.4/build>
-I/usr/include/rpm -I/usr/include/hal -I/usr/include/dbus-1.0
-I/usr/lib64/dbus-1.0/include
-I<http://river.suse.de/job/libzypp-11.2/ws/rpm/rpmbuild/libzypp-6.33.4/build/zypp>
-DZYPP_BASE_LOGGER_LOGGROUP=\"zypp\" -o CMakeFiles/zypp.dir/TmpPath.cc.o -c
<http://river.suse.de/job/libzypp-11.2/ws/rpm/rpmbuild/libzypp-6.33.4/zypp/TmpPath.cc>
/usr/bin/cmake -E cmake_progress_report
<http://river.suse.de/job/libzypp-11.2/ws/rpm/rpmbuild/libzypp-6.33.4/build/CMakeFiles>

[ 75%] Building CXX object zypp/CMakeFiles/zypp.dir/Url.cc.o
cd
<http://river.suse.de/job/libzypp-11.2/ws/rpm/rpmbuild/libzypp-6.33.4/build/zypp>
&& /opt/icecream/bin/g++ -Dzypp_EXPORTS -D_FILE_OFFSET_BITS=64
-DVERSION=\"6.33.4\" -D_RPM_4_4_COMPAT -DLOCALEDIR=\"/usr/share/locale\"
-DTEXTDOMAIN=\"zypp\" -O2 -g -m64 -fmessage-length=0 -D_FORTIFY_SOURCE=2
-fstack-protector -funwind-tables -fasynchronous-unwind-tables -fPIC -g -Wall
-Werror=format-security -Woverloaded-virtual -Wnon-virtual-dtor -Wl,-as-needed
-O2 -g -m64 -fmessage-length=0 -D_FORTIFY_SOURCE=2 -fstack-protector
-funwind-tables -fasynchronous-unwind-tables -fPIC -g -Wall
-Werror=format-security -Woverloaded-virtual -Wnon-virtual-dtor -Wl,-as-needed
-O3 -fPIC
-I<http://river.suse.de/job/libzypp-11.2/ws/rpm/rpmbuild/libzypp-6.33.4>
-I<http://river.suse.de/job/libzypp-11.2/ws/rpm/rpmbuild/libzypp-6.33.4/build>
-I/usr/include/rpm -I/usr/include/hal -I/usr/include/dbus-1.0
-I/usr/lib64/dbus-1.0/include
-I<http://river.suse.de/job/libzypp-11.2/ws/rpm/rpmbuild/libzypp-6.33.4/build/zypp>
-DZYPP_BASE_LOGGER_LOGGROUP=\"zypp\" -o CMakeFiles/zypp.dir/Url.cc.o -c
<http://river.suse.de/job/libzypp-11.2/ws/rpm/rpmbuild/libzypp-6.33.4/zypp/Url.cc>
/usr/bin/cmake -E cmake_progress_report
<http://river.suse.de/job/libzypp-11.2/ws/rpm/rpmbuild/libzypp-6.33.4/build/CMakeFiles>
47
[ 77%] Building CXX object zypp/CMakeFiles/zypp.dir/VendorAttr.cc.o
cd
<http://river.suse.de/job/libzypp-11.2/ws/rpm/rpmbuild/libzypp-6.33.4/build/zypp>
&& /opt/icecream/bin/g++ -Dzypp_EXPORTS -D_FILE_OFFSET_BITS=64
-DVERSION=\"6.33.4\" -D_RPM_4_4_COMPAT -DLOCALEDIR=\"/usr/share/locale\"
-DTEXTDOMAIN=\"zypp\" -O2 -g -m64 -fmessage-length=0 -D_FORTIFY_SOURCE=2
-fstack-protector -funwind-tables -fasynchronous-unwind-tables -fPIC -g -Wall
-Werror=format-security -Woverloaded-virtual -Wnon-virtual-dtor -Wl,-as-needed
-O2 -g -m64 -fmessage-length=0 -D_FORTIFY_SOURCE=2 -fstack-protector
-funwind-tables -fasynchronous-unwind-tables -fPIC -g -Wall
-Werror=format-security -Woverloaded-virtual -Wnon-virtual-dtor -Wl,-as-needed
-O3 -fPIC
-I<http://river.suse.de/job/libzypp-11.2/ws/rpm/rpmbuild/libzypp-6.33.4>
-I<http://river.suse.de/job/libzypp-11.2/ws/rpm/rpmbuild/libzypp-6.33.4/build>
-I/usr/include/rpm -I/usr/include/hal -I/usr/include/dbus-1.0
-I/usr/lib64/dbus-1.0/include
-I<http://river.suse.de/job/libzypp-11.2/ws/rpm/rpmbuild/libzypp-6.33.4/build/zypp>
-DZYPP_BASE_LOGGER_LOGGROUP=\"zypp\" -o CMakeFiles/zypp.dir/VendorAttr.cc.o
-c
<http://river.suse.de/job/libzypp-11.2/ws/rpm/rpmbuild/libzypp-6.33.4/zypp/VendorAttr.cc>
/usr/bin/cmake -E cmake_progress_report
<http://river.suse.de/job/libzypp-11.2/ws/rpm/rpmbuild/libzypp-6.33.4/build/CMakeFiles>

[ 77%] Building CXX object zypp/CMakeFiles/zypp.dir/VendorSupportOptions.cc.o
cd
<http://river.suse.de/job/libzypp-11.2/ws/rpm/rpmbuild/libzypp-6.33.4/build/zypp>
&& /opt/icecream/bin/g++ -Dzypp_EXPORTS -D_FILE_OFFSET_BITS=64
-DVERSION=\"6.33.4\" -D_RPM_4_4_COMPAT -DLOCALEDIR=\"/usr/share/locale\"
-DTEXTDOMAIN=\"zypp\" -O2 -g -m64 -fmessage-length=0 -D_FORTIFY_SOURCE=2
-fstack-protector -funwind-tables -fasynchronous-unwind-tables -fPIC -g -Wall
-Werror=format-security -Woverloaded-virtual -Wnon-virtual-dtor -Wl,-as-needed
-O2 -g -m64 -fmessage-length=0 -D_FORTIFY_SOURCE=2 -fstack-protector
-funwind-tables -fasynchronous-unwind-tables -fPIC -g -Wall
-Werror=format-security -Woverloaded-virtual -Wnon-virtual-dtor -Wl,-as-needed
-O3 -fPIC
-I<http://river.suse.de/job/libzypp-11.2/ws/rpm/rpmbuild/libzypp-6.33.4>
-I<http://river.suse.de/job/libzypp-11.2/ws/rpm/rpmbuild/libzypp-6.33.4/build>
-I/usr/include/rpm -I/usr/include/hal -I/usr/include/dbus-1.0
-I/usr/lib64/dbus-1.0/include
-I<http://river.suse.de/job/libzypp-11.2/ws/rpm/rpmbuild/libzypp-6.33.4/build/zypp>
-DZYPP_BASE_LOGGER_LOGGROUP=\"zypp\" -o
CMakeFiles/zypp.dir/VendorSupportOptions.cc.o -c
<http://river.suse.de/job/libzypp-11.2/ws/rpm/rpmbuild/libzypp-6.33.4/zypp/VendorSupportOptions.cc>
/usr/bin/cmake -E cmake_progress_report
<http://river.suse.de/job/libzypp-11.2/ws/rpm/rpmbuild/libzypp-6.33.4/build/CMakeFiles>

[ 77%] Building CXX object zypp/CMakeFiles/zypp.dir/ZYpp.cc.o
cd
<http://river.suse.de/job/libzypp-11.2/ws/rpm/rpmbuild/libzypp-6.33.4/build/zypp>
&& /opt/icecream/bin/g++ -Dzypp_EXPORTS -D_FILE_OFFSET_BITS=64
-DVERSION=\"6.33.4\" -D_RPM_4_4_COMPAT -DLOCALEDIR=\"/usr/share/locale\"
-DTEXTDOMAIN=\"zypp\" -O2 -g -m64 -fmessage-length=0 -D_FORTIFY_SOURCE=2
-fstack-protector -funwind-tables -fasynchronous-unwind-tables -fPIC -g -Wall
-Werror=format-security -Woverloaded-virtual -Wnon-virtual-dtor -Wl,-as-needed
-O2 -g -m64 -fmessage-length=0 -D_FORTIFY_SOURCE=2 -fstack-protector
-funwind-tables -fasynchronous-unwind-tables -fPIC -g -Wall
-Werror=format-security -Woverloaded-virtual -Wnon-virtual-dtor -Wl,-as-needed
-O3 -fPIC
-I<http://river.suse.de/job/libzypp-11.2/ws/rpm/rpmbuild/libzypp-6.33.4>
-I<http://river.suse.de/job/libzypp-11.2/ws/rpm/rpmbuild/libzypp-6.33.4/build>
-I/usr/include/rpm -I/usr/include/hal -I/usr/include/dbus-1.0
-I/usr/lib64/dbus-1.0/include
-I<http://river.suse.de/job/libzypp-11.2/ws/rpm/rpmbuild/libzypp-6.33.4/build/zypp>
-DZYPP_BASE_LOGGER_LOGGROUP=\"zypp\" -o CMakeFiles/zypp.dir/ZYpp.cc.o -c
<http://river.suse.de/job/libzypp-11.2/ws/rpm/rpmbuild/libzypp-6.33.4/zypp/ZYpp.cc>
/usr/bin/cmake -E cmake_progress_report
<http://river.suse.de/job/libzypp-11.2/ws/rpm/rpmbuild/libzypp-6.33.4/build/CMakeFiles>
48
[ 78%] Building CXX object zypp/CMakeFiles/zypp.dir/ZYppCommitPolicy.cc.o
cd
<http://river.suse.de/job/libzypp-11.2/ws/rpm/rpmbuild/libzypp-6.33.4/build/zypp>
&& /opt/icecream/bin/g++ -Dzypp_EXPORTS -D_FILE_OFFSET_BITS=64
-DVERSION=\"6.33.4\" -D_RPM_4_4_COMPAT -DLOCALEDIR=\"/usr/share/locale\"
-DTEXTDOMAIN=\"zypp\" -O2 -g -m64 -fmessage-length=0 -D_FORTIFY_SOURCE=2
-fstack-protector -funwind-tables -fasynchronous-unwind-tables -fPIC -g -Wall
-Werror=format-security -Woverloaded-virtual -Wnon-virtual-dtor -Wl,-as-needed
-O2 -g -m64 -fmessage-length=0 -D_FORTIFY_SOURCE=2 -fstack-protector
-funwind-tables -fasynchronous-unwind-tables -fPIC -g -Wall
-Werror=format-security -Woverloaded-virtual -Wnon-virtual-dtor -Wl,-as-needed
-O3 -fPIC
-I<http://river.suse.de/job/libzypp-11.2/ws/rpm/rpmbuild/libzypp-6.33.4>
-I<http://river.suse.de/job/libzypp-11.2/ws/rpm/rpmbuild/libzypp-6.33.4/build>
-I/usr/include/rpm -I/usr/include/hal -I/usr/include/dbus-1.0
-I/usr/lib64/dbus-1.0/include
-I<http://river.suse.de/job/libzypp-11.2/ws/rpm/rpmbuild/libzypp-6.33.4/build/zypp>
-DZYPP_BASE_LOGGER_LOGGROUP=\"zypp\" -o
CMakeFiles/zypp.dir/ZYppCommitPolicy.cc.o -c
<http://river.suse.de/job/libzypp-11.2/ws/rpm/rpmbuild/libzypp-6.33.4/zypp/ZYppCommitPolicy.cc>
/usr/bin/cmake -E cmake_progress_report
<http://river.suse.de/job/libzypp-11.2/ws/rpm/rpmbuild/libzypp-6.33.4/build/CMakeFiles>

[ 78%] Building CXX object zypp/CMakeFiles/zypp.dir/ZYppCommitResult.cc.o
cd
<http://river.suse.de/job/libzypp-11.2/ws/rpm/rpmbuild/libzypp-6.33.4/build/zypp>
&& /opt/icecream/bin/g++ -Dzypp_EXPORTS -D_FILE_OFFSET_BITS=64
-DVERSION=\"6.33.4\" -D_RPM_4_4_COMPAT -DLOCALEDIR=\"/usr/share/locale\"
-DTEXTDOMAIN=\"zypp\" -O2 -g -m64 -fmessage-length=0 -D_FORTIFY_SOURCE=2
-fstack-protector -funwind-tables -fasynchronous-unwind-tables -fPIC -g -Wall
-Werror=format-security -Woverloaded-virtual -Wnon-virtual-dtor -Wl,-as-needed
-O2 -g -m64 -fmessage-length=0 -D_FORTIFY_SOURCE=2 -fstack-protector
-funwind-tables -fasynchronous-unwind-tables -fPIC -g -Wall
-Werror=format-security -Woverloaded-virtual -Wnon-virtual-dtor -Wl,-as-needed
-O3 -fPIC
-I<http://river.suse.de/job/libzypp-11.2/ws/rpm/rpmbuild/libzypp-6.33.4>
-I<http://river.suse.de/job/libzypp-11.2/ws/rpm/rpmbuild/libzypp-6.33.4/build>
-I/usr/include/rpm -I/usr/include/hal -I/usr/include/dbus-1.0
-I/usr/lib64/dbus-1.0/include
-I<http://river.suse.de/job/libzypp-11.2/ws/rpm/rpmbuild/libzypp-6.33.4/build/zypp>
-DZYPP_BASE_LOGGER_LOGGROUP=\"zypp\" -o
CMakeFiles/zypp.dir/ZYppCommitResult.cc.o -c
<http://river.suse.de/job/libzypp-11.2/ws/rpm/rpmbuild/libzypp-6.33.4/zypp/ZYppCommitResult.cc>
/usr/bin/cmake -E cmake_progress_report
<http://river.suse.de/job/libzypp-11.2/ws/rpm/rpmbuild/libzypp-6.33.4/build/CMakeFiles>

[ 78%] Building CXX object zypp/CMakeFiles/zypp.dir/ZYppFactory.cc.o
cd
<http://river.suse.de/job/libzypp-11.2/ws/rpm/rpmbuild/libzypp-6.33.4/build/zypp>
&& /opt/icecream/bin/g++ -Dzypp_EXPORTS -D_FILE_OFFSET_BITS=64
-DVERSION=\"6.33.4\" -D_RPM_4_4_COMPAT -DLOCALEDIR=\"/usr/share/locale\"
-DTEXTDOMAIN=\"zypp\" -O2 -g -m64 -fmessage-length=0 -D_FORTIFY_SOURCE=2
-fstack-protector -funwind-tables -fasynchronous-unwind-tables -fPIC -g -Wall
-Werror=format-security -Woverloaded-virtual -Wnon-virtual-dtor -Wl,-as-needed
-O2 -g -m64 -fmessage-length=0 -D_FORTIFY_SOURCE=2 -fstack-protector
-funwind-tables -fasynchronous-unwind-tables -fPIC -g -Wall
-Werror=format-security -Woverloaded-virtual -Wnon-virtual-dtor -Wl,-as-needed
-O3 -fPIC
-I<http://river.suse.de/job/libzypp-11.2/ws/rpm/rpmbuild/libzypp-6.33.4>
-I<http://river.suse.de/job/libzypp-11.2/ws/rpm/rpmbuild/libzypp-6.33.4/build>
-I/usr/include/rpm -I/usr/include/hal -I/usr/include/dbus-1.0
-I/usr/lib64/dbus-1.0/include
-I<http://river.suse.de/job/libzypp-11.2/ws/rpm/rpmbuild/libzypp-6.33.4/build/zypp>
-DZYPP_BASE_LOGGER_LOGGROUP=\"zypp\" -o CMakeFiles/zypp.dir/ZYppFactory.cc.o
-c
<http://river.suse.de/job/libzypp-11.2/ws/rpm/rpmbuild/libzypp-6.33.4/zypp/ZYppFactory.cc>
In file included from
<http://river.suse.de/job/libzypp-11.2/ws/rpm/rpmbuild/libzypp-6.33.4/zypp/ZYppFactory.cc>:26:
<http://river.suse.de/job/libzypp-11.2/ws/rpm/rpmbuild/libzypp-6.33.4/zypp/zypp_detail/ZYppReadOnlyHack.h>:15:2:
warning: #warning ZYPP_ZYPP_DETAIL_ZYPPREADONLYHACK_H
ICECC[9069] 07:51:11: got exception 17 (10.10.2.76)
In file included from
<http://river.suse.de/job/libzypp-11.2/ws/rpm/rpmbuild/libzypp-6.33.4/zypp/ZYppFactory.cc>:26:
<http://river.suse.de/job/libzypp-11.2/ws/rpm/rpmbuild/libzypp-6.33.4/zypp/zypp_detail/ZYppReadOnlyHack.h>:15:2:
warning: #warning ZYPP_ZYPP_DETAIL_ZYPPREADONLYHACK_H
<http://river.suse.de/job/libzypp-11.2/ws/rpm/rpmbuild/libzypp-6.33.4/zypp/ZYppFactory.cc>:
In member function ‘pid_t zypp::ZYppGlobalLock::lockerPid()’:
<http://river.suse.de/job/libzypp-11.2/ws/rpm/rpmbuild/libzypp-6.33.4/zypp/ZYppFactory.cc>:212:
warning: ignoring return value of ‘int fscanf(FILE*, const char*, ...)’,
declared with attribute warn_unused_result
/usr/bin/cmake -E cmake_progress_report
<http://river.suse.de/job/libzypp-11.2/ws/rpm/rpmbuild/libzypp-6.33.4/build/CMakeFiles>

[ 78%] Building CXX object zypp/CMakeFiles/zypp.dir/zypp_detail/ZYppImpl.cc.o
cd
<http://river.suse.de/job/libzypp-11.2/ws/rpm/rpmbuild/libzypp-6.33.4/build/zypp>
&& /opt/icecream/bin/g++ -Dzypp_EXPORTS -D_FILE_OFFSET_BITS=64
-DVERSION=\"6.33.4\" -D_RPM_4_4_COMPAT -DLOCALEDIR=\"/usr/share/locale\"
-DTEXTDOMAIN=\"zypp\" -O2 -g -m64 -fmessage-length=0 -D_FORTIFY_SOURCE=2
-fstack-protector -funwind-tables -fasynchronous-unwind-tables -fPIC -g -Wall
-Werror=format-security -Woverloaded-virtual -Wnon-virtual-dtor -Wl,-as-needed
-O2 -g -m64 -fmessage-length=0 -D_FORTIFY_SOURCE=2 -fstack-protector
-funwind-tables -fasynchronous-unwind-tables -fPIC -g -Wall
-Werror=format-security -Woverloaded-virtual -Wnon-virtual-dtor -Wl,-as-needed
-O3 -fPIC
-I<http://river.suse.de/job/libzypp-11.2/ws/rpm/rpmbuild/libzypp-6.33.4>
-I<http://river.suse.de/job/libzypp-11.2/ws/rpm/rpmbuild/libzypp-6.33.4/build>
-I/usr/include/rpm -I/usr/include/hal -I/usr/include/dbus-1.0
-I/usr/lib64/dbus-1.0/include
-I<http://river.suse.de/job/libzypp-11.2/ws/rpm/rpmbuild/libzypp-6.33.4/build/zypp>
-DZYPP_BASE_LOGGER_LOGGROUP=\"zypp\" -o
CMakeFiles/zypp.dir/zypp_detail/ZYppImpl.cc.o -c
<http://river.suse.de/job/libzypp-11.2/ws/rpm/rpmbuild/libzypp-6.33.4/zypp/zypp_detail/ZYppImpl.cc>
ICECC[9077] 07:51:15: got exception 17 (10.10.2.76)
/usr/bin/cmake -E cmake_progress_report
<http://river.suse.de/job/libzypp-11.2/ws/rpm/rpmbuild/libzypp-6.33.4/build/CMakeFiles>
49
[ 80%] Building CXX object zypp/CMakeFiles/zypp.dir/sat/Pool.cc.o
cd
<http://river.suse.de/job/libzypp-11.2/ws/rpm/rpmbuild/libzypp-6.33.4/build/zypp>
&& /opt/icecream/bin/g++ -Dzypp_EXPORTS -D_FILE_OFFSET_BITS=64
-DVERSION=\"6.33.4\" -D_RPM_4_4_COMPAT -DLOCALEDIR=\"/usr/share/locale\"
-DTEXTDOMAIN=\"zypp\" -O2 -g -m64 -fmessage-length=0 -D_FORTIFY_SOURCE=2
-fstack-protector -funwind-tables -fasynchronous-unwind-tables -fPIC -g -Wall
-Werror=format-security -Woverloaded-virtual -Wnon-virtual-dtor -Wl,-as-needed
-O2 -g -m64 -fmessage-length=0 -D_FORTIFY_SOURCE=2 -fstack-protector
-funwind-tables -fasynchronous-unwind-tables -fPIC -g -Wall
-Werror=format-security -Woverloaded-virtual -Wnon-virtual-dtor -Wl,-as-needed
-O3 -fPIC
-I<http://river.suse.de/job/libzypp-11.2/ws/rpm/rpmbuild/libzypp-6.33.4>
-I<http://river.suse.de/job/libzypp-11.2/ws/rpm/rpmbuild/libzypp-6.33.4/build>
-I/usr/include/rpm -I/usr/include/hal -I/usr/include/dbus-1.0
-I/usr/lib64/dbus-1.0/include
-I<http://river.suse.de/job/libzypp-11.2/ws/rpm/rpmbuild/libzypp-6.33.4/build/zypp>
-DZYPP_BASE_LOGGER_LOGGROUP=\"satsolver\" -o
CMakeFiles/zypp.dir/sat/Pool.cc.o -c
<http://river.suse.de/job/libzypp-11.2/ws/rpm/rpmbuild/libzypp-6.33.4/zypp/sat/Pool.cc>

cc1plus: out of memory allocating 4064 bytes after a total of 2142208 bytes
ICECC[9085] 07:51:19: Compiled on 10.10.2.76
make[2]: *** [zypp/CMakeFiles/zypp.dir/sat/Pool.cc.o] Error 1
make[2]: Leaving directory
`<http://river.suse.de/job/libzypp-11.2/ws/rpm/rpmbuild/libzypp-6.33.4/build'>
make[1]: *** [zypp/CMakeFiles/zypp.dir/all] Error 2
make[1]: Leaving directory
`<http://river.suse.de/job/libzypp-11.2/ws/rpm/rpmbuild/libzypp-6.33.4/build'>
make: *** [all] Error 2
error: Bad exit status from /var/tmp/rpm-tmp.jwKwLl (%build)


RPM build errors:
Bad exit status from /var/tmp/rpm-tmp.jwKwLl (%build)
Archiving artifacts

--
To unsubscribe, e-mail: zypp-commit+unsubscribe@xxxxxxxxxxxx
For additional commands, e-mail: zypp-commit+help@xxxxxxxxxxxx

< Previous Next >
This Thread
Follow Ups