Mailinglist Archive: zypp-commit (166 mails)

< Previous Next >
[zypp-commit] Build failed in Hudson: libzypp-bindings-head-x86_64 #738
See <http://yast.suse.de:3334/job/libzypp-bindings-head-x86_64/738/changes>

Changes:

[Michael Andres] Let swig understand nested class Target::DistributionLabel

------------------------------------------
[...truncated 69 lines...]
CPack: Compress package
CPack: Finalize package
CPack: Package /build/libzypp-bindings/libzypp-bindings-0.5.3.tar.bz2 generated.
Built target srcpackage_local
exit code: 0 ... good, lets continue
error: failed to remove directory /var/lib/rpmrebuilddb.16292: No such file or
directory
exit code: 0 ... good, lets continue
Executing(%prep): /bin/sh -e /var/tmp/rpm-tmp.T1CCeG
+ umask 022
+ cd /tmp/rpmbuild
+ cd /tmp/rpmbuild
+ rm -rf libzypp-bindings-0.5.3
+ /usr/bin/bzip2 -dc
/build/libzypp-bindings/package/libzypp-bindings-0.5.3.tar.bz2
+ /bin/tar -xf -
+ STATUS=0
+ '[' 0 -ne 0 ']'
+ cd libzypp-bindings-0.5.3
+ /bin/chmod -Rf a+rX,u+w,g-w,o-w .
+ exit 0
Executing(%build): /bin/sh -e /var/tmp/rpm-tmp.V0KLTQ
+ umask 022
+ cd /tmp/rpmbuild
+ /bin/rm -rf /usr/src/packages/BUILDROOT/libzypp-bindings-0.5.3-0.x86_64
++ dirname /usr/src/packages/BUILDROOT/libzypp-bindings-0.5.3-0.x86_64
+ /bin/mkdir -p /usr/src/packages/BUILDROOT
+ /bin/mkdir /usr/src/packages/BUILDROOT/libzypp-bindings-0.5.3-0.x86_64
+ cd libzypp-bindings-0.5.3
+ mkdir build
+ cd build
+ cmake '-DCMAKE_INSTALL_PREFIX=%{prefix}'
-DPYTHON_SITEDIR=/usr/lib64/python2.6/site-packages -DLIB=lib64
-DCMAKE_VERBOSE_MAKEFILE=TRUE
'-DCMAKE_C_FLAGS_RELEASE:STRING=-fmessage-length=0 -O2 -Wall
-D_FORTIFY_SOURCE=2 -fstack-protector -funwind-tables
-fasynchronous-unwind-tables'
'-DCMAKE_CXX_FLAGS_RELEASE:STRING=-fmessage-length=0 -O2 -Wall
-D_FORTIFY_SOURCE=2 -fstack-protector -funwind-tables
-fasynchronous-unwind-tables' -DCMAKE_BUILD_TYPE=Release -DCMAKE_SKIP_RPATH=1 ..
-- The C compiler identification is GNU
-- The CXX compiler identification is GNU
-- Check for working C compiler: /opt/icecream/bin/gcc
-- Check for working C compiler: /opt/icecream/bin/gcc -- works
-- Detecting C compiler ABI info
-- Detecting C compiler ABI info - done
-- Check for working CXX compiler: /opt/icecream/bin/g++
-- Check for working CXX compiler: /opt/icecream/bin/g++ -- works
-- Detecting CXX compiler ABI info
-- Detecting CXX compiler ABI info - done
-- Libraries will be installed in
/tmp/rpmbuild/libzypp-bindings-0.5.3/build/%{prefix}/lib64
-- Config files will be installed in
/tmp/rpmbuild/libzypp-bindings-0.5.3/build/%{prefix}/etc
** Manual files will be installed in
/tmp/rpmbuild/libzypp-bindings-0.5.3/build/%{prefix}/share/man
-- Writing spec file...
-- I hate you rpm-lint...!!!
-- Looking modules in
/tmp/rpmbuild/libzypp-bindings-0.5.3/build/%{prefix}/share/cmake/Modules;/tmp/rpmbuild/libzypp-bindings-0.5.3/cmake/modules
-- ZYpp path not set. Looking for it.
-- ZYpp found: includes in /usr/include, library in /usr/lib64/libzypp.so
-- Found Ruby: /usr/bin/ruby
-- Found PythonLibs: /usr/lib64/libpython2.6.so
-- Found Perl: /usr/bin/perl
-- Ruby executable: /usr/bin/ruby
-- Ruby vendor arch dir: /usr/lib64/ruby/vendor_ruby/1.8/x86_64-linux
-- Ruby include path:
/usr/lib64/ruby/1.8/x86_64-linux;/usr/lib64/ruby/1.8/x86_64-linux
-- Found PythonInterp: /usr/bin/python2.6
-- Python executable: /usr/bin/python2.6
-- Python include path: /usr/include/python2.6
-- Python site dir: /usr/lib64/python2.6/site-packages
-- Perl executable: /usr/bin/perl
-- Perl core dir: /usr/lib/perl5/5.10.1/x86_64-linux-thread-multi/CORE
-- Perl vendor arch dir:
-- Configuring done
-- Generating done
-- Build files have been written to: /tmp/rpmbuild/libzypp-bindings-0.5.3/build
+ make
/usr/bin/cmake -H/tmp/rpmbuild/libzypp-bindings-0.5.3
-B/tmp/rpmbuild/libzypp-bindings-0.5.3/build --check-build-system
CMakeFiles/Makefile.cmake 0
/usr/bin/cmake -E cmake_progress_start
/tmp/rpmbuild/libzypp-bindings-0.5.3/build/CMakeFiles
/tmp/rpmbuild/libzypp-bindings-0.5.3/build/CMakeFiles/progress.marks
make -f CMakeFiles/Makefile2 all
make[1]: Entering directory `/tmp/rpmbuild/libzypp-bindings-0.5.3/build'
make -f swig/ruby/CMakeFiles/zypp_ruby.dir/build.make
swig/ruby/CMakeFiles/zypp_ruby.dir/depend
make[2]: Entering directory `/tmp/rpmbuild/libzypp-bindings-0.5.3/build'
/usr/bin/cmake -E cmake_progress_report
/tmp/rpmbuild/libzypp-bindings-0.5.3/build/CMakeFiles 6
[ 16%] Generating satsolver_ruby.cc
cd /tmp/rpmbuild/libzypp-bindings-0.5.3/build/swig/ruby && /usr/bin/cmake -E
echo_append Creating\ wrapper\ code\ for\ Ruby...
Creating wrapper code for Ruby...cd
/tmp/rpmbuild/libzypp-bindings-0.5.3/build/swig/ruby && /usr/bin/swig
-DZYPP_DEPRECATED -DBOOST_SMARTPTR_INCLUDE_DIR -c++ -ruby -autorename -o
/tmp/rpmbuild/libzypp-bindings-0.5.3/build/swig/ruby/satsolver_ruby.cc
-I/usr/include /tmp/rpmbuild/libzypp-bindings-0.5.3/swig/zypp.i
/usr/include/boost/smart_ptr/shared_ptr.hpp:310: Warning(362): operator= ignored
/usr/include/boost/smart_ptr/shared_ptr.hpp:319: Warning(362): operator= ignored
/usr/include/boost/smart_ptr/shared_ptr.hpp:330: Warning(362): operator= ignored
/usr/include/boost/smart_ptr/shared_ptr.hpp:339: Warning(362): operator= ignored
/usr/include/boost/smart_ptr/shared_ptr.hpp:492: Warning(378): operator!=
ignored
/usr/include/boost/smart_ptr/weak_ptr.hpp:103: Warning(362): operator= ignored
/usr/include/boost/smart_ptr/weak_ptr.hpp:111: Warning(362): operator= ignored
/usr/include/boost/smart_ptr/intrusive_ptr.hpp:114: Warning(362): operator=
ignored
/usr/include/boost/smart_ptr/intrusive_ptr.hpp:122: Warning(362): operator=
ignored
/usr/include/boost/smart_ptr/intrusive_ptr.hpp:128: Warning(362): operator=
ignored
/usr/include/boost/smart_ptr/intrusive_ptr.hpp:180: Warning(378): operator!=
ignored
/usr/include/boost/smart_ptr/intrusive_ptr.hpp:190: Warning(378): operator!=
ignored
/usr/include/boost/smart_ptr/intrusive_ptr.hpp:200: Warning(378): operator!=
ignored
/usr/include/zypp/base/Flags.h:68: Warning(371): operator&= ignored
/usr/include/zypp/base/Flags.h:69: Warning(371): operator&= ignored
/usr/include/zypp/base/Flags.h:70: Warning(371): operator&= ignored
/usr/include/zypp/base/Flags.h:72: Warning(372): operator|= ignored
/usr/include/zypp/base/Flags.h:73: Warning(372): operator|= ignored
/usr/include/zypp/base/Flags.h:75: Warning(370): operator^= ignored
/usr/include/zypp/base/Flags.h:76: Warning(370): operator^= ignored
/usr/include/zypp/IdStringType.h:96: Warning(362): operator= ignored
/usr/include/zypp/Pathname.h:67: Warning(362): operator= ignored
/usr/include/zypp/Pathname.h:71: Warning(368): operator/= ignored
/usr/include/zypp/Pathname.h:77: Warning(365): operator+= ignored
/usr/include/zypp/ByteCount.h:92: Warning(365): operator+= ignored
/usr/include/zypp/ByteCount.h:93: Warning(366): operator-= ignored
/usr/include/zypp/ByteCount.h:94: Warning(367): operator*= ignored
/usr/include/zypp/ByteCount.h:95: Warning(368): operator/= ignored
/usr/include/zypp/ByteCount.h:97: Warning(383): operator++ ignored
/usr/include/zypp/ByteCount.h:98: Warning(384): operator-- ignored
/usr/include/zypp/ByteCount.h:100: Warning(383): operator++ ignored
/usr/include/zypp/ByteCount.h:101: Warning(384): operator-- ignored
/usr/include/zypp/Url.h:179: Warning(362): operator= ignored
/usr/include/zypp/Url.h:193: Warning(362): operator= ignored
/usr/include/zypp/Edition.h:164: Warning(312): Nested class not currently
supported (ignored)
/usr/include/zypp/Date.h:71: Warning(365): operator+= ignored
/usr/include/zypp/Date.h:72: Warning(366): operator-= ignored
/usr/include/zypp/Date.h:73: Warning(367): operator*= ignored
/usr/include/zypp/Date.h:74: Warning(368): operator/= ignored
/usr/include/zypp/Date.h:76: Warning(383): operator++ ignored
/usr/include/zypp/Date.h:77: Warning(384): operator-- ignored
/usr/include/zypp/Date.h:79: Warning(383): operator++ ignored
/usr/include/zypp/Date.h:80: Warning(384): operator-- ignored
/usr/include/zypp/Dep.h:32: Warning(378): operator!= ignored
/usr/include/zypp/Capability.h:202: Warning(312): Nested class not currently
supported (ignored)
/usr/include/zypp/CapMatch.h:59: Warning(378): operator!= ignored
/usr/include/zypp/CapMatch.h:66: Warning(361): operator! ignored
/usr/include/zypp/CapMatch.h:76: Warning(381): operator&& ignored
/usr/include/zypp/CapMatch.h:86: Warning(382): operator|| ignored
/usr/include/zypp/repo/RepoType.h:65: Warning(378): operator!= ignored
/usr/include/zypp/sat/Solvable.h:206: Warning(389): operator[] ignored
(consider using %extend)
/usr/include/zypp/sat/Solvable.h:277: Warning(312): Nested class not currently
supported (ignored).
/usr/include/zypp/sat/Solvable.h:307: Warning(378): operator!= ignored
/usr/include/zypp/Resolvable.h:100: Warning(389): operator[] ignored (consider
using %extend)
/usr/include/zypp/RepoStatus.h:137: Warning(381): operator&& ignored
/tmp/rpmbuild/libzypp-bindings-0.5.3/swig/KeyRing.i:13: Warning(302):
Identifier 'KeyRing_Ptr' redefined (ignored),
/usr/include/zypp/KeyRing.h:33: Warning(302): previous definition of
'KeyRing_Ptr'.
/tmp/rpmbuild/libzypp-bindings-0.5.3/swig/Target.i:9: Warning(302): Identifier
'Target_Ptr' redefined (ignored),
/usr/include/zypp/Target.h:41: Warning(302): previous definition of
'Target_Ptr'.
/tmp/rpmbuild/libzypp-bindings-0.5.3/swig/KeyRing.i:9: Warning(303): %extend
defined for an undeclared class zypp::KeyRing.
/usr/include/zypp/CheckSum.h:26: Warning(401): Nothing known about base class
'Exception'. Ignored.
/usr/include/zypp/Date.h:118: Warning(401): Nothing known about base class
'Exception'. Ignored.
/usr/include/zypp/Capabilities.h:98: Warning(401): Nothing known about base
class 'boost::iterator_adaptor< const_iterator,sat::detail::IdType const
*,Capability const,boost::forward_traversal_tag,Capability const >'. Ignored.
/usr/include/zypp/Capabilities.h:98: Warning(401): Maybe you forgot to
instantiate 'boost::iterator_adaptor< const_iterator,sat::detail::IdType const
*,Capability const,boost::forward_traversal_tag,Capability const >' using
%template.
/usr/include/zypp/sat/Solvable.h:336: Warning(401): Nothing known about base
class 'boost::iterator_adaptor< SolvableIterator,::_Solvable *,Solvable
const,boost::forward_traversal_tag,Solvable const >'. Ignored.
/usr/include/zypp/sat/Solvable.h:336: Warning(401): Maybe you forgot to
instantiate 'boost::iterator_adaptor< SolvableIterator,::_Solvable *,Solvable
const,boost::forward_traversal_tag,Solvable const >' using %template.
/usr/include/zypp/Patch.h:157: Warning(401): Nothing known about base class
'boost::iterator_adaptor<
Patch::ReferenceIterator,sat::LookupAttr::iterator,int,boost::forward_traversal_tag,int
'. Ignored.
/usr/include/zypp/Patch.h:157: Warning(401): Maybe you forgot to instantiate
'boost::iterator_adaptor<
Patch::ReferenceIterator,sat::LookupAttr::iterator,int,boost::forward_traversal_tag,int
' using %template.
/usr/include/zypp/Repository.h:328: Warning(401): Nothing known about base
class 'boost::iterator_adaptor<
Repository::ProductInfoIterator,sat::LookupAttr::iterator,int,boost::forward_traversal_tag,int
'. Ignored.
/usr/include/zypp/Repository.h:328: Warning(401): Maybe you forgot to
instantiate 'boost::iterator_adaptor<
Repository::ProductInfoIterator,sat::LookupAttr::iterator,int,boost::forward_traversal_tag,int
' using %template.
/usr/include/zypp/Repository.h:409: Warning(401): Nothing known about base
class 'boost::iterator_adaptor< RepositoryIterator,::_Repo
**,Repository,boost::forward_traversal_tag,Repository >'. Ignored.
/usr/include/zypp/Repository.h:409: Warning(401): Maybe you forgot to
instantiate 'boost::iterator_adaptor< RepositoryIterator,::_Repo
**,Repository,boost::forward_traversal_tag,Repository >' using %template.
/usr/include/zypp/PublicKey.h:39: Warning(401): Nothing known about base class
'Exception'. Ignored.
/usr/include/zypp/KeyRing.h:45: Warning(401): Nothing known about base class
'callback::ReportBase'. Ignored.
/usr/include/zypp/KeyRing.h:99: Warning(401): Nothing known about base class
'callback::ReportBase'. Ignored.
/usr/include/zypp/KeyRing.h:107: Warning(401): Nothing known about base class
'Exception'. Ignored.
/usr/include/zypp/Target.h:50: Warning(401): Nothing known about base class
'base::NonCopyable'. Ignored.
/usr/include/zypp/ZYppFactory.h:25: Warning(401): Nothing known about base
class 'Exception'. Ignored.
/usr/include/zypp/PoolItem.h:107: Warning(508): Declaration of 'satSolvable'
shadows declaration accessible via operator->(),
/usr/include/zypp/Resolvable.h:138: Warning(508): previous declaration of
'satSolvable'.
/usr/include/boost/smart_ptr/intrusive_ptr.hpp:133: Warning(508): Declaration
of 'reset' shadows declaration accessible via operator->(),
/usr/include/zypp/Resolver.h:108: Warning(508): previous declaration of 'reset'.
/usr/include/zypp/IdString.h:223: Warning(503): Can't wrap '::zypp::IdString'
unless renamed to a valid identifier.
/usr/include/zypp/ByteCount.h:32: Warning(503): Can't wrap 'operator <<' unless
renamed to a valid identifier.
/usr/include/zypp/ByteCount.h:86: Warning(503): Can't wrap 'operator size_type'
unless renamed to a valid identifier.
/usr/include/zypp/Date.h:33: Warning(503): Can't wrap 'operator <<' unless
renamed to a valid identifier.
/usr/include/zypp/Date.h:65: Warning(503): Can't wrap 'operator value_type'
unless renamed to a valid identifier.
/usr/include/zypp/Dep.h:31: Warning(503): Can't wrap 'operator ==' unless
renamed to a valid identifier.
/usr/include/zypp/Dep.h:34: Warning(503): Can't wrap 'operator <' unless
renamed to a valid identifier.
/usr/include/zypp/Capability.h:380: Warning(503): Can't wrap
'::zypp::Capability' unless renamed to a valid identifier.
/usr/include/zypp/Capabilities.h:98: Warning(503): Can't wrap class
Zypp::Capabilities::constIterator unless renamed to a valid identifier.
/usr/include/zypp/CapMatch.h:56: Warning(503): Can't wrap 'operator ==' unless
renamed to a valid identifier.
/usr/include/zypp/CapMatch.h:88: Warning(503): Can't wrap 'operator <<' unless
renamed to a valid identifier.
/usr/include/zypp/repo/RepoInfoBase.h:38: Warning(503): Can't wrap 'operator
<<' unless renamed to a valid identifier.
/usr/include/zypp/RepoInfo.h:68: Warning(503): Can't wrap 'operator <<' unless
renamed to a valid identifier.
/usr/include/zypp/ResStatus.h:55: Warning(503): Can't wrap 'operator <<' unless
renamed to a valid identifier.
/usr/include/zypp/ResStatus.h:56: Warning(503): Can't wrap 'operator ==' unless
renamed to a valid identifier.
/usr/include/zypp/Resolvable.h:42: Warning(503): Can't wrap 'operator <<'
unless renamed to a valid identifier.
/usr/include/zypp/ResObject.h:196: Warning(503): Can't wrap
'zypp::make_res_object' unless renamed to a valid identifier.
/usr/include/zypp/Package.h:122: Warning(503): Can't wrap 'zypp::make<(self)>'
unless renamed to a valid identifier.
/usr/include/zypp/Patch.h:157: Warning(503): Can't wrap class
Zypp::Patch::ReferenceIterator unless renamed to a valid identifier.
/usr/include/zypp/Product.h:171: Warning(503): Can't wrap class
Zypp::Product::UrlList unless renamed to a valid identifier.
/usr/include/zypp/Repository.h:328: Warning(503): Can't wrap class
Zypp::Repository::ProductInfoIterator unless renamed to a valid identifier.
/usr/include/zypp/Repository.h:388: Warning(503): Can't wrap class
Zypp::Repository::EraseFromPool unless renamed to a valid identifier.
/usr/include/zypp/RepoStatus.h:39: Warning(503): Can't wrap 'operator <<'
unless renamed to a valid identifier.
/usr/include/zypp/RepoManager.h:109: Warning(503): Can't wrap 'operator <<'
unless renamed to a valid identifier.
/usr/include/zypp/PublicKey.h:78: Warning(503): Can't wrap 'operator <<' unless
renamed to a valid identifier.
/usr/include/zypp/KeyRing.h:134: Warning(503): Can't wrap 'operator <<' unless
renamed to a valid identifier.
/usr/include/zypp/Target.h:188: Warning(503): Can't wrap 'operator <<' unless
renamed to a valid identifier.
/usr/include/zypp/MediaSetAccess.h:79: Warning(503): Can't wrap 'operator <<'
unless renamed to a valid identifier.
/usr/include/zypp/PoolItem.h:52: Warning(503): Can't wrap 'operator <<' unless
renamed to a valid identifier.
/usr/include/zypp/PoolItem.h:124: Warning(503): Can't wrap 'operator
res_object::const_ptr' unless renamed to a valid identifier.
/usr/include/zypp/PoolItem.h:133: Warning(503): Can't wrap 'operator
res_object::const_ptr::unspecified_bool_type' unless renamed to a valid
identifier.
/usr/include/zypp/ResPool.h:49: Warning(503): Can't wrap 'operator <<' unless
renamed to a valid identifier.
/usr/include/zypp/TmpPath.h:62: Warning(503): Can't wrap 'operator const void*'
unless renamed to a valid identifier.
/usr/include/zypp/TmpPath.h:74: Warning(503): Can't wrap 'operator pathname'
unless renamed to a valid identifier.
/usr/include/zypp/ZYppFactory.h:41: Warning(503): Can't wrap 'operator <<'
unless renamed to a valid identifier.
cd /tmp/rpmbuild/libzypp-bindings-0.5.3/build/swig/ruby && /usr/bin/cmake -E
echo Done.
Done.
cd /tmp/rpmbuild/libzypp-bindings-0.5.3/build && /usr/bin/cmake -E
cmake_depends "Unix Makefiles" /tmp/rpmbuild/libzypp-bindings-0.5.3
/tmp/rpmbuild/libzypp-bindings-0.5.3/swig/ruby
/tmp/rpmbuild/libzypp-bindings-0.5.3/build
/tmp/rpmbuild/libzypp-bindings-0.5.3/build/swig/ruby
/tmp/rpmbuild/libzypp-bindings-0.5.3/build/swig/ruby/CMakeFiles/zypp_ruby.dir/DependInfo.cmake
--color=
Scanning dependencies of target zypp_ruby
make[2]: Leaving directory `/tmp/rpmbuild/libzypp-bindings-0.5.3/build'
make -f swig/ruby/CMakeFiles/zypp_ruby.dir/build.make
swig/ruby/CMakeFiles/zypp_ruby.dir/build
make[2]: Entering directory `/tmp/rpmbuild/libzypp-bindings-0.5.3/build'
/usr/bin/cmake -E cmake_progress_report
/tmp/rpmbuild/libzypp-bindings-0.5.3/build/CMakeFiles 5
[ 33%] Building CXX object
swig/ruby/CMakeFiles/zypp_ruby.dir/satsolver_ruby.cc.o
cd /tmp/rpmbuild/libzypp-bindings-0.5.3/build/swig/ruby &&
/opt/icecream/bin/g++ -Dzypp_ruby_EXPORTS -fPIC -fno-strict-aliasing
-fmessage-length=0 -O2 -Wall -D_FORTIFY_SOURCE=2 -fstack-protector
-funwind-tables -fasynchronous-unwind-tables -fPIC
-I/tmp/rpmbuild/libzypp-bindings-0.5.3
-I/tmp/rpmbuild/libzypp-bindings-0.5.3/build -I/usr/lib64/ruby/1.8/x86_64-linux
-o CMakeFiles/zypp_ruby.dir/satsolver_ruby.cc.o -c
/tmp/rpmbuild/libzypp-bindings-0.5.3/build/swig/ruby/satsolver_ruby.cc
/tmp/rpmbuild/libzypp-bindings-0.5.3/build/swig/ruby/satsolver_ruby.cc:3190:13:
error: 'DistributionLabel' in class 'zypp::Target' does not name a type
/tmp/rpmbuild/libzypp-bindings-0.5.3/build/swig/ruby/satsolver_ruby.cc: In
function 'VALUE _wrap_Product_constPtr_type(int, VALUE*, VALUE)':
/tmp/rpmbuild/libzypp-bindings-0.5.3/build/swig/ruby/satsolver_ruby.cc:61311:30:
warning: 'std::string zypp::Product::type() const' is deprecated (declared at
/usr/include/zypp/Product.h:97)
/tmp/rpmbuild/libzypp-bindings-0.5.3/build/swig/ruby/satsolver_ruby.cc: In
function 'VALUE _wrap_Product_Ptr_type(int, VALUE*, VALUE)':
/tmp/rpmbuild/libzypp-bindings-0.5.3/build/swig/ruby/satsolver_ruby.cc:64436:30:
warning: 'std::string zypp::Product::type() const' is deprecated (declared at
/usr/include/zypp/Product.h:97)
/tmp/rpmbuild/libzypp-bindings-0.5.3/build/swig/ruby/satsolver_ruby.cc: In
function 'VALUE _wrap_Product_type(int, VALUE*, VALUE)':
/tmp/rpmbuild/libzypp-bindings-0.5.3/build/swig/ruby/satsolver_ruby.cc:74853:52:
warning: 'std::string zypp::Product::type() const' is deprecated (declared at
/usr/include/zypp/Product.h:97)
/tmp/rpmbuild/libzypp-bindings-0.5.3/build/swig/ruby/satsolver_ruby.cc: In
function 'VALUE _wrap_new_DistributionLabel(int, VALUE*, VALUE)':
/tmp/rpmbuild/libzypp-bindings-0.5.3/build/swig/ruby/satsolver_ruby.cc:87140:3:
error: 'DistributionLabel' is not a member of 'zypp'
/tmp/rpmbuild/libzypp-bindings-0.5.3/build/swig/ruby/satsolver_ruby.cc:87140:28:
error: 'result' was not declared in this scope
/tmp/rpmbuild/libzypp-bindings-0.5.3/build/swig/ruby/satsolver_ruby.cc:87147:17:
error: 'DistributionLabel' is not a member of 'zypp'
/tmp/rpmbuild/libzypp-bindings-0.5.3/build/swig/ruby/satsolver_ruby.cc:87147:42:
error: expected primary-expression before ')' token
/tmp/rpmbuild/libzypp-bindings-0.5.3/build/swig/ruby/satsolver_ruby.cc:87147:43:
error: expected ';' before 'new'
/tmp/rpmbuild/libzypp-bindings-0.5.3/build/swig/ruby/satsolver_ruby.cc: At
global scope:
/tmp/rpmbuild/libzypp-bindings-0.5.3/build/swig/ruby/satsolver_ruby.cc:87163:35:
error: variable or field 'free_zypp_DistributionLabel' declared void
/tmp/rpmbuild/libzypp-bindings-0.5.3/build/swig/ruby/satsolver_ruby.cc:87163:29:
error: 'DistributionLabel' is not a member of 'zypp'
/tmp/rpmbuild/libzypp-bindings-0.5.3/build/swig/ruby/satsolver_ruby.cc:87163:54:
error: 'arg1' was not declared in this scope
/tmp/rpmbuild/libzypp-bindings-0.5.3/build/swig/ruby/satsolver_ruby.cc: In
function 'void Init_zypp()':
/tmp/rpmbuild/libzypp-bindings-0.5.3/build/swig/ruby/satsolver_ruby.cc:111537:59:
error: 'free_zypp_DistributionLabel' was not declared in this scope
make[2]: *** [swig/ruby/CMakeFiles/zypp_ruby.dir/satsolver_ruby.cc.o] Error 1
make[2]: Leaving directory `/tmp/rpmbuild/libzypp-bindings-0.5.3/build'
make[1]: *** [swig/ruby/CMakeFiles/zypp_ruby.dir/all] Error 2
make[1]: Leaving directory `/tmp/rpmbuild/libzypp-bindings-0.5.3/build'
make: *** [all] Error 2
error: Bad exit status from /var/tmp/rpm-tmp.V0KLTQ (%build)


RPM build errors:
Bad exit status from /var/tmp/rpm-tmp.V0KLTQ (%build)

( )
( ) (
) _ )
( \_
_(_\ \)__
(____\___))

build failed

stopping dbus..
Shutting down D-Bus daemon..done
... unmounting sys
... unmounting proc
... unmounting pts
[locks-and-latches] Releasing all the locks
[locks-and-latches] All the locks released
Archiving artifacts

--
To unsubscribe, e-mail: zypp-commit+unsubscribe@xxxxxxxxxxxx
For additional commands, e-mail: zypp-commit+help@xxxxxxxxxxxx

< Previous Next >