Mailinglist Archive: zypp-commit (233 mails)

< Previous Next >
[zypp-commit] Build failed in Hudson: libzypp-head-i586 #788
See http://yast.suse.de:3334/job/libzypp-head-i586/788/changes

Changes:

[Michael Andres] MediaException: Don't let untranslated default args
shaddow translated error messages.

------------------------------------------
[...truncated 30 lines...]

-- Libraries will be installed in /usr/lib
-- Config files will be installed in /etc
** Manual files will be installed in /usr/share/man
-- Writing spec file...
-- I hate you rpm-lint...!!!
-- rpm found: includes in /usr/include, library in /usr/lib/librpm.so (suspect
4.x)
-- rpm found: enable rpm-4.4 legacy interface.
-- boost found: includes in /usr/include, library in /usr/lib
-- Found Gettext:
-- hal found: includes in /usr/include, library in /usr/lib/libhal.so
-- dbus found: includes in /usr/include/dbus-1.0, library in
/usr/lib/libdbus-1.so
-- curl found: includes in /usr/include, library in /usr/lib/libcurl.so
-- libxml found: includes in /usr/include, library in /usr/lib/libxml2.so
-- satsolver found: includes in /usr/include, library in
/usr/lib/libsatsolver.a /usr/lib/libsatsolverext.a
-- doxygen found: /usr/bin/doxygen
-- soname: 619.3.3
-- version: 6.22.3
-- Writing pkg-config file...
-- FindZypp.cmake will be installed in /usr/share/cmake/Modules
-- zypp.conf will be installed in /etc/zypp
-- systemCheck will be installed in /etc/zypp
-- zsync not found
WARNING qt3 not found
-- Configuring done
-- Generating done
-- Build files have been written to: /build/libzypp
exit code: 0 ... good, lets continue
Built target svncheck
Run CPack packaging tool for source...
CPack: Create package using TBZ2
CPack: Install projects
CPack: - Install directory: /src/libzypp
CPack: Compress package
CPack: Finalize package
CPack: Package /build/libzypp/libzypp-6.22.3.tar.bz2 generated.
Built target srcpackage
exit code: 0 ... good, lets continue
exit code: 0 ... good, lets continue
Executing(%prep): /bin/sh -e /var/tmp/rpm-tmp.vxF46U
+ umask 022
+ cd /tmp/rpmbuild
+ cd /tmp/rpmbuild
+ rm -rf libzypp-6.22.3
+ /usr/bin/bzip2 -dc /build/libzypp/package/libzypp-6.22.3.tar.bz2
+ /bin/tar -xf -
+ STATUS=0
+ '[' 0 -ne 0 ']'
+ cd libzypp-6.22.3
+ /bin/chmod -Rf a+rX,u+w,g-w,o-w .
+ exit 0
Executing(%build): /bin/sh -e /var/tmp/rpm-tmp.JfwvRY
+ umask 022
+ cd /tmp/rpmbuild
+ /bin/rm -rf /usr/src/packages/BUILDROOT/libzypp-6.22.3-0.i386
++ dirname /usr/src/packages/BUILDROOT/libzypp-6.22.3-0.i386
+ /bin/mkdir -p /usr/src/packages/BUILDROOT
+ /bin/mkdir /usr/src/packages/BUILDROOT/libzypp-6.22.3-0.i386
+ cd libzypp-6.22.3
+ mkdir build
+ cd build
+ export 'CFLAGS=-fomit-frame-pointer -fmessage-length=0 -O2 -Wall
-D_FORTIFY_SOURCE=2 -fstack-protector -funwind-tables
-fasynchronous-unwind-tables -g'
+ CFLAGS='-fomit-frame-pointer -fmessage-length=0 -O2 -Wall -D_FORTIFY_SOURCE=2
-fstack-protector -funwind-tables -fasynchronous-unwind-tables -g'
+ export 'CXXFLAGS=-fomit-frame-pointer -fmessage-length=0 -O2 -Wall
-D_FORTIFY_SOURCE=2 -fstack-protector -funwind-tables
-fasynchronous-unwind-tables -g'
+ CXXFLAGS='-fomit-frame-pointer -fmessage-length=0 -O2 -Wall
-D_FORTIFY_SOURCE=2 -fstack-protector -funwind-tables
-fasynchronous-unwind-tables -g'
+ cmake -DCMAKE_INSTALL_PREFIX=/usr -DDOC_INSTALL_DIR=/usr/share/doc/packages
-DLIB=lib -DCMAKE_BUILD_TYPE=Release -DCMAKE_SKIP_RPATH=1 ..
-- The C compiler identification is GNU
-- The CXX compiler identification is GNU
-- Check for working C compiler: /opt/icecream/bin/gcc
-- Check for working C compiler: /opt/icecream/bin/gcc -- works
-- Detecting C compiler ABI info
-- Detecting C compiler ABI info - done
-- Check for working CXX compiler: /opt/icecream/bin/g++
-- Check for working CXX compiler: /opt/icecream/bin/g++ -- works
-- Detecting CXX compiler ABI info
-- Detecting CXX compiler ABI info - done
-- Libraries will be installed in /usr/lib
-- Config files will be installed in /etc
** Manual files will be installed in /usr/share/man
-- Writing spec file...
-- I hate you rpm-lint...!!!
-- rpm found: includes in /usr/include, library in /usr/lib/librpm.so (suspect
4.x)
-- rpm found: enable rpm-4.4 legacy interface.
-- Boost version: 1.39.0
-- Found the following Boost libraries:
-- boost found: includes in /usr/include, library in /usr/lib
-- Found Gettext:
-- hal found: includes in /usr/include, library in /usr/lib/libhal.so
-- dbus found: includes in /usr/include/dbus-1.0, library in
/usr/lib/libdbus-1.so
-- curl found: includes in /usr/include, library in /usr/lib/libcurl.so
-- libxml found: includes in /usr/include, library in /usr/lib/libxml2.so
-- Found ZLIB: /usr/lib/libz.so
-- satsolver found: includes in /usr/include, library in
/usr/lib/libsatsolver.a /usr/lib/libsatsolverext.a
-- Found EXPAT: /usr/lib/libexpat.so
-- Found libcrypto: /usr/lib/libcrypto.so
-- Found OpenSSL: /usr/lib/libssl.so
-- doxygen found: /usr/bin/doxygen
-- soname: 619.3.3
-- version: 6.22.3
-- Writing pkg-config file...
-- FindZypp.cmake will be installed in /usr/share/cmake/Modules
-- zypp.conf will be installed in /etc/zypp
-- systemCheck will be installed in /etc/zypp
-- zsync not found
WARNING qt3 not found
-- CTest cannot determine repository type. Please set UPDATE_TYPE to 'cvs' or
'svn'. CTest update will not work.
-- Configuring done
-- Generating done
-- Build files have been written to: /tmp/rpmbuild/libzypp-6.22.3/build
+ make VERBOSE=1
/usr/bin/cmake -H/tmp/rpmbuild/libzypp-6.22.3
-B/tmp/rpmbuild/libzypp-6.22.3/build --check-build-system
CMakeFiles/Makefile.cmake 0
/usr/bin/cmake -E cmake_progress_start
/tmp/rpmbuild/libzypp-6.22.3/build/CMakeFiles
/tmp/rpmbuild/libzypp-6.22.3/build/CMakeFiles/progress.make
make -f CMakeFiles/Makefile2 all
make[1]: Entering directory `/tmp/rpmbuild/libzypp-6.22.3/build'
make -f zypp/CMakeFiles/zypp.dir/build.make zypp/CMakeFiles/zypp.dir/depend
make[2]: Entering directory `/tmp/rpmbuild/libzypp-6.22.3/build'
cd /tmp/rpmbuild/libzypp-6.22.3/build && /usr/bin/cmake -E cmake_depends "Unix
Makefiles" /tmp/rpmbuild/libzypp-6.22.3 /tmp/rpmbuild/libzypp-6.22.3/zypp
/tmp/rpmbuild/libzypp-6.22.3/build /tmp/rpmbuild/libzypp-6.22.3/build/zypp
/tmp/rpmbuild/libzypp-6.22.3/build/zypp/CMakeFiles/zypp.dir/DependInfo.cmake
--color=
Dependee
"/tmp/rpmbuild/libzypp-6.22.3/build/zypp/CMakeFiles/zypp.dir/DependInfo.cmake"
is newer than depender
"/tmp/rpmbuild/libzypp-6.22.3/build/zypp/CMakeFiles/zypp.dir/depend.internal".
Scanning dependencies of target zypp
make[2]: Leaving directory `/tmp/rpmbuild/libzypp-6.22.3/build'
make -f zypp/CMakeFiles/zypp.dir/build.make zypp/CMakeFiles/zypp.dir/build
make[2]: Entering directory `/tmp/rpmbuild/libzypp-6.22.3/build'
/usr/bin/cmake -E cmake_progress_report
/tmp/rpmbuild/libzypp-6.22.3/build/CMakeFiles
[ 0%] Building CXX object zypp/CMakeFiles/zypp.dir/misc/DefaultLoadSystem.cc.o
cd /tmp/rpmbuild/libzypp-6.22.3/build/zypp && /opt/icecream/bin/g++
-Dzypp_EXPORTS -D_FILE_OFFSET_BITS=64 -DVERSION=\"6.22.3\" -D_RPM_4_4_COMPAT
-DLOCALEDIR=\"/usr/share/locale\" -DTEXTDOMAIN=\"zypp\" -fomit-frame-pointer
-fmessage-length=0 -O2 -Wall -D_FORTIFY_SOURCE=2 -fstack-protector
-funwind-tables -fasynchronous-unwind-tables -g -fPIC -g -Wall
-Werror=format-security -Woverloaded-virtual -Wnon-virtual-dtor -Wl,-as-needed
-fomit-frame-pointer -fmessage-length=0 -O2 -Wall -D_FORTIFY_SOURCE=2
-fstack-protector -funwind-tables -fasynchronous-unwind-tables -g -fPIC -g
-Wall -Werror=format-security -Woverloaded-virtual -Wnon-virtual-dtor
-Wl,-as-needed -O3 -fPIC -I/tmp/rpmbuild/libzypp-6.22.3
-I/tmp/rpmbuild/libzypp-6.22.3/build -I/usr/include/rpm -I/usr/include/hal
-I/usr/include/dbus-1.0 -I/usr/lib/dbus-1.0/include
-I/tmp/rpmbuild/libzypp-6.22.3/build/zypp
-DZYPP_BASE_LOGGER_LOGGROUP=\"zypp\" -o
CMakeFiles/zypp.dir/misc/DefaultLoadSystem.cc.o -c
/tmp/rpmbuild/libzypp-6.22.3/zypp/misc/DefaultLoadSystem.cc
In file included from
/tmp/rpmbuild/libzypp-6.22.3/zypp/misc/DefaultLoadSystem.cc:20:
/tmp/rpmbuild/libzypp-6.22.3/zypp/zypp_detail/ZYppReadOnlyHack.h:15:2: warning:
#warning ZYPP_ZYPP_DETAIL_ZYPPREADONLYHACK_H
/tmp/rpmbuild/libzypp-6.22.3/zypp/misc/DefaultLoadSystem.cc: In function 'void
zypp::misc::defaultLoadSystem(const zypp::filesystem::Pathname&,
zypp::misc::LoadSystemFlags)':
/tmp/rpmbuild/libzypp-6.22.3/zypp/misc/DefaultLoadSystem.cc:48: warning: 'void
zypp::zypp_readonly_hack::IWantIt()' is deprecated (declared at
/tmp/rpmbuild/libzypp-6.22.3/zypp/zypp_detail/ZYppReadOnlyHack.h:26)
/tmp/rpmbuild/libzypp-6.22.3/zypp/misc/DefaultLoadSystem.cc:48: warning: 'void
zypp::zypp_readonly_hack::IWantIt()' is deprecated (declared at
/tmp/rpmbuild/libzypp-6.22.3/zypp/zypp_detail/ZYppReadOnlyHack.h:26)
/usr/bin/cmake -E cmake_progress_report
/tmp/rpmbuild/libzypp-6.22.3/build/CMakeFiles
[ 0%] Building CXX object zypp/CMakeFiles/zypp.dir/misc/CheckAccessDeleted.cc.o
cd /tmp/rpmbuild/libzypp-6.22.3/build/zypp && /opt/icecream/bin/g++
-Dzypp_EXPORTS -D_FILE_OFFSET_BITS=64 -DVERSION=\"6.22.3\" -D_RPM_4_4_COMPAT
-DLOCALEDIR=\"/usr/share/locale\" -DTEXTDOMAIN=\"zypp\" -fomit-frame-pointer
-fmessage-length=0 -O2 -Wall -D_FORTIFY_SOURCE=2 -fstack-protector
-funwind-tables -fasynchronous-unwind-tables -g -fPIC -g -Wall
-Werror=format-security -Woverloaded-virtual -Wnon-virtual-dtor -Wl,-as-needed
-fomit-frame-pointer -fmessage-length=0 -O2 -Wall -D_FORTIFY_SOURCE=2
-fstack-protector -funwind-tables -fasynchronous-unwind-tables -g -fPIC -g
-Wall -Werror=format-security -Woverloaded-virtual -Wnon-virtual-dtor
-Wl,-as-needed -O3 -fPIC -I/tmp/rpmbuild/libzypp-6.22.3
-I/tmp/rpmbuild/libzypp-6.22.3/build -I/usr/include/rpm -I/usr/include/hal
-I/usr/include/dbus-1.0 -I/usr/lib/dbus-1.0/include
-I/tmp/rpmbuild/libzypp-6.22.3/build/zypp
-DZYPP_BASE_LOGGER_LOGGROUP=\"zypp\" -o
CMakeFiles/zypp.dir/misc/CheckAccessDeleted.cc.o -c
/tmp/rpmbuild/libzypp-6.22.3/zypp/misc/CheckAccessDeleted.cc
/usr/bin/cmake -E cmake_progress_report
/tmp/rpmbuild/libzypp-6.22.3/build/CMakeFiles
[ 0%] Building CXX object
zypp/CMakeFiles/zypp.dir/pool/GetResolvablesToInsDel.cc.o
cd /tmp/rpmbuild/libzypp-6.22.3/build/zypp && /opt/icecream/bin/g++
-Dzypp_EXPORTS -D_FILE_OFFSET_BITS=64 -DVERSION=\"6.22.3\" -D_RPM_4_4_COMPAT
-DLOCALEDIR=\"/usr/share/locale\" -DTEXTDOMAIN=\"zypp\" -fomit-frame-pointer
-fmessage-length=0 -O2 -Wall -D_FORTIFY_SOURCE=2 -fstack-protector
-funwind-tables -fasynchronous-unwind-tables -g -fPIC -g -Wall
-Werror=format-security -Woverloaded-virtual -Wnon-virtual-dtor -Wl,-as-needed
-fomit-frame-pointer -fmessage-length=0 -O2 -Wall -D_FORTIFY_SOURCE=2
-fstack-protector -funwind-tables -fasynchronous-unwind-tables -g -fPIC -g
-Wall -Werror=format-security -Woverloaded-virtual -Wnon-virtual-dtor
-Wl,-as-needed -O3 -fPIC -I/tmp/rpmbuild/libzypp-6.22.3
-I/tmp/rpmbuild/libzypp-6.22.3/build -I/usr/include/rpm -I/usr/include/hal
-I/usr/include/dbus-1.0 -I/usr/lib/dbus-1.0/include
-I/tmp/rpmbuild/libzypp-6.22.3/build/zypp
-DZYPP_BASE_LOGGER_LOGGROUP=\"zypp\" -o
CMakeFiles/zypp.dir/pool/GetResolvablesToInsDel.cc.o -c
/tmp/rpmbuild/libzypp-6.22.3/zypp/pool/GetResolvablesToInsDel.cc
/usr/bin/cmake -E cmake_progress_report
/tmp/rpmbuild/libzypp-6.22.3/build/CMakeFiles 1
[ 1%] Building CXX object zypp/CMakeFiles/zypp.dir/pool/PoolImpl.cc.o
cd /tmp/rpmbuild/libzypp-6.22.3/build/zypp && /opt/icecream/bin/g++
-Dzypp_EXPORTS -D_FILE_OFFSET_BITS=64 -DVERSION=\"6.22.3\" -D_RPM_4_4_COMPAT
-DLOCALEDIR=\"/usr/share/locale\" -DTEXTDOMAIN=\"zypp\" -fomit-frame-pointer
-fmessage-length=0 -O2 -Wall -D_FORTIFY_SOURCE=2 -fstack-protector
-funwind-tables -fasynchronous-unwind-tables -g -fPIC -g -Wall
-Werror=format-security -Woverloaded-virtual -Wnon-virtual-dtor -Wl,-as-needed
-fomit-frame-pointer -fmessage-length=0 -O2 -Wall -D_FORTIFY_SOURCE=2
-fstack-protector -funwind-tables -fasynchronous-unwind-tables -g -fPIC -g
-Wall -Werror=format-security -Woverloaded-virtual -Wnon-virtual-dtor
-Wl,-as-needed -O3 -fPIC -I/tmp/rpmbuild/libzypp-6.22.3
-I/tmp/rpmbuild/libzypp-6.22.3/build -I/usr/include/rpm -I/usr/include/hal
-I/usr/include/dbus-1.0 -I/usr/lib/dbus-1.0/include
-I/tmp/rpmbuild/libzypp-6.22.3/build/zypp
-DZYPP_BASE_LOGGER_LOGGROUP=\"zypp\" -o CMakeFiles/zypp.dir/pool/PoolImpl.cc.o
-c /tmp/rpmbuild/libzypp-6.22.3/zypp/pool/PoolImpl.cc
/usr/bin/cmake -E cmake_progress_report
/tmp/rpmbuild/libzypp-6.22.3/build/CMakeFiles
[ 1%] Building CXX object zypp/CMakeFiles/zypp.dir/pool/PoolStats.cc.o
cd /tmp/rpmbuild/libzypp-6.22.3/build/zypp && /opt/icecream/bin/g++
-Dzypp_EXPORTS -D_FILE_OFFSET_BITS=64 -DVERSION=\"6.22.3\" -D_RPM_4_4_COMPAT
-DLOCALEDIR=\"/usr/share/locale\" -DTEXTDOMAIN=\"zypp\" -fomit-frame-pointer
-fmessage-length=0 -O2 -Wall -D_FORTIFY_SOURCE=2 -fstack-protector
-funwind-tables -fasynchronous-unwind-tables -g -fPIC -g -Wall
-Werror=format-security -Woverloaded-virtual -Wnon-virtual-dtor -Wl,-as-needed
-fomit-frame-pointer -fmessage-length=0 -O2 -Wall -D_FORTIFY_SOURCE=2
-fstack-protector -funwind-tables -fasynchronous-unwind-tables -g -fPIC -g
-Wall -Werror=format-security -Woverloaded-virtual -Wnon-virtual-dtor
-Wl,-as-needed -O3 -fPIC -I/tmp/rpmbuild/libzypp-6.22.3
-I/tmp/rpmbuild/libzypp-6.22.3/build -I/usr/include/rpm -I/usr/include/hal
-I/usr/include/dbus-1.0 -I/usr/lib/dbus-1.0/include
-I/tmp/rpmbuild/libzypp-6.22.3/build/zypp
-DZYPP_BASE_LOGGER_LOGGROUP=\"zypp\" -o CMakeFiles/zypp.dir/pool/PoolStats.cc.o
-c /tmp/rpmbuild/libzypp-6.22.3/zypp/pool/PoolStats.cc
/usr/bin/cmake -E cmake_progress_report
/tmp/rpmbuild/libzypp-6.22.3/build/CMakeFiles
[ 1%] Building CXX object
zypp/CMakeFiles/zypp.dir/parser/susetags/RepoIndex.cc.o
cd /tmp/rpmbuild/libzypp-6.22.3/build/zypp && /opt/icecream/bin/g++
-Dzypp_EXPORTS -D_FILE_OFFSET_BITS=64 -DVERSION=\"6.22.3\" -D_RPM_4_4_COMPAT
-DLOCALEDIR=\"/usr/share/locale\" -DTEXTDOMAIN=\"zypp\" -fomit-frame-pointer
-fmessage-length=0 -O2 -Wall -D_FORTIFY_SOURCE=2 -fstack-protector
-funwind-tables -fasynchronous-unwind-tables -g -fPIC -g -Wall
-Werror=format-security -Woverloaded-virtual -Wnon-virtual-dtor -Wl,-as-needed
-fomit-frame-pointer -fmessage-length=0 -O2 -Wall -D_FORTIFY_SOURCE=2
-fstack-protector -funwind-tables -fasynchronous-unwind-tables -g -fPIC -g
-Wall -Werror=format-security -Woverloaded-virtual -Wnon-virtual-dtor
-Wl,-as-needed -O3 -fPIC -I/tmp/rpmbuild/libzypp-6.22.3
-I/tmp/rpmbuild/libzypp-6.22.3/build -I/usr/include/rpm -I/usr/include/hal
-I/usr/include/dbus-1.0 -I/usr/lib/dbus-1.0/include
-I/tmp/rpmbuild/libzypp-6.22.3/build/zypp
-DZYPP_BASE_LOGGER_LOGGROUP=\"zypp\" -o
CMakeFiles/zypp.dir/parser/susetags/RepoIndex.cc.o -c
/tmp/rpmbuild/libzypp-6.22.3/zypp/parser/susetags/RepoIndex.cc
/usr/bin/cmake -E cmake_progress_report
/tmp/rpmbuild/libzypp-6.22.3/build/CMakeFiles
[ 1%] Building CXX object
zypp/CMakeFiles/zypp.dir/parser/susetags/ContentFileReader.cc.o
cd /tmp/rpmbuild/libzypp-6.22.3/build/zypp && /opt/icecream/bin/g++
-Dzypp_EXPORTS -D_FILE_OFFSET_BITS=64 -DVERSION=\"6.22.3\" -D_RPM_4_4_COMPAT
-DLOCALEDIR=\"/usr/share/locale\" -DTEXTDOMAIN=\"zypp\" -fomit-frame-pointer
-fmessage-length=0 -O2 -Wall -D_FORTIFY_SOURCE=2 -fstack-protector
-funwind-tables -fasynchronous-unwind-tables -g -fPIC -g -Wall
-Werror=format-security -Woverloaded-virtual -Wnon-virtual-dtor -Wl,-as-needed
-fomit-frame-pointer -fmessage-length=0 -O2 -Wall -D_FORTIFY_SOURCE=2
-fstack-protector -funwind-tables -fasynchronous-unwind-tables -g -fPIC -g
-Wall -Werror=format-security -Woverloaded-virtual -Wnon-virtual-dtor
-Wl,-as-needed -O3 -fPIC -I/tmp/rpmbuild/libzypp-6.22.3
-I/tmp/rpmbuild/libzypp-6.22.3/build -I/usr/include/rpm -I/usr/include/hal
-I/usr/include/dbus-1.0 -I/usr/lib/dbus-1.0/include
-I/tmp/rpmbuild/libzypp-6.22.3/build/zypp
-DZYPP_BASE_LOGGER_LOGGROUP=\"zypp\" -o
CMakeFiles/zypp.dir/parser/susetags/ContentFileReader.cc.o -c
/tmp/rpmbuild/libzypp-6.22.3/zypp/parser/susetags/ContentFileReader.cc
/usr/bin/cmake -E cmake_progress_report
/tmp/rpmbuild/libzypp-6.22.3/build/CMakeFiles 2
[ 3%] Building CXX object zypp/CMakeFiles/zypp.dir/parser/xml/Node.cc.o
cd /tmp/rpmbuild/libzypp-6.22.3/build/zypp && /opt/icecream/bin/g++
-Dzypp_EXPORTS -D_FILE_OFFSET_BITS=64 -DVERSION=\"6.22.3\" -D_RPM_4_4_COMPAT
-DLOCALEDIR=\"/usr/share/locale\" -DTEXTDOMAIN=\"zypp\" -fomit-frame-pointer
-fmessage-length=0 -O2 -Wall -D_FORTIFY_SOURCE=2 -fstack-protector
-funwind-tables -fasynchronous-unwind-tables -g -fPIC -g -Wall
-Werror=format-security -Woverloaded-virtual -Wnon-virtual-dtor -Wl,-as-needed
-fomit-frame-pointer -fmessage-length=0 -O2 -Wall -D_FORTIFY_SOURCE=2
-fstack-protector -funwind-tables -fasynchronous-unwind-tables -g -fPIC -g
-Wall -Werror=format-security -Woverloaded-virtual -Wnon-virtual-dtor
-Wl,-as-needed -O3 -fPIC -I/tmp/rpmbuild/libzypp-6.22.3
-I/tmp/rpmbuild/libzypp-6.22.3/build -I/usr/include/rpm -I/usr/include/hal
-I/usr/include/dbus-1.0 -I/usr/lib/dbus-1.0/include
-I/tmp/rpmbuild/libzypp-6.22.3/build/zypp
-DZYPP_BASE_LOGGER_LOGGROUP=\"zypp\" -o
CMakeFiles/zypp.dir/parser/xml/Node.cc.o -c
/tmp/rpmbuild/libzypp-6.22.3/zypp/parser/xml/Node.cc
/usr/bin/cmake -E cmake_progress_report
/tmp/rpmbuild/libzypp-6.22.3/build/CMakeFiles
[ 3%] Building CXX object zypp/CMakeFiles/zypp.dir/parser/xml/ParseDef.cc.o
cd /tmp/rpmbuild/libzypp-6.22.3/build/zypp && /opt/icecream/bin/g++
-Dzypp_EXPORTS -D_FILE_OFFSET_BITS=64 -DVERSION=\"6.22.3\" -D_RPM_4_4_COMPAT
-DLOCALEDIR=\"/usr/share/locale\" -DTEXTDOMAIN=\"zypp\" -fomit-frame-pointer
-fmessage-length=0 -O2 -Wall -D_FORTIFY_SOURCE=2 -fstack-protector
-funwind-tables -fasynchronous-unwind-tables -g -fPIC -g -Wall
-Werror=format-security -Woverloaded-virtual -Wnon-virtual-dtor -Wl,-as-needed
-fomit-frame-pointer -fmessage-length=0 -O2 -Wall -D_FORTIFY_SOURCE=2
-fstack-protector -funwind-tables -fasynchronous-unwind-tables -g -fPIC -g
-Wall -Werror=format-security -Woverloaded-virtual -Wnon-virtual-dtor
-Wl,-as-needed -O3 -fPIC -I/tmp/rpmbuild/libzypp-6.22.3
-I/tmp/rpmbuild/libzypp-6.22.3/build -I/usr/include/rpm -I/usr/include/hal
-I/usr/include/dbus-1.0 -I/usr/lib/dbus-1.0/include
-I/tmp/rpmbuild/libzypp-6.22.3/build/zypp
-DZYPP_BASE_LOGGER_LOGGROUP=\"zypp\" -o
CMakeFiles/zypp.dir/parser/xml/ParseDef.cc.o -c
/tmp/rpmbuild/libzypp-6.22.3/zypp/parser/xml/ParseDef.cc
/usr/bin/cmake -E cmake_progress_report
/tmp/rpmbuild/libzypp-6.22.3/build/CMakeFiles
[ 3%] Building CXX object
zypp/CMakeFiles/zypp.dir/parser/xml/ParseDefConsume.cc.o
cd /tmp/rpmbuild/libzypp-6.22.3/build/zypp && /opt/icecream/bin/g++
-Dzypp_EXPORTS -D_FILE_OFFSET_BITS=64 -DVERSION=\"6.22.3\" -D_RPM_4_4_COMPAT
-DLOCALEDIR=\"/usr/share/locale\" -DTEXTDOMAIN=\"zypp\" -fomit-frame-pointer
-fmessage-length=0 -O2 -Wall -D_FORTIFY_SOURCE=2 -fstack-protector
-funwind-tables -fasynchronous-unwind-tables -g -fPIC -g -Wall
-Werror=format-security -Woverloaded-virtual -Wnon-virtual-dtor -Wl,-as-needed
-fomit-frame-pointer -fmessage-length=0 -O2 -Wall -D_FORTIFY_SOURCE=2
-fstack-protector -funwind-tables -fasynchronous-unwind-tables -g -fPIC -g
-Wall -Werror=format-security -Woverloaded-virtual -Wnon-virtual-dtor
-Wl,-as-needed -O3 -fPIC -I/tmp/rpmbuild/libzypp-6.22.3
-I/tmp/rpmbuild/libzypp-6.22.3/build -I/usr/include/rpm -I/usr/include/hal
-I/usr/include/dbus-1.0 -I/usr/lib/dbus-1.0/include
-I/tmp/rpmbuild/libzypp-6.22.3/build/zypp
-DZYPP_BASE_LOGGER_LOGGROUP=\"zypp\" -o
CMakeFiles/zypp.dir/parser/xml/ParseDefConsume.cc.o -c
/tmp/rpmbuild/libzypp-6.22.3/zypp/parser/xml/ParseDefConsume.cc
/usr/bin/cmake -E cmake_progress_report
/tmp/rpmbuild/libzypp-6.22.3/build/CMakeFiles 3
[ 5%] Building CXX object
zypp/CMakeFiles/zypp.dir/parser/xml/ParseDefException.cc.o
cd /tmp/rpmbuild/libzypp-6.22.3/build/zypp && /opt/icecream/bin/g++
-Dzypp_EXPORTS -D_FILE_OFFSET_BITS=64 -DVERSION=\"6.22.3\" -D_RPM_4_4_COMPAT
-DLOCALEDIR=\"/usr/share/locale\" -DTEXTDOMAIN=\"zypp\" -fomit-frame-pointer
-fmessage-length=0 -O2 -Wall -D_FORTIFY_SOURCE=2 -fstack-protector
-funwind-tables -fasynchronous-unwind-tables -g -fPIC -g -Wall
-Werror=format-security -Woverloaded-virtual -Wnon-virtual-dtor -Wl,-as-needed
-fomit-frame-pointer -fmessage-length=0 -O2 -Wall -D_FORTIFY_SOURCE=2
-fstack-protector -funwind-tables -fasynchronous-unwind-tables -g -fPIC -g
-Wall -Werror=format-security -Woverloaded-virtual -Wnon-virtual-dtor
-Wl,-as-needed -O3 -fPIC -I/tmp/rpmbuild/libzypp-6.22.3
-I/tmp/rpmbuild/libzypp-6.22.3/build -I/usr/include/rpm -I/usr/include/hal
-I/usr/include/dbus-1.0 -I/usr/lib/dbus-1.0/include
-I/tmp/rpmbuild/libzypp-6.22.3/build/zypp
-DZYPP_BASE_LOGGER_LOGGROUP=\"zypp\" -o
CMakeFiles/zypp.dir/parser/xml/ParseDefException.cc.o -c
/tmp/rpmbuild/libzypp-6.22.3/zypp/parser/xml/ParseDefException.cc
/usr/bin/cmake -E cmake_progress_report
/tmp/rpmbuild/libzypp-6.22.3/build/CMakeFiles
[ 5%] Building CXX object zypp/CMakeFiles/zypp.dir/parser/xml/Reader.cc.o
cd /tmp/rpmbuild/libzypp-6.22.3/build/zypp && /opt/icecream/bin/g++
-Dzypp_EXPORTS -D_FILE_OFFSET_BITS=64 -DVERSION=\"6.22.3\" -D_RPM_4_4_COMPAT
-DLOCALEDIR=\"/usr/share/locale\" -DTEXTDOMAIN=\"zypp\" -fomit-frame-pointer
-fmessage-length=0 -O2 -Wall -D_FORTIFY_SOURCE=2 -fstack-protector
-funwind-tables -fasynchronous-unwind-tables -g -fPIC -g -Wall
-Werror=format-security -Woverloaded-virtual -Wnon-virtual-dtor -Wl,-as-needed
-fomit-frame-pointer -fmessage-length=0 -O2 -Wall -D_FORTIFY_SOURCE=2
-fstack-protector -funwind-tables -fasynchronous-unwind-tables -g -fPIC -g
-Wall -Werror=format-security -Woverloaded-virtual -Wnon-virtual-dtor
-Wl,-as-needed -O3 -fPIC -I/tmp/rpmbuild/libzypp-6.22.3
-I/tmp/rpmbuild/libzypp-6.22.3/build -I/usr/include/rpm -I/usr/include/hal
-I/usr/include/dbus-1.0 -I/usr/lib/dbus-1.0/include
-I/tmp/rpmbuild/libzypp-6.22.3/build/zypp
-DZYPP_BASE_LOGGER_LOGGROUP=\"zypp\" -o
CMakeFiles/zypp.dir/parser/xml/Reader.cc.o -c
/tmp/rpmbuild/libzypp-6.22.3/zypp/parser/xml/Reader.cc
/usr/bin/cmake -E cmake_progress_report
/tmp/rpmbuild/libzypp-6.22.3/build/CMakeFiles
[ 5%] Building CXX object zypp/CMakeFiles/zypp.dir/parser/xml/XmlString.cc.o
cd /tmp/rpmbuild/libzypp-6.22.3/build/zypp && /opt/icecream/bin/g++
-Dzypp_EXPORTS -D_FILE_OFFSET_BITS=64 -DVERSION=\"6.22.3\" -D_RPM_4_4_COMPAT
-DLOCALEDIR=\"/usr/share/locale\" -DTEXTDOMAIN=\"zypp\" -fomit-frame-pointer
-fmessage-length=0 -O2 -Wall -D_FORTIFY_SOURCE=2 -fstack-protector
-funwind-tables -fasynchronous-unwind-tables -g -fPIC -g -Wall
-Werror=format-security -Woverloaded-virtual -Wnon-virtual-dtor -Wl,-as-needed
-fomit-frame-pointer -fmessage-length=0 -O2 -Wall -D_FORTIFY_SOURCE=2
-fstack-protector -funwind-tables -fasynchronous-unwind-tables -g -fPIC -g
-Wall -Werror=format-security -Woverloaded-virtual -Wnon-virtual-dtor
-Wl,-as-needed -O3 -fPIC -I/tmp/rpmbuild/libzypp-6.22.3
-I/tmp/rpmbuild/libzypp-6.22.3/build -I/usr/include/rpm -I/usr/include/hal
-I/usr/include/dbus-1.0 -I/usr/lib/dbus-1.0/include
-I/tmp/rpmbuild/libzypp-6.22.3/build/zypp
-DZYPP_BASE_LOGGER_LOGGROUP=\"zypp\" -o
CMakeFiles/zypp.dir/parser/xml/XmlString.cc.o -c
/tmp/rpmbuild/libzypp-6.22.3/zypp/parser/xml/XmlString.cc
/usr/bin/cmake -E cmake_progress_report
/tmp/rpmbuild/libzypp-6.22.3/build/CMakeFiles
[ 5%] Building CXX object zypp/CMakeFiles/zypp.dir/parser/xml/libxmlfwd.cc.o
cd /tmp/rpmbuild/libzypp-6.22.3/build/zypp && /opt/icecream/bin/g++
-Dzypp_EXPORTS -D_FILE_OFFSET_BITS=64 -DVERSION=\"6.22.3\" -D_RPM_4_4_COMPAT
-DLOCALEDIR=\"/usr/share/locale\" -DTEXTDOMAIN=\"zypp\" -fomit-frame-pointer
-fmessage-length=0 -O2 -Wall -D_FORTIFY_SOURCE=2 -fstack-protector
-funwind-tables -fasynchronous-unwind-tables -g -fPIC -g -Wall
-Werror=format-security -Woverloaded-virtual -Wnon-virtual-dtor -Wl,-as-needed
-fomit-frame-pointer -fmessage-length=0 -O2 -Wall -D_FORTIFY_SOURCE=2
-fstack-protector -funwind-tables -fasynchronous-unwind-tables -g -fPIC -g
-Wall -Werror=format-security -Woverloaded-virtual -Wnon-virtual-dtor
-Wl,-as-needed -O3 -fPIC -I/tmp/rpmbuild/libzypp-6.22.3
-I/tmp/rpmbuild/libzypp-6.22.3/build -I/usr/include/rpm -I/usr/include/hal
-I/usr/include/dbus-1.0 -I/usr/lib/dbus-1.0/include
-I/tmp/rpmbuild/libzypp-6.22.3/build/zypp
-DZYPP_BASE_LOGGER_LOGGROUP=\"zypp\" -o
CMakeFiles/zypp.dir/parser/xml/libxmlfwd.cc.o -c
/tmp/rpmbuild/libzypp-6.22.3/zypp/parser/xml/libxmlfwd.cc
/usr/bin/cmake -E cmake_progress_report
/tmp/rpmbuild/libzypp-6.22.3/build/CMakeFiles 4
[ 6%] Building CXX object
zypp/CMakeFiles/zypp.dir/parser/xml/xml_escape_parser.cpp.o
cd /tmp/rpmbuild/libzypp-6.22.3/build/zypp && /opt/icecream/bin/g++
-Dzypp_EXPORTS -D_FILE_OFFSET_BITS=64 -DVERSION=\"6.22.3\" -D_RPM_4_4_COMPAT
-DLOCALEDIR=\"/usr/share/locale\" -DTEXTDOMAIN=\"zypp\" -fomit-frame-pointer
-fmessage-length=0 -O2 -Wall -D_FORTIFY_SOURCE=2 -fstack-protector
-funwind-tables -fasynchronous-unwind-tables -g -fPIC -g -Wall
-Werror=format-security -Woverloaded-virtual -Wnon-virtual-dtor -Wl,-as-needed
-fomit-frame-pointer -fmessage-length=0 -O2 -Wall -D_FORTIFY_SOURCE=2
-fstack-protector -funwind-tables -fasynchronous-unwind-tables -g -fPIC -g
-Wall -Werror=format-security -Woverloaded-virtual -Wnon-virtual-dtor
-Wl,-as-needed -O3 -fPIC -I/tmp/rpmbuild/libzypp-6.22.3
-I/tmp/rpmbuild/libzypp-6.22.3/build -I/usr/include/rpm -I/usr/include/hal
-I/usr/include/dbus-1.0 -I/usr/lib/dbus-1.0/include
-I/tmp/rpmbuild/libzypp-6.22.3/build/zypp
-DZYPP_BASE_LOGGER_LOGGROUP=\"zypp\" -o
CMakeFiles/zypp.dir/parser/xml/xml_escape_parser.cpp.o -c
/tmp/rpmbuild/libzypp-6.22.3/zypp/parser/xml/xml_escape_parser.cpp
/usr/bin/cmake -E cmake_progress_report
/tmp/rpmbuild/libzypp-6.22.3/build/CMakeFiles
[ 6%] Building CXX object
zypp/CMakeFiles/zypp.dir/parser/yum/RepomdFileReader.cc.o
cd /tmp/rpmbuild/libzypp-6.22.3/build/zypp && /opt/icecream/bin/g++
-Dzypp_EXPORTS -D_FILE_OFFSET_BITS=64 -DVERSION=\"6.22.3\" -D_RPM_4_4_COMPAT
-DLOCALEDIR=\"/usr/share/locale\" -DTEXTDOMAIN=\"zypp\" -fomit-frame-pointer
-fmessage-length=0 -O2 -Wall -D_FORTIFY_SOURCE=2 -fstack-protector
-funwind-tables -fasynchronous-unwind-tables -g -fPIC -g -Wall
-Werror=format-security -Woverloaded-virtual -Wnon-virtual-dtor -Wl,-as-needed
-fomit-frame-pointer -fmessage-length=0 -O2 -Wall -D_FORTIFY_SOURCE=2
-fstack-protector -funwind-tables -fasynchronous-unwind-tables -g -fPIC -g
-Wall -Werror=format-security -Woverloaded-virtual -Wnon-virtual-dtor
-Wl,-as-needed -O3 -fPIC -I/tmp/rpmbuild/libzypp-6.22.3
-I/tmp/rpmbuild/libzypp-6.22.3/build -I/usr/include/rpm -I/usr/include/hal
-I/usr/include/dbus-1.0 -I/usr/lib/dbus-1.0/include
-I/tmp/rpmbuild/libzypp-6.22.3/build/zypp
-DZYPP_BASE_LOGGER_LOGGROUP=\"zypp\" -o
CMakeFiles/zypp.dir/parser/yum/RepomdFileReader.cc.o -c
/tmp/rpmbuild/libzypp-6.22.3/zypp/parser/yum/RepomdFileReader.cc
/usr/bin/cmake -E cmake_progress_report
/tmp/rpmbuild/libzypp-6.22.3/build/CMakeFiles
[ 6%] Building CXX object
zypp/CMakeFiles/zypp.dir/parser/yum/PatchesFileReader.cc.o
cd /tmp/rpmbuild/libzypp-6.22.3/build/zypp && /opt/icecream/bin/g++
-Dzypp_EXPORTS -D_FILE_OFFSET_BITS=64 -DVERSION=\"6.22.3\" -D_RPM_4_4_COMPAT
-DLOCALEDIR=\"/usr/share/locale\" -DTEXTDOMAIN=\"zypp\" -fomit-frame-pointer
-fmessage-length=0 -O2 -Wall -D_FORTIFY_SOURCE=2 -fstack-protector
-funwind-tables -fasynchronous-unwind-tables -g -fPIC -g -Wall
-Werror=format-security -Woverloaded-virtual -Wnon-virtual-dtor -Wl,-as-needed
-fomit-frame-pointer -fmessage-length=0 -O2 -Wall -D_FORTIFY_SOURCE=2
-fstack-protector -funwind-tables -fasynchronous-unwind-tables -g -fPIC -g
-Wall -Werror=format-security -Woverloaded-virtual -Wnon-virtual-dtor
-Wl,-as-needed -O3 -fPIC -I/tmp/rpmbuild/libzypp-6.22.3
-I/tmp/rpmbuild/libzypp-6.22.3/build -I/usr/include/rpm -I/usr/include/hal
-I/usr/include/dbus-1.0 -I/usr/lib/dbus-1.0/include
-I/tmp/rpmbuild/libzypp-6.22.3/build/zypp
-DZYPP_BASE_LOGGER_LOGGROUP=\"zypp\" -o
CMakeFiles/zypp.dir/parser/yum/PatchesFileReader.cc.o -c
/tmp/rpmbuild/libzypp-6.22.3/zypp/parser/yum/PatchesFileReader.cc
/usr/bin/cmake -E cmake_progress_report
/tmp/rpmbuild/libzypp-6.22.3/build/CMakeFiles
[ 6%] Building CXX object
zypp/CMakeFiles/zypp.dir/parser/plaindir/RepoParser.cc.o
cd /tmp/rpmbuild/libzypp-6.22.3/build/zypp && /opt/icecream/bin/g++
-Dzypp_EXPORTS -D_FILE_OFFSET_BITS=64 -DVERSION=\"6.22.3\" -D_RPM_4_4_COMPAT
-DLOCALEDIR=\"/usr/share/locale\" -DTEXTDOMAIN=\"zypp\" -fomit-frame-pointer
-fmessage-length=0 -O2 -Wall -D_FORTIFY_SOURCE=2 -fstack-protector
-funwind-tables -fasynchronous-unwind-tables -g -fPIC -g -Wall
-Werror=format-security -Woverloaded-virtual -Wnon-virtual-dtor -Wl,-as-needed
-fomit-frame-pointer -fmessage-length=0 -O2 -Wall -D_FORTIFY_SOURCE=2
-fstack-protector -funwind-tables -fasynchronous-unwind-tables -g -fPIC -g
-Wall -Werror=format-security -Woverloaded-virtual -Wnon-virtual-dtor
-Wl,-as-needed -O3 -fPIC -I/tmp/rpmbuild/libzypp-6.22.3
-I/tmp/rpmbuild/libzypp-6.22.3/build -I/usr/include/rpm -I/usr/include/hal
-I/usr/include/dbus-1.0 -I/usr/lib/dbus-1.0/include
-I/tmp/rpmbuild/libzypp-6.22.3/build/zypp
-DZYPP_BASE_LOGGER_LOGGROUP=\"zypp\" -o
CMakeFiles/zypp.dir/parser/plaindir/RepoParser.cc.o -c
/tmp/rpmbuild/libzypp-6.22.3/zypp/parser/plaindir/RepoParser.cc
/usr/bin/cmake -E cmake_progress_report
/tmp/rpmbuild/libzypp-6.22.3/build/CMakeFiles 5
[ 8%] Building CXX object
zypp/CMakeFiles/zypp.dir/parser/ws/WebpinResultFileReader.cc.o
cd /tmp/rpmbuild/libzypp-6.22.3/build/zypp && /opt/icecream/bin/g++
-Dzypp_EXPORTS -D_FILE_OFFSET_BITS=64 -DVERSION=\"6.22.3\" -D_RPM_4_4_COMPAT
-DLOCALEDIR=\"/usr/share/locale\" -DTEXTDOMAIN=\"zypp\" -fomit-frame-pointer
-fmessage-length=0 -O2 -Wall -D_FORTIFY_SOURCE=2 -fstack-protector
-funwind-tables -fasynchronous-unwind-tables -g -fPIC -g -Wall
-Werror=format-security -Woverloaded-virtual -Wnon-virtual-dtor -Wl,-as-needed
-fomit-frame-pointer -fmessage-length=0 -O2 -Wall -D_FORTIFY_SOURCE=2
-fstack-protector -funwind-tables -fasynchronous-unwind-tables -g -fPIC -g
-Wall -Werror=format-security -Woverloaded-virtual -Wnon-virtual-dtor
-Wl,-as-needed -O3 -fPIC -I/tmp/rpmbuild/libzypp-6.22.3
-I/tmp/rpmbuild/libzypp-6.22.3/build -I/usr/include/rpm -I/usr/include/hal
-I/usr/include/dbus-1.0 -I/usr/lib/dbus-1.0/include
-I/tmp/rpmbuild/libzypp-6.22.3/build/zypp
-DZYPP_BASE_LOGGER_LOGGROUP=\"zypp\" -o
CMakeFiles/zypp.dir/parser/ws/WebpinResultFileReader.cc.o -c
/tmp/rpmbuild/libzypp-6.22.3/zypp/parser/ws/WebpinResultFileReader.cc
/usr/bin/cmake -E cmake_progress_report
/tmp/rpmbuild/libzypp-6.22.3/build/CMakeFiles
[ 8%] Building CXX object zypp/CMakeFiles/zypp.dir/parser/ParseException.cc.o
cd /tmp/rpmbuild/libzypp-6.22.3/build/zypp && /opt/icecream/bin/g++
-Dzypp_EXPORTS -D_FILE_OFFSET_BITS=64 -DVERSION=\"6.22.3\" -D_RPM_4_4_COMPAT
-DLOCALEDIR=\"/usr/share/locale\" -DTEXTDOMAIN=\"zypp\" -fomit-frame-pointer
-fmessage-length=0 -O2 -Wall -D_FORTIFY_SOURCE=2 -fstack-protector
-funwind-tables -fasynchronous-unwind-tables -g -fPIC -g -Wall
-Werror=format-security -Woverloaded-virtual -Wnon-virtual-dtor -Wl,-as-needed
-fomit-frame-pointer -fmessage-length=0 -O2 -Wall -D_FORTIFY_SOURCE=2
-fstack-protector -funwind-tables -fasynchronous-unwind-tables -g -fPIC -g
-Wall -Werror=format-security -Woverloaded-virtual -Wnon-virtual-dtor
-Wl,-as-needed -O3 -fPIC -I/tmp/rpmbuild/libzypp-6.22.3
-I/tmp/rpmbuild/libzypp-6.22.3/build -I/usr/include/rpm -I/usr/include/hal
-I/usr/include/dbus-1.0 -I/usr/lib/dbus-1.0/include
-I/tmp/rpmbuild/libzypp-6.22.3/build/zypp
-DZYPP_BASE_LOGGER_LOGGROUP=\"zypp\" -o
CMakeFiles/zypp.dir/parser/ParseException.cc.o -c
/tmp/rpmbuild/libzypp-6.22.3/zypp/parser/ParseException.cc
/usr/bin/cmake -E cmake_progress_report
/tmp/rpmbuild/libzypp-6.22.3/build/CMakeFiles
[ 8%] Building CXX object zypp/CMakeFiles/zypp.dir/parser/IniParser.cc.o
cd /tmp/rpmbuild/libzypp-6.22.3/build/zypp && /opt/icecream/bin/g++
-Dzypp_EXPORTS -D_FILE_OFFSET_BITS=64 -DVERSION=\"6.22.3\" -D_RPM_4_4_COMPAT
-DLOCALEDIR=\"/usr/share/locale\" -DTEXTDOMAIN=\"zypp\" -fomit-frame-pointer
-fmessage-length=0 -O2 -Wall -D_FORTIFY_SOURCE=2 -fstack-protector
-funwind-tables -fasynchronous-unwind-tables -g -fPIC -g -Wall
-Werror=format-security -Woverloaded-virtual -Wnon-virtual-dtor -Wl,-as-needed
-fomit-frame-pointer -fmessage-length=0 -O2 -Wall -D_FORTIFY_SOURCE=2
-fstack-protector -funwind-tables -fasynchronous-unwind-tables -g -fPIC -g
-Wall -Werror=format-security -Woverloaded-virtual -Wnon-virtual-dtor
-Wl,-as-needed -O3 -fPIC -I/tmp/rpmbuild/libzypp-6.22.3
-I/tmp/rpmbuild/libzypp-6.22.3/build -I/usr/include/rpm -I/usr/include/hal
-I/usr/include/dbus-1.0 -I/usr/lib/dbus-1.0/include
-I/tmp/rpmbuild/libzypp-6.22.3/build/zypp
-DZYPP_BASE_LOGGER_LOGGROUP=\"zypp\" -o
CMakeFiles/zypp.dir/parser/IniParser.cc.o -c
/tmp/rpmbuild/libzypp-6.22.3/zypp/parser/IniParser.cc
/usr/bin/cmake -E cmake_progress_report
/tmp/rpmbuild/libzypp-6.22.3/build/CMakeFiles 6
[ 10%] Building CXX object zypp/CMakeFiles/zypp.dir/parser/IniDict.cc.o
cd /tmp/rpmbuild/libzypp-6.22.3/build/zypp && /opt/icecream/bin/g++
-Dzypp_EXPORTS -D_FILE_OFFSET_BITS=64 -DVERSION=\"6.22.3\" -D_RPM_4_4_COMPAT
-DLOCALEDIR=\"/usr/share/locale\" -DTEXTDOMAIN=\"zypp\" -fomit-frame-pointer
-fmessage-length=0 -O2 -Wall -D_FORTIFY_SOURCE=2 -fstack-protector
-funwind-tables -fasynchronous-unwind-tables -g -fPIC -g -Wall
-Werror=format-security -Woverloaded-virtual -Wnon-virtual-dtor -Wl,-as-needed
-fomit-frame-pointer -fmessage-length=0 -O2 -Wall -D_FORTIFY_SOURCE=2
-fstack-protector -funwind-tables -fasynchronous-unwind-tables -g -fPIC -g
-Wall -Werror=format-security -Woverloaded-virtual -Wnon-virtual-dtor
-Wl,-as-needed -O3 -fPIC -I/tmp/rpmbuild/libzypp-6.22.3
-I/tmp/rpmbuild/libzypp-6.22.3/build -I/usr/include/rpm -I/usr/include/hal
-I/usr/include/dbus-1.0 -I/usr/lib/dbus-1.0/include
-I/tmp/rpmbuild/libzypp-6.22.3/build/zypp
-DZYPP_BASE_LOGGER_LOGGROUP=\"zypp\" -o CMakeFiles/zypp.dir/parser/IniDict.cc.o
-c /tmp/rpmbuild/libzypp-6.22.3/zypp/parser/IniDict.cc
/usr/bin/cmake -E cmake_progress_report
/tmp/rpmbuild/libzypp-6.22.3/build/CMakeFiles
[ 10%] Building CXX object zypp/CMakeFiles/zypp.dir/parser/HistoryLogReader.cc.o
cd /tmp/rpmbuild/libzypp-6.22.3/build/zypp && /opt/icecream/bin/g++
-Dzypp_EXPORTS -D_FILE_OFFSET_BITS=64 -DVERSION=\"6.22.3\" -D_RPM_4_4_COMPAT
-DLOCALEDIR=\"/usr/share/locale\" -DTEXTDOMAIN=\"zypp\" -fomit-frame-pointer
-fmessage-length=0 -O2 -Wall -D_FORTIFY_SOURCE=2 -fstack-protector
-funwind-tables -fasynchronous-unwind-tables -g -fPIC -g -Wall
-Werror=format-security -Woverloaded-virtual -Wnon-virtual-dtor -Wl,-as-needed
-fomit-frame-pointer -fmessage-length=0 -O2 -Wall -D_FORTIFY_SOURCE=2
-fstack-protector -funwind-tables -fasynchronous-unwind-tables -g -fPIC -g
-Wall -Werror=format-security -Woverloaded-virtual -Wnon-virtual-dtor
-Wl,-as-needed -O3 -fPIC -I/tmp/rpmbuild/libzypp-6.22.3
-I/tmp/rpmbuild/libzypp-6.22.3/build -I/usr/include/rpm -I/usr/include/hal
-I/usr/include/dbus-1.0 -I/usr/lib/dbus-1.0/include
-I/tmp/rpmbuild/libzypp-6.22.3/build/zypp
-DZYPP_BASE_LOGGER_LOGGROUP=\"zypp\" -o
CMakeFiles/zypp.dir/parser/HistoryLogReader.cc.o -c
/tmp/rpmbuild/libzypp-6.22.3/zypp/parser/HistoryLogReader.cc
/usr/bin/cmake -E cmake_progress_report
/tmp/rpmbuild/libzypp-6.22.3/build/CMakeFiles
[ 10%] Building CXX object zypp/CMakeFiles/zypp.dir/parser/RepoFileReader.cc.o
cd /tmp/rpmbuild/libzypp-6.22.3/build/zypp && /opt/icecream/bin/g++
-Dzypp_EXPORTS -D_FILE_OFFSET_BITS=64 -DVERSION=\"6.22.3\" -D_RPM_4_4_COMPAT
-DLOCALEDIR=\"/usr/share/locale\" -DTEXTDOMAIN=\"zypp\" -fomit-frame-pointer
-fmessage-length=0 -O2 -Wall -D_FORTIFY_SOURCE=2 -fstack-protector
-funwind-tables -fasynchronous-unwind-tables -g -fPIC -g -Wall
-Werror=format-security -Woverloaded-virtual -Wnon-virtual-dtor -Wl,-as-needed
-fomit-frame-pointer -fmessage-length=0 -O2 -Wall -D_FORTIFY_SOURCE=2
-fstack-protector -funwind-tables -fasynchronous-unwind-tables -g -fPIC -g
-Wall -Werror=format-security -Woverloaded-virtual -Wnon-virtual-dtor
-Wl,-as-needed -O3 -fPIC -I/tmp/rpmbuild/libzypp-6.22.3
-I/tmp/rpmbuild/libzypp-6.22.3/build -I/usr/include/rpm -I/usr/include/hal
-I/usr/include/dbus-1.0 -I/usr/lib/dbus-1.0/include
-I/tmp/rpmbuild/libzypp-6.22.3/build/zypp
-DZYPP_BASE_LOGGER_LOGGROUP=\"zypp\" -o
CMakeFiles/zypp.dir/parser/RepoFileReader.cc.o -c
/tmp/rpmbuild/libzypp-6.22.3/zypp/parser/RepoFileReader.cc
/usr/bin/cmake -E cmake_progress_report
/tmp/rpmbuild/libzypp-6.22.3/build/CMakeFiles
[ 10%] Building CXX object
zypp/CMakeFiles/zypp.dir/parser/RepoindexFileReader.cc.o
cd /tmp/rpmbuild/libzypp-6.22.3/build/zypp && /opt/icecream/bin/g++
-Dzypp_EXPORTS -D_FILE_OFFSET_BITS=64 -DVERSION=\"6.22.3\" -D_RPM_4_4_COMPAT
-DLOCALEDIR=\"/usr/share/locale\" -DTEXTDOMAIN=\"zypp\" -fomit-frame-pointer
-fmessage-length=0 -O2 -Wall -D_FORTIFY_SOURCE=2 -fstack-protector
-funwind-tables -fasynchronous-unwind-tables -g -fPIC -g -Wall
-Werror=format-security -Woverloaded-virtual -Wnon-virtual-dtor -Wl,-as-needed
-fomit-frame-pointer -fmessage-length=0 -O2 -Wall -D_FORTIFY_SOURCE=2
-fstack-protector -funwind-tables -fasynchronous-unwind-tables -g -fPIC -g
-Wall -Werror=format-security -Woverloaded-virtual -Wnon-virtual-dtor
-Wl,-as-needed -O3 -fPIC -I/tmp/rpmbuild/libzypp-6.22.3
-I/tmp/rpmbuild/libzypp-6.22.3/build -I/usr/include/rpm -I/usr/include/hal
-I/usr/include/dbus-1.0 -I/usr/lib/dbus-1.0/include
-I/tmp/rpmbuild/libzypp-6.22.3/build/zypp
-DZYPP_BASE_LOGGER_LOGGROUP=\"zypp\" -o
CMakeFiles/zypp.dir/parser/RepoindexFileReader.cc.o -c
/tmp/rpmbuild/libzypp-6.22.3/zypp/parser/RepoindexFileReader.cc
/usr/bin/cmake -E cmake_progress_report
/tmp/rpmbuild/libzypp-6.22.3/build/CMakeFiles 7
[ 11%] Building CXX object
zypp/CMakeFiles/zypp.dir/parser/ServiceFileReader.cc.o
cd /tmp/rpmbuild/libzypp-6.22.3/build/zypp && /opt/icecream/bin/g++
-Dzypp_EXPORTS -D_FILE_OFFSET_BITS=64 -DVERSION=\"6.22.3\" -D_RPM_4_4_COMPAT
-DLOCALEDIR=\"/usr/share/locale\" -DTEXTDOMAIN=\"zypp\" -fomit-frame-pointer
-fmessage-length=0 -O2 -Wall -D_FORTIFY_SOURCE=2 -fstack-protector
-funwind-tables -fasynchronous-unwind-tables -g -fPIC -g -Wall
-Werror=format-security -Woverloaded-virtual -Wnon-virtual-dtor -Wl,-as-needed
-fomit-frame-pointer -fmessage-length=0 -O2 -Wall -D_FORTIFY_SOURCE=2
-fstack-protector -funwind-tables -fasynchronous-unwind-tables -g -fPIC -g
-Wall -Werror=format-security -Woverloaded-virtual -Wnon-virtual-dtor
-Wl,-as-needed -O3 -fPIC -I/tmp/rpmbuild/libzypp-6.22.3
-I/tmp/rpmbuild/libzypp-6.22.3/build -I/usr/include/rpm -I/usr/include/hal
-I/usr/include/dbus-1.0 -I/usr/lib/dbus-1.0/include
-I/tmp/rpmbuild/libzypp-6.22.3/build/zypp
-DZYPP_BASE_LOGGER_LOGGROUP=\"zypp\" -o
CMakeFiles/zypp.dir/parser/ServiceFileReader.cc.o -c
/tmp/rpmbuild/libzypp-6.22.3/zypp/parser/ServiceFileReader.cc
/usr/bin/cmake -E cmake_progress_report
/tmp/rpmbuild/libzypp-6.22.3/build/CMakeFiles
[ 11%] Building CXX object
zypp/CMakeFiles/zypp.dir/parser/ProductFileReader.cc.o
cd /tmp/rpmbuild/libzypp-6.22.3/build/zypp && /opt/icecream/bin/g++
-Dzypp_EXPORTS -D_FILE_OFFSET_BITS=64 -DVERSION=\"6.22.3\" -D_RPM_4_4_COMPAT
-DLOCALEDIR=\"/usr/share/locale\" -DTEXTDOMAIN=\"zypp\" -fomit-frame-pointer
-fmessage-length=0 -O2 -Wall -D_FORTIFY_SOURCE=2 -fstack-protector
-funwind-tables -fasynchronous-unwind-tables -g -fPIC -g -Wall
-Werror=format-security -Woverloaded-virtual -Wnon-virtual-dtor -Wl,-as-needed
-fomit-frame-pointer -fmessage-length=0 -O2 -Wall -D_FORTIFY_SOURCE=2
-fstack-protector -funwind-tables -fasynchronous-unwind-tables -g -fPIC -g
-Wall -Werror=format-security -Woverloaded-virtual -Wnon-virtual-dtor
-Wl,-as-needed -O3 -fPIC -I/tmp/rpmbuild/libzypp-6.22.3
-I/tmp/rpmbuild/libzypp-6.22.3/build -I/usr/include/rpm -I/usr/include/hal
-I/usr/include/dbus-1.0 -I/usr/lib/dbus-1.0/include
-I/tmp/rpmbuild/libzypp-6.22.3/build/zypp
-DZYPP_BASE_LOGGER_LOGGROUP=\"zypp\" -o
CMakeFiles/zypp.dir/parser/ProductFileReader.cc.o -c
/tmp/rpmbuild/libzypp-6.22.3/zypp/parser/ProductFileReader.cc
/usr/bin/cmake -E cmake_progress_report
/tmp/rpmbuild/libzypp-6.22.3/build/CMakeFiles
[ 11%] Building CXX object
zypp/CMakeFiles/zypp.dir/media/proxyinfo/ProxyInfoSysconfig.cc.o
cd /tmp/rpmbuild/libzypp-6.22.3/build/zypp && /opt/icecream/bin/g++
-Dzypp_EXPORTS -D_FILE_OFFSET_BITS=64 -DVERSION=\"6.22.3\" -D_RPM_4_4_COMPAT
-DLOCALEDIR=\"/usr/share/locale\" -DTEXTDOMAIN=\"zypp\" -fomit-frame-pointer
-fmessage-length=0 -O2 -Wall -D_FORTIFY_SOURCE=2 -fstack-protector
-funwind-tables -fasynchronous-unwind-tables -g -fPIC -g -Wall
-Werror=format-security -Woverloaded-virtual -Wnon-virtual-dtor -Wl,-as-needed
-fomit-frame-pointer -fmessage-length=0 -O2 -Wall -D_FORTIFY_SOURCE=2
-fstack-protector -funwind-tables -fasynchronous-unwind-tables -g -fPIC -g
-Wall -Werror=format-security -Woverloaded-virtual -Wnon-virtual-dtor
-Wl,-as-needed -O3 -fPIC -I/tmp/rpmbuild/libzypp-6.22.3
-I/tmp/rpmbuild/libzypp-6.22.3/build -I/usr/include/rpm -I/usr/include/hal
-I/usr/include/dbus-1.0 -I/usr/lib/dbus-1.0/include
-I/tmp/rpmbuild/libzypp-6.22.3/build/zypp
-DZYPP_BASE_LOGGER_LOGGROUP=\"zypp\" -o
CMakeFiles/zypp.dir/media/proxyinfo/ProxyInfoSysconfig.cc.o -c
/tmp/rpmbuild/libzypp-6.22.3/zypp/media/proxyinfo/ProxyInfoSysconfig.cc
/usr/bin/cmake -E cmake_progress_report
/tmp/rpmbuild/libzypp-6.22.3/build/CMakeFiles
[ 11%] Building CXX object zypp/CMakeFiles/zypp.dir/media/MediaException.cc.o
cd /tmp/rpmbuild/libzypp-6.22.3/build/zypp && /opt/icecream/bin/g++
-Dzypp_EXPORTS -D_FILE_OFFSET_BITS=64 -DVERSION=\"6.22.3\" -D_RPM_4_4_COMPAT
-DLOCALEDIR=\"/usr/share/locale\" -DTEXTDOMAIN=\"zypp\" -fomit-frame-pointer
-fmessage-length=0 -O2 -Wall -D_FORTIFY_SOURCE=2 -fstack-protector
-funwind-tables -fasynchronous-unwind-tables -g -fPIC -g -Wall
-Werror=format-security -Woverloaded-virtual -Wnon-virtual-dtor -Wl,-as-needed
-fomit-frame-pointer -fmessage-length=0 -O2 -Wall -D_FORTIFY_SOURCE=2
-fstack-protector -funwind-tables -fasynchronous-unwind-tables -g -fPIC -g
-Wall -Werror=format-security -Woverloaded-virtual -Wnon-virtual-dtor
-Wl,-as-needed -O3 -fPIC -I/tmp/rpmbuild/libzypp-6.22.3
-I/tmp/rpmbuild/libzypp-6.22.3/build -I/usr/include/rpm -I/usr/include/hal
-I/usr/include/dbus-1.0 -I/usr/lib/dbus-1.0/include
-I/tmp/rpmbuild/libzypp-6.22.3/build/zypp
-DZYPP_BASE_LOGGER_LOGGROUP=\"zypp\" -o
CMakeFiles/zypp.dir/media/MediaException.cc.o -c
/tmp/rpmbuild/libzypp-6.22.3/zypp/media/MediaException.cc
/tmp/rpmbuild/libzypp-6.22.3/zypp/base/Exception.h: In member function 'virtual
std::ostream& zypp::media::MediaNoLoopDeviceException::dumpOn(std::ostream&)
const':
/tmp/rpmbuild/libzypp-6.22.3/zypp/base/Exception.h:256: error: 'std::string
zypp::Exception::_msg' is private
/tmp/rpmbuild/libzypp-6.22.3/zypp/media/MediaException.cc:284: error: within
this context
/tmp/rpmbuild/libzypp-6.22.3/zypp/base/Exception.h:256: error: 'std::string
zypp::Exception::_msg' is private
/tmp/rpmbuild/libzypp-6.22.3/zypp/media/MediaException.cc:285: error: within
this context
make[2]: *** [zypp/CMakeFiles/zypp.dir/media/MediaException.cc.o] Error 1
make[2]: Leaving directory `/tmp/rpmbuild/libzypp-6.22.3/build'
make[1]: *** [zypp/CMakeFiles/zypp.dir/all] Error 2
make[1]: Leaving directory `/tmp/rpmbuild/libzypp-6.22.3/build'
make: *** [all] Error 2
error: Bad exit status from /var/tmp/rpm-tmp.JfwvRY (%build)


RPM build errors:
Bad exit status from /var/tmp/rpm-tmp.JfwvRY (%build)

( )
( ) (
) _ )
( \_
_(_\ \)__
(____\___))

build failed

stopping dbus..
Shutting down D-Bus daemon..done
... unmounting sys
... unmounting proc
... unmounting pts
umount: /data/hudson/HUDSON-CHROOT/zypp-head-i586/dev/pts: not mounted
Can't unmount devpts /data/hudson/HUDSON-CHROOT/zypp-head-i586/dev/pts
[locks-and-latches] Releasing all the locks
[locks-and-latches] All the locks released
Archiving artifacts

--
To unsubscribe, e-mail: zypp-commit+unsubscribe@xxxxxxxxxxxx
For additional commands, e-mail: zypp-commit+help@xxxxxxxxxxxx

< Previous Next >