Mailinglist Archive: yast-devel (251 mails)

< Previous Next >
[yast-devel] Build failed in Jenkins: yast-nfs-client-HEAD #128
  • From: hudson@xxxxxxx
  • Date: Wed, 31 Jul 2013 11:38:54 +0200 (CEST)
  • Message-id: <427532605.228.1375263534599.JavaMail.jenkins@river>
See <http://river.suse.de/job/yast-nfs-client-HEAD/128/>

------------------------------------------
[...truncated 181 lines...]
make[2]: Leaving directory
`<http://river.suse.de/job/yast-nfs-client-HEAD/ws/checkout/testsuite'>
make[1]: Leaving directory
`<http://river.suse.de/job/yast-nfs-client-HEAD/ws/checkout/testsuite'>
make[1]: Entering directory
`<http://river.suse.de/job/yast-nfs-client-HEAD/ws/checkout'>
make[1]: Nothing to be done for `all-am'.
make[1]: Leaving directory
`<http://river.suse.de/job/yast-nfs-client-HEAD/ws/checkout'>
+ make check
Making check in agents
make[1]: Entering directory
`<http://river.suse.de/job/yast-nfs-client-HEAD/ws/checkout/agents'>
make[1]: Nothing to be done for `check'.
make[1]: Leaving directory
`<http://river.suse.de/job/yast-nfs-client-HEAD/ws/checkout/agents'>
Making check in doc
make[1]: Entering directory
`<http://river.suse.de/job/yast-nfs-client-HEAD/ws/checkout/doc'>
Making check in autodocs
make[2]: Entering directory
`<http://river.suse.de/job/yast-nfs-client-HEAD/ws/checkout/doc/autodocs'>
make[2]: Nothing to be done for `check'.
make[2]: Leaving directory
`<http://river.suse.de/job/yast-nfs-client-HEAD/ws/checkout/doc/autodocs'>
make[2]: Entering directory
`<http://river.suse.de/job/yast-nfs-client-HEAD/ws/checkout/doc'>
make[2]: Nothing to be done for `check-am'.
make[2]: Leaving directory
`<http://river.suse.de/job/yast-nfs-client-HEAD/ws/checkout/doc'>
make[1]: Leaving directory
`<http://river.suse.de/job/yast-nfs-client-HEAD/ws/checkout/doc'>
Making check in src
make[1]: Entering directory
`<http://river.suse.de/job/yast-nfs-client-HEAD/ws/checkout/src'>
make[1]: Nothing to be done for `check'.
make[1]: Leaving directory
`<http://river.suse.de/job/yast-nfs-client-HEAD/ws/checkout/src'>
Making check in testsuite
make[1]: Entering directory
`<http://river.suse.de/job/yast-nfs-client-HEAD/ws/checkout/testsuite'>
make -f /usr/share/YaST2/data/testsuite/Makefile.testsuite
RPMNAME=yast2-nfs-client srcdir=.
make[2]: Entering directory
`<http://river.suse.de/job/yast-nfs-client-HEAD/ws/checkout/testsuite'>
make[2]: Nothing to be done for `all'.
make[2]: Leaving directory
`<http://river.suse.de/job/yast-nfs-client-HEAD/ws/checkout/testsuite'>
make check-DEJAGNU check-local
make[2]: Entering directory
`<http://river.suse.de/job/yast-nfs-client-HEAD/ws/checkout/testsuite'>
Making a new site.exp file ...
srcdir='.'; export srcdir; \
EXPECT=expect; export EXPECT; \
runtest=runtest; \
if /bin/sh -c "$runtest --version" > /dev/null 2>&1; then \
exit_status=0; l='yast2-nfs-client'; for tool in $l; do \
if $runtest --tool $tool --srcdir $srcdir ; \
then :; else exit_status=1; fi; \
done; \
else echo "WARNING: could not find 'runtest'" 1>&2; :;\
fi; \
exit $exit_status
WARNING: Couldn't find tool init file
Test Run By root on Wed Jul 31 11:38:52 2013
Native configuration is x86_64-suse-linux-gnu

=== yast2-nfs-client tests ===

Schedule of variations:
unix

Running target unix
Using /usr/share/dejagnu/baseboards/unix.exp as board description file for
target.
Using /usr/share/dejagnu/config/unix.exp as generic interface file for target.
Using ./config/unix.exp as tool-and-target-specific interface file.
Running ./yast2-nfs-client.test/testsuite.exp ...

Checking started

Running escape ...
FAIL: Wrong stderr for escape

The diff follows...

--- tests/escape.err 2013-01-22 11:34:56.000000000 +0100
+++ tmp.err.escape 2013-07-31 11:38:53.000000000 +0200
@@ -0,0 +1,2 @@
+2013-07-31 11:38:53 <3> app42(20380) [Interpreter] modules/Testsuite.rb:42
Loading module 'Nfs' failed
+2013-07-31 11:38:53 <3> app42(20380) [libycp] Import.cc(import):97 No matching
component found

FAIL: Wrong stderr for escape
See the diff above.
Running r-check ...
FAIL: Wrong stdout for r-check

The diff follows...

--- tests/r-check.out 2013-07-30 13:37:42.000000000 +0200
+++ tmp.out.r-check 2013-07-31 11:38:53.000000000 +0200
@@ -1,37 +0,0 @@
-Dump check_options
-Return Empty option strings are not allowed.
-Return
-Return
-Return
-Return
-Return Unknown option: bg
-Return Unknown option: unknownoption
-Return Unknown option: unknownassignment
-Return Empty value for option: rsize
-Return Unknown option: two
-Dump CheckHostName
-Return true
-Log The hostname entered is invalid. It must be
-Return false
-Log The hostname entered is invalid. It must be
-Return false
-Log The hostname entered is invalid. It must be
-Return false
-Return true
-Log The hostname entered is invalid. It must be
-Return false
-Return true
-Log The hostname entered is invalid. It must be
-Return false
-Return true
-Log The hostname entered is invalid. It must be
-Return false
-Return true
-Return true
-Log The hostname entered is invalid. It must be
-Return false
-Dump FormatHostnameForFstab
-Return [::1]
-Return [::1]
-Return 127.0.0.1
-Return suse.de

FAIL: Wrong stdout for r-check
See the diff above.
Running r-fstab ...
FAIL: Wrong stdout for r-fstab

The diff follows...

--- tests/r-fstab.out 2013-07-30 13:37:42.000000000 +0200
+++ tmp.out.r-fstab 2013-07-31 11:38:53.000000000 +0200
@@ -1,18 +0,0 @@
-Dump FstabTableItems
-Return [`item (`id (0), "foo.bar.com ", "/home ", "/home ", "nfs4", "defaults
"), `item (`id (1), "foo.bar.com ", "/var/spool/mail ", "/var/spool/mail ",
"nfs", "defaults "), `item (`id (2), "foo.bar.com.tw ", "/local/install ",
"/install ", "nfs", "hard,intr ")]
-Dump IsMpInFstab
-Log fstab already contains an entry
-Return true
-Log fstab already contains an entry
-Return true
-Return false
-Dump CheckPath
-Log The path entered is invalid.
-Return false
-Log The path entered is invalid.
-Return false
-Log The path entered is invalid.
-Return false
-Log The path entered is invalid.
-Return false
-Return true

FAIL: Wrong stdout for r-fstab
See the diff above.
Running r-spec ...
FAIL: Wrong stdout for r-spec

The diff follows...

--- tests/r-spec.out 2013-01-22 11:34:56.000000000 +0100
+++ tmp.out.r-spec 2013-07-31 11:38:53.000000000 +0200
@@ -1,8 +0,0 @@
-Dump SpecToServPath
-Return `couple ("big.foo.com", "/share/data")
-Return `couple ("only.server.com", "")
-Return `couple ("", "nocolon.only.server.com")
-Return `couple ("", "/only/path")
-Return `couple ("", "/nocolon/only/path")
-Return `couple ("fe80::219:d1ff:feac:fd10", "/path")
-Return `couple ("", "")

FAIL: Wrong stdout for r-spec
See the diff above.
Running r-strip ...
FAIL: Wrong stdout for r-strip

The diff follows...

--- tests/r-strip.out 2013-01-22 11:34:56.000000000 +0100
+++ tmp.out.r-strip 2013-07-31 11:38:53.000000000 +0200
@@ -1,5 +0,0 @@
-Dump StripExtraSlash
-Return
-Return /
-Return /normal/path
-Return /trailing/slash

FAIL: Wrong stdout for r-strip
See the diff above.
Running readwrite ...
FAIL: Wrong stderr for readwrite

The diff follows...

--- tests/readwrite.err 2013-01-22 11:34:56.000000000 +0100
+++ tmp.err.readwrite 2013-07-31 11:38:54.000000000 +0200
@@ -0,0 +1,2 @@
+2013-07-31 11:38:54 <3> app42(20510) [Interpreter] modules/Testsuite.rb:42
Loading module 'Nfs' failed
+2013-07-31 11:38:54 <3> app42(20510) [libycp] Import.cc(import):97 No matching
component found

FAIL: Wrong stderr for readwrite
See the diff above.
Running readwrite2 ...
FAIL: Wrong stderr for readwrite2

The diff follows...

--- tests/readwrite2.err 2013-01-22 11:34:56.000000000 +0100
+++ tmp.err.readwrite2 2013-07-31 11:38:54.000000000 +0200
@@ -0,0 +1,2 @@
+2013-07-31 11:38:54 <3> app42(20536) [Interpreter] modules/Testsuite.rb:42
Loading module 'Nfs' failed
+2013-07-31 11:38:54 <3> app42(20536) [libycp] Import.cc(import):97 No matching
component found

FAIL: Wrong stderr for readwrite2
See the diff above.

Checking finished


=== yast2-nfs-client Summary ===

# of unexpected failures 14
make[2]: *** [check-DEJAGNU] Error 1
make[2]: Leaving directory
`<http://river.suse.de/job/yast-nfs-client-HEAD/ws/checkout/testsuite'>
make[1]: *** [check-am] Error 2
make[1]: Leaving directory
`<http://river.suse.de/job/yast-nfs-client-HEAD/ws/checkout/testsuite'>
make: *** [check-recursive] Error 1
++ error_exit 2
++ echo 'ERROR: detected exitcode 2'
ERROR: detected exitcode 2
++ cleanup
++ echo '==> Running cleanup'
==> Running cleanup
++ rm -f
<http://river.suse.de/job/yast-nfs-client-HEAD/ws/ICECC/40c0ab7e54f59a1e4e493c1ea90a882a.tar.gz>
++ footer_and_exit 1
++ '[' -z 1 ']'
++ MYEXIT=1
++ '[' 1 == 0 ']'
++ ascii_failed
++ cat

( )
( ) (
) _ )
( \_
_(_\ \)__
(____\___))

build failed

++ exit 1
Build step 'Execute shell' marked build as failure
--
To unsubscribe, e-mail: yast-devel+unsubscribe@xxxxxxxxxxxx
To contact the owner, e-mail: yast-devel+owner@xxxxxxxxxxxx

< Previous Next >
This Thread
Follow Ups
References