Mailinglist Archive: yast-devel (251 mails)

< Previous Next >
[yast-devel] Build failed in Jenkins: yast-samba-server-HEAD #424
  • From: hudson@xxxxxxx
  • Date: Wed, 31 Jul 2013 10:56:14 +0200 (CEST)
  • Message-id: <996137059.204.1375260974084.JavaMail.jenkins@river>
See <http://river.suse.de/job/yast-samba-server-HEAD/424/changes>

Changes:

[yast-devel] YCP Killer: Unify YaST module structure

[yast-devel] YCP Killer: Apply changes needed for Ruby translation

[yast-devel] YCP Killer: Translate YCP files into Ruby

[yast-devel] YCP Killer: Regenerate Makefile.am files in all source directories

[yast-devel] version 3.0.0

------------------------------------------
[...truncated 302 lines...]

=== yast2-samba-server tests ===

Schedule of variations:
unix

Running target unix
Using /usr/share/dejagnu/baseboards/unix.exp as board description file for
target.
Using /usr/share/dejagnu/config/unix.exp as generic interface file for target.
Using ./config/unix.exp as tool-and-target-specific interface file.
Running ./yast2-samba-server.test/testsuite.exp ...

Checking started

Running YaPI-AddSAM-2 ...
FAIL: Wrong stderr for YaPI-AddSAM-2

The diff follows...

--- tests/YaPI-AddSAM-2.err 2013-01-22 11:58:52.000000000 +0100
+++ tmp.err.YaPI-AddSAM-2 2013-07-31 10:55:51.000000000 +0200
@@ -0,0 +1,8 @@
+2013-07-31 10:55:51 <3> app42(30005) [Interpreter]
modules/SambaBackendLDAP.pm:493 Loading module 'Ldap' failed
+2013-07-31 10:55:51 <3> app42(30005) [libycp] Import.cc(import):97 No matching
component found
+2013-07-31 10:55:51 <3> app42(30005) [Interpreter]
modules/SambaBackendLDAP.pm:507 Loading module 'Ldap' failed
+2013-07-31 10:55:51 <3> app42(30005) [libycp] Import.cc(import):97 No matching
component found
+2013-07-31 10:55:51 <3> app42(30005) [Interpreter]
modules/SambaBackendLDAP.pm:507 Loading module 'Ldap' failed
+2013-07-31 10:55:51 <3> app42(30005) [libycp] Import.cc(import):97 No matching
component found
+2013-07-31 10:55:51 <3> app42(30005) [Interpreter]
modules/SambaBackendLDAP.pm:507 Loading module 'Ldap' failed
+2013-07-31 10:55:51 <3> app42(30005) [libycp] Import.cc(import):97 No matching
component found

FAIL: Wrong stderr for YaPI-AddSAM-2
See the diff above.
Running YaPI-AddSAM ...
FAIL: Wrong stderr for YaPI-AddSAM

The diff follows...

--- tests/YaPI-AddSAM.err 2013-01-22 11:58:52.000000000 +0100
+++ tmp.err.YaPI-AddSAM 2013-07-31 10:55:52.000000000 +0200
@@ -0,0 +1,8 @@
+2013-07-31 10:55:52 <3> app42(30031) [Interpreter]
modules/SambaBackendLDAP.pm:493 Loading module 'Ldap' failed
+2013-07-31 10:55:52 <3> app42(30031) [libycp] Import.cc(import):97 No matching
component found
+2013-07-31 10:55:52 <3> app42(30031) [Interpreter]
modules/SambaBackendLDAP.pm:507 Loading module 'Ldap' failed
+2013-07-31 10:55:52 <3> app42(30031) [libycp] Import.cc(import):97 No matching
component found
+2013-07-31 10:55:52 <3> app42(30031) [Interpreter]
modules/SambaBackendLDAP.pm:507 Loading module 'Ldap' failed
+2013-07-31 10:55:52 <3> app42(30031) [libycp] Import.cc(import):97 No matching
component found
+2013-07-31 10:55:52 <3> app42(30031) [Interpreter]
modules/SambaBackendLDAP.pm:507 Loading module 'Ldap' failed
+2013-07-31 10:55:52 <3> app42(30031) [libycp] Import.cc(import):97 No matching
component found

FAIL: Wrong stderr for YaPI-AddSAM
See the diff above.
Running YaPI-AddShare ...
Running YaPI-DeleteSAM-2 ...
FAIL: Wrong stderr for YaPI-DeleteSAM-2

The diff follows...

--- tests/YaPI-DeleteSAM-2.err 2013-01-22 11:58:52.000000000 +0100
+++ tmp.err.YaPI-DeleteSAM-2 2013-07-31 10:55:53.000000000 +0200
@@ -0,0 +1,8 @@
+2013-07-31 10:55:53 <3> app42(30080) [Interpreter]
modules/SambaBackendLDAP.pm:493 Loading module 'Ldap' failed
+2013-07-31 10:55:53 <3> app42(30080) [libycp] Import.cc(import):97 No matching
component found
+2013-07-31 10:55:53 <3> app42(30080) [Interpreter]
modules/SambaBackendLDAP.pm:507 Loading module 'Ldap' failed
+2013-07-31 10:55:53 <3> app42(30080) [libycp] Import.cc(import):97 No matching
component found
+2013-07-31 10:55:53 <3> app42(30080) [Interpreter]
modules/SambaBackendLDAP.pm:507 Loading module 'Ldap' failed
+2013-07-31 10:55:53 <3> app42(30080) [libycp] Import.cc(import):97 No matching
component found
+2013-07-31 10:55:53 <3> app42(30080) [Interpreter]
modules/SambaBackendLDAP.pm:507 Loading module 'Ldap' failed
+2013-07-31 10:55:53 <3> app42(30080) [libycp] Import.cc(import):97 No matching
component found

FAIL: Wrong stderr for YaPI-DeleteSAM-2
See the diff above.
Running YaPI-DeleteSAM-3 ...
FAIL: Wrong stderr for YaPI-DeleteSAM-3

The diff follows...

--- tests/YaPI-DeleteSAM-3.err 2013-01-22 11:58:52.000000000 +0100
+++ tmp.err.YaPI-DeleteSAM-3 2013-07-31 10:55:54.000000000 +0200
@@ -0,0 +1,8 @@
+2013-07-31 10:55:54 <3> app42(30106) [Interpreter]
modules/SambaBackendLDAP.pm:493 Loading module 'Ldap' failed
+2013-07-31 10:55:54 <3> app42(30106) [libycp] Import.cc(import):97 No matching
component found
+2013-07-31 10:55:54 <3> app42(30106) [Interpreter]
modules/SambaBackendLDAP.pm:507 Loading module 'Ldap' failed
+2013-07-31 10:55:54 <3> app42(30106) [libycp] Import.cc(import):97 No matching
component found
+2013-07-31 10:55:54 <3> app42(30106) [Interpreter]
modules/SambaBackendLDAP.pm:507 Loading module 'Ldap' failed
+2013-07-31 10:55:54 <3> app42(30106) [libycp] Import.cc(import):97 No matching
component found
+2013-07-31 10:55:54 <3> app42(30106) [Interpreter]
modules/SambaBackendLDAP.pm:507 Loading module 'Ldap' failed
+2013-07-31 10:55:54 <3> app42(30106) [libycp] Import.cc(import):97 No matching
component found

FAIL: Wrong stderr for YaPI-DeleteSAM-3
See the diff above.
Running YaPI-DeleteSAM ...
FAIL: Wrong stderr for YaPI-DeleteSAM

The diff follows...

--- tests/YaPI-DeleteSAM.err 2013-01-22 11:58:52.000000000 +0100
+++ tmp.err.YaPI-DeleteSAM 2013-07-31 10:55:55.000000000 +0200
@@ -0,0 +1,8 @@
+2013-07-31 10:55:55 <3> app42(30132) [Interpreter]
modules/SambaBackendLDAP.pm:493 Loading module 'Ldap' failed
+2013-07-31 10:55:55 <3> app42(30132) [libycp] Import.cc(import):97 No matching
component found
+2013-07-31 10:55:55 <3> app42(30132) [Interpreter]
modules/SambaBackendLDAP.pm:507 Loading module 'Ldap' failed
+2013-07-31 10:55:55 <3> app42(30132) [libycp] Import.cc(import):97 No matching
component found
+2013-07-31 10:55:55 <3> app42(30132) [Interpreter]
modules/SambaBackendLDAP.pm:507 Loading module 'Ldap' failed
+2013-07-31 10:55:55 <3> app42(30132) [libycp] Import.cc(import):97 No matching
component found
+2013-07-31 10:55:55 <3> app42(30132) [Interpreter]
modules/SambaBackendLDAP.pm:507 Loading module 'Ldap' failed
+2013-07-31 10:55:55 <3> app42(30132) [libycp] Import.cc(import):97 No matching
component found

FAIL: Wrong stderr for YaPI-DeleteSAM
See the diff above.
Running YaPI-DeleteShare-2 ...
Running YaPI-DeleteShare ...
Running YaPI-DetermineRole1 ...
Running YaPI-DetermineRole2 ...
Running YaPI-DetermineRole3 ...
Running YaPI-EditDefaultSAM ...
FAIL: Wrong stderr for YaPI-EditDefaultSAM

The diff follows...

--- tests/YaPI-EditDefaultSAM.err 2013-01-22 11:58:52.000000000 +0100
+++ tmp.err.YaPI-EditDefaultSAM 2013-07-31 10:55:59.000000000 +0200
@@ -0,0 +1,8 @@
+2013-07-31 10:55:59 <3> app42(30273) [Interpreter]
modules/SambaBackendLDAP.pm:493 Loading module 'Ldap' failed
+2013-07-31 10:55:59 <3> app42(30273) [libycp] Import.cc(import):97 No matching
component found
+2013-07-31 10:55:59 <3> app42(30273) [Interpreter]
modules/SambaBackendLDAP.pm:507 Loading module 'Ldap' failed
+2013-07-31 10:55:59 <3> app42(30273) [libycp] Import.cc(import):97 No matching
component found
+2013-07-31 10:55:59 <3> app42(30273) [Interpreter]
modules/SambaBackendLDAP.pm:507 Loading module 'Ldap' failed
+2013-07-31 10:55:59 <3> app42(30273) [libycp] Import.cc(import):97 No matching
component found
+2013-07-31 10:55:59 <3> app42(30273) [Interpreter]
modules/SambaBackendLDAP.pm:507 Loading module 'Ldap' failed
+2013-07-31 10:55:59 <3> app42(30273) [libycp] Import.cc(import):97 No matching
component found

FAIL: Wrong stderr for YaPI-EditDefaultSAM
See the diff above.
Running YaPI-EditSAMConfiguration ...
Running YaPI-EditServerAsBDC ...
FAIL: Wrong stderr for YaPI-EditServerAsBDC

The diff follows...

--- tests/YaPI-EditServerAsBDC.err 2013-01-22 11:58:52.000000000 +0100
+++ tmp.err.YaPI-EditServerAsBDC 2013-07-31 10:56:01.000000000 +0200
@@ -0,0 +1,8 @@
+2013-07-31 10:56:01 <3> app42(30322) [Interpreter]
modules/SambaBackendLDAP.pm:493 Loading module 'Ldap' failed
+2013-07-31 10:56:01 <3> app42(30322) [libycp] Import.cc(import):97 No matching
component found
+2013-07-31 10:56:01 <3> app42(30322) [Interpreter]
modules/SambaBackendLDAP.pm:507 Loading module 'Ldap' failed
+2013-07-31 10:56:01 <3> app42(30322) [libycp] Import.cc(import):97 No matching
component found
+2013-07-31 10:56:01 <3> app42(30322) [Interpreter]
modules/SambaBackendLDAP.pm:507 Loading module 'Ldap' failed
+2013-07-31 10:56:01 <3> app42(30322) [libycp] Import.cc(import):97 No matching
component found
+2013-07-31 10:56:01 <3> app42(30322) [Interpreter]
modules/SambaBackendLDAP.pm:507 Loading module 'Ldap' failed
+2013-07-31 10:56:01 <3> app42(30322) [libycp] Import.cc(import):97 No matching
component found

FAIL: Wrong stderr for YaPI-EditServerAsBDC
See the diff above.
Running YaPI-EditServerAsPDC ...
FAIL: Wrong stderr for YaPI-EditServerAsPDC

The diff follows...

--- tests/YaPI-EditServerAsPDC.err 2013-01-22 11:58:52.000000000 +0100
+++ tmp.err.YaPI-EditServerAsPDC 2013-07-31 10:56:02.000000000 +0200
@@ -0,0 +1,8 @@
+2013-07-31 10:56:01 <3> app42(30348) [Interpreter]
modules/SambaBackendLDAP.pm:493 Loading module 'Ldap' failed
+2013-07-31 10:56:01 <3> app42(30348) [libycp] Import.cc(import):97 No matching
component found
+2013-07-31 10:56:01 <3> app42(30348) [Interpreter]
modules/SambaBackendLDAP.pm:507 Loading module 'Ldap' failed
+2013-07-31 10:56:01 <3> app42(30348) [libycp] Import.cc(import):97 No matching
component found
+2013-07-31 10:56:01 <3> app42(30348) [Interpreter]
modules/SambaBackendLDAP.pm:507 Loading module 'Ldap' failed
+2013-07-31 10:56:01 <3> app42(30348) [libycp] Import.cc(import):97 No matching
component found
+2013-07-31 10:56:01 <3> app42(30348) [Interpreter]
modules/SambaBackendLDAP.pm:507 Loading module 'Ldap' failed
+2013-07-31 10:56:01 <3> app42(30348) [libycp] Import.cc(import):97 No matching
component found

FAIL: Wrong stderr for YaPI-EditServerAsPDC
See the diff above.
Running YaPI-EditServerAsStandalone ...
FAIL: Wrong stderr for YaPI-EditServerAsStandalone

The diff follows...

--- tests/YaPI-EditServerAsStandalone.err 2013-01-22 11:58:52.000000000
+0100
+++ tmp.err.YaPI-EditServerAsStandalone 2013-07-31 10:56:02.000000000 +0200
@@ -0,0 +1,8 @@
+2013-07-31 10:56:02 <3> app42(30374) [Interpreter]
modules/SambaBackendLDAP.pm:493 Loading module 'Ldap' failed
+2013-07-31 10:56:02 <3> app42(30374) [libycp] Import.cc(import):97 No matching
component found
+2013-07-31 10:56:02 <3> app42(30374) [Interpreter]
modules/SambaBackendLDAP.pm:507 Loading module 'Ldap' failed
+2013-07-31 10:56:02 <3> app42(30374) [libycp] Import.cc(import):97 No matching
component found
+2013-07-31 10:56:02 <3> app42(30374) [Interpreter]
modules/SambaBackendLDAP.pm:507 Loading module 'Ldap' failed
+2013-07-31 10:56:02 <3> app42(30374) [libycp] Import.cc(import):97 No matching
component found
+2013-07-31 10:56:02 <3> app42(30374) [Interpreter]
modules/SambaBackendLDAP.pm:507 Loading module 'Ldap' failed
+2013-07-31 10:56:02 <3> app42(30374) [libycp] Import.cc(import):97 No matching
component found

FAIL: Wrong stderr for YaPI-EditServerAsStandalone
See the diff above.
Running YaPI-EditServerDescription ...
Running YaPI-EditService ...
Running YaPI-EditShare ...
Running YaPI-EnableHomes ...
Running YaPI-EnableNetlogon ...
Running YaPI-EnablePrinters ...
Running YaPI-EnableShare-2 ...
Running YaPI-EnableShare ...
Running YaPI-GetAllDirectories ...
Running YaPI-GetAllPrinters ...
Running YaPI-GetSAMBackends ...
Running YaPI-GetSAMConfiguration ...
Running YaPI-GetServerDescription ...
Running YaPI-GetServiceStatus ...
Running YaPI-GetShare ...
Running YaPI-ShareEnabled ...
Skipping file tests-common.rb ...

Checking finished


=== yast2-samba-server Summary ===

# of expected passes 23
# of unexpected failures 18
make[3]: *** [check-DEJAGNU] Error 1
make[3]: Leaving directory
`<http://river.suse.de/job/yast-samba-server-HEAD/ws/checkout/testsuite/YaPI'>
make[2]: *** [check-am] Error 2
make[2]: Leaving directory
`<http://river.suse.de/job/yast-samba-server-HEAD/ws/checkout/testsuite/YaPI'>
make[1]: *** [check-recursive] Error 1
make[1]: Leaving directory
`<http://river.suse.de/job/yast-samba-server-HEAD/ws/checkout/testsuite'>
make: *** [check-recursive] Error 1
++ error_exit 2
++ echo 'ERROR: detected exitcode 2'
ERROR: detected exitcode 2
++ cleanup
++ echo '==> Running cleanup'
==> Running cleanup
++ rm -f
<http://river.suse.de/job/yast-samba-server-HEAD/ws/ICECC/40c0ab7e54f59a1e4e493c1ea90a882a.tar.gz>
++ footer_and_exit 1
++ '[' -z 1 ']'
++ MYEXIT=1
++ '[' 1 == 0 ']'
++ ascii_failed
++ cat

( )
( ) (
) _ )
( \_
_(_\ \)__
(____\___))

build failed

++ exit 1
Build step 'Execute shell' marked build as failure
--
To unsubscribe, e-mail: yast-devel+unsubscribe@xxxxxxxxxxxx
To contact the owner, e-mail: yast-devel+owner@xxxxxxxxxxxx

< Previous Next >
Follow Ups
References