Mailinglist Archive: yast-devel (251 mails)

< Previous Next >
[yast-devel] Build failed in Jenkins: yast-squid-HEAD #125
  • From: hudson@xxxxxxx
  • Date: Wed, 31 Jul 2013 10:53:34 +0200 (CEST)
  • Message-id: <156559119.199.1375260814569.JavaMail.jenkins@river>
See <http://river.suse.de/job/yast-squid-HEAD/125/changes>

Changes:

[yast-devel] YCP Killer: Unify YaST module structure

[yast-devel] YCP Killer: Apply changes needed for Ruby translation

[yast-devel] YCP Killer: Translate YCP files into Ruby

[yast-devel] YCP Killer: Regenerate Makefile.am files in all source directories

[yast-devel] version 3.0.0

------------------------------------------
[...truncated 217 lines...]
checking for inttypes.h... yes
checking for stdint.h... yes
checking for unistd.h... yes
checking for dlfcn.h... yes
checking for objdir... .libs
checking if gcc supports -fno-rtti -fno-exceptions... no
checking for gcc option to produce PIC... -fPIC -DPIC
checking if gcc PIC flag -fPIC -DPIC works... yes
checking if gcc static flag -static works... no
checking if gcc supports -c -o file.o... yes
checking if gcc supports -c -o file.o... (cached) yes
checking whether the gcc linker (/usr/x86_64-suse-linux/bin/ld -m elf_x86_64)
supports shared libraries... yes
checking whether -lc should be explicitly linked in... no
checking dynamic linker characteristics... GNU/Linux ld.so
checking how to hardcode library paths into programs... immediate
checking whether stripping libraries is possible... yes
checking if libtool supports shared libraries... yes
checking whether to build shared libraries... yes
checking whether to build static libraries... no
checking how to run the C++ preprocessor... /opt/icecream/bin/g++ -E
checking for ld used by /opt/icecream/bin/g++... /usr/x86_64-suse-linux/bin/ld
-m elf_x86_64
checking if the linker (/usr/x86_64-suse-linux/bin/ld -m elf_x86_64) is GNU
ld... yes
checking whether the /opt/icecream/bin/g++ linker
(/usr/x86_64-suse-linux/bin/ld -m elf_x86_64) supports shared libraries... yes
checking for /opt/icecream/bin/g++ option to produce PIC... -fPIC -DPIC
checking if /opt/icecream/bin/g++ PIC flag -fPIC -DPIC works... yes
checking if /opt/icecream/bin/g++ static flag -static works... no
checking if /opt/icecream/bin/g++ supports -c -o file.o... yes
checking if /opt/icecream/bin/g++ supports -c -o file.o... (cached) yes
checking whether the /opt/icecream/bin/g++ linker
(/usr/x86_64-suse-linux/bin/ld -m elf_x86_64) supports shared libraries... yes
checking dynamic linker characteristics... (cached) GNU/Linux ld.so
checking how to hardcode library paths into programs... immediate
checking for size_t... yes
checking for working alloca.h... yes
checking for alloca... yes
checking for ANSI C header files... (cached) yes
checking for ycpdoc... /usr/lib/YaST2/bin/ycpdoc
checking for ycpmakedep... /usr/lib/YaST2/bin/ycpmakedep
checking for ycpc... /usr/bin/ycpc
checking for /usr/share/YaST2/data/testsuite/Makefile.testsuite... yes
checking that generated files are newer than configure... done
configure: creating ./config.status
config.status: creating Makefile
config.status: creating agents/src/Makefile
config.status: creating agents/Makefile
config.status: creating config/Makefile
config.status: creating doc/autodocs/Makefile
config.status: creating doc/Makefile
config.status: creating src/Makefile
config.status: creating testsuite/Makefile
config.status: creating config.h
config.status: config.h is unchanged
config.status: executing depfiles commands
config.status: executing libtool commands
+ make
make all-recursive
make[1]: Entering directory
`<http://river.suse.de/job/yast-squid-HEAD/ws/checkout'>
Making all in agents
make[2]: Entering directory
`<http://river.suse.de/job/yast-squid-HEAD/ws/checkout/agents'>
Making all in src
make[3]: Entering directory
`<http://river.suse.de/job/yast-squid-HEAD/ws/checkout/agents/src'>
make[3]: Nothing to be done for `all'.
make[3]: Leaving directory
`<http://river.suse.de/job/yast-squid-HEAD/ws/checkout/agents/src'>
make[3]: Entering directory
`<http://river.suse.de/job/yast-squid-HEAD/ws/checkout/agents'>
make[3]: Nothing to be done for `all-am'.
make[3]: Leaving directory
`<http://river.suse.de/job/yast-squid-HEAD/ws/checkout/agents'>
make[2]: Leaving directory
`<http://river.suse.de/job/yast-squid-HEAD/ws/checkout/agents'>
Making all in config
make[2]: Entering directory
`<http://river.suse.de/job/yast-squid-HEAD/ws/checkout/config'>
make[2]: Nothing to be done for `all'.
make[2]: Leaving directory
`<http://river.suse.de/job/yast-squid-HEAD/ws/checkout/config'>
Making all in doc
make[2]: Entering directory
`<http://river.suse.de/job/yast-squid-HEAD/ws/checkout/doc'>
Making all in autodocs
make[3]: Entering directory
`<http://river.suse.de/job/yast-squid-HEAD/ws/checkout/doc/autodocs'>
make[3]: Nothing to be done for `all'.
make[3]: Leaving directory
`<http://river.suse.de/job/yast-squid-HEAD/ws/checkout/doc/autodocs'>
make[3]: Entering directory
`<http://river.suse.de/job/yast-squid-HEAD/ws/checkout/doc'>
make[3]: Nothing to be done for `all-am'.
make[3]: Leaving directory
`<http://river.suse.de/job/yast-squid-HEAD/ws/checkout/doc'>
make[2]: Leaving directory
`<http://river.suse.de/job/yast-squid-HEAD/ws/checkout/doc'>
Making all in src
make[2]: Entering directory
`<http://river.suse.de/job/yast-squid-HEAD/ws/checkout/src'>
make[2]: Nothing to be done for `all'.
make[2]: Leaving directory
`<http://river.suse.de/job/yast-squid-HEAD/ws/checkout/src'>
Making all in testsuite
make[2]: Entering directory
`<http://river.suse.de/job/yast-squid-HEAD/ws/checkout/testsuite'>
make -f /usr/share/YaST2/data/testsuite/Makefile.testsuite RPMNAME=yast2-squid
srcdir=.
make[3]: Entering directory
`<http://river.suse.de/job/yast-squid-HEAD/ws/checkout/testsuite'>
make[3]: Nothing to be done for `all'.
make[3]: Leaving directory
`<http://river.suse.de/job/yast-squid-HEAD/ws/checkout/testsuite'>
make[2]: Leaving directory
`<http://river.suse.de/job/yast-squid-HEAD/ws/checkout/testsuite'>
make[2]: Entering directory
`<http://river.suse.de/job/yast-squid-HEAD/ws/checkout'>
make[2]: Leaving directory
`<http://river.suse.de/job/yast-squid-HEAD/ws/checkout'>
make[1]: Leaving directory
`<http://river.suse.de/job/yast-squid-HEAD/ws/checkout'>
+ make check
Making check in agents
make[1]: Entering directory
`<http://river.suse.de/job/yast-squid-HEAD/ws/checkout/agents'>
Making check in src
make[2]: Entering directory
`<http://river.suse.de/job/yast-squid-HEAD/ws/checkout/agents/src'>
make[2]: Nothing to be done for `check'.
make[2]: Leaving directory
`<http://river.suse.de/job/yast-squid-HEAD/ws/checkout/agents/src'>
make[2]: Entering directory
`<http://river.suse.de/job/yast-squid-HEAD/ws/checkout/agents'>
make[2]: Nothing to be done for `check-am'.
make[2]: Leaving directory
`<http://river.suse.de/job/yast-squid-HEAD/ws/checkout/agents'>
make[1]: Leaving directory
`<http://river.suse.de/job/yast-squid-HEAD/ws/checkout/agents'>
Making check in config
make[1]: Entering directory
`<http://river.suse.de/job/yast-squid-HEAD/ws/checkout/config'>
make[1]: Nothing to be done for `check'.
make[1]: Leaving directory
`<http://river.suse.de/job/yast-squid-HEAD/ws/checkout/config'>
Making check in doc
make[1]: Entering directory
`<http://river.suse.de/job/yast-squid-HEAD/ws/checkout/doc'>
Making check in autodocs
make[2]: Entering directory
`<http://river.suse.de/job/yast-squid-HEAD/ws/checkout/doc/autodocs'>
make[2]: Nothing to be done for `check'.
make[2]: Leaving directory
`<http://river.suse.de/job/yast-squid-HEAD/ws/checkout/doc/autodocs'>
make[2]: Entering directory
`<http://river.suse.de/job/yast-squid-HEAD/ws/checkout/doc'>
make[2]: Nothing to be done for `check-am'.
make[2]: Leaving directory
`<http://river.suse.de/job/yast-squid-HEAD/ws/checkout/doc'>
make[1]: Leaving directory
`<http://river.suse.de/job/yast-squid-HEAD/ws/checkout/doc'>
Making check in src
make[1]: Entering directory
`<http://river.suse.de/job/yast-squid-HEAD/ws/checkout/src'>
make[1]: Nothing to be done for `check'.
make[1]: Leaving directory
`<http://river.suse.de/job/yast-squid-HEAD/ws/checkout/src'>
Making check in testsuite
make[1]: Entering directory
`<http://river.suse.de/job/yast-squid-HEAD/ws/checkout/testsuite'>
make -f /usr/share/YaST2/data/testsuite/Makefile.testsuite RPMNAME=yast2-squid
srcdir=.
make[2]: Entering directory
`<http://river.suse.de/job/yast-squid-HEAD/ws/checkout/testsuite'>
make[2]: Nothing to be done for `all'.
make[2]: Leaving directory
`<http://river.suse.de/job/yast-squid-HEAD/ws/checkout/testsuite'>
make check-DEJAGNU check-local
make[2]: Entering directory
`<http://river.suse.de/job/yast-squid-HEAD/ws/checkout/testsuite'>
Making a new site.exp file ...
srcdir='.'; export srcdir; \
EXPECT=expect; export EXPECT; \
runtest=runtest; \
if /bin/sh -c "$runtest --version" > /dev/null 2>&1; then \
exit_status=0; l='yast2-squid'; for tool in $l; do \
if $runtest --tool $tool --srcdir $srcdir ; \
then :; else exit_status=1; fi; \
done; \
else echo "WARNING: could not find 'runtest'" 1>&2; :;\
fi; \
exit $exit_status
WARNING: Couldn't find tool init file
Test Run By root on Wed Jul 31 10:53:33 2013
Native configuration is x86_64-suse-linux-gnu

=== yast2-squid tests ===

Schedule of variations:
unix

Running target unix
Using /usr/share/dejagnu/baseboards/unix.exp as board description file for
target.
Using /usr/share/dejagnu/config/unix.exp as generic interface file for target.
Using ./config/unix.exp as tool-and-target-specific interface file.
Running ./yast2-squid.test/testsuite.exp ...

Checking started

Running Squid-Read ...
FAIL: Wrong stderr for Squid-Read

The diff follows...

--- tests/Squid-Read.err 2013-01-22 12:10:17.000000000 +0100
+++ tmp.err.Squid-Read 2013-07-31 10:53:33.000000000 +0200
@@ -0,0 +1,2 @@
+2013-07-31 10:53:33 <3> app42(14766) [Interpreter] modules/Testsuite.rb:42
Loading module 'Squid' failed
+2013-07-31 10:53:33 <3> app42(14766) [libycp] Import.cc(import):97 No matching
component found

FAIL: Wrong stderr for Squid-Read
See the diff above.
Running Squid ...
FAIL: Wrong stderr for Squid

The diff follows...

--- tests/Squid.err 2013-01-22 12:10:17.000000000 +0100
+++ tmp.err.Squid 2013-07-31 10:53:34.000000000 +0200
@@ -0,0 +1,2 @@
+2013-07-31 10:53:34 <3> app42(14792) [Interpreter] modules/Testsuite.rb:42
Loading module 'Squid' failed
+2013-07-31 10:53:34 <3> app42(14792) [libycp] Import.cc(import):97 No matching
component found

FAIL: Wrong stderr for Squid
See the diff above.
Running SquidACL ...
FAIL: Wrong stderr for SquidACL

The diff follows...

--- tests/SquidACL.err 2013-01-22 12:10:17.000000000 +0100
+++ tmp.err.SquidACL 2013-07-31 10:53:34.000000000 +0200
@@ -0,0 +1,2 @@
+2013-07-31 10:53:34 <3> app42(14818) [Interpreter] modules/Testsuite.rb:42
Loading module 'SquidACL' failed
+2013-07-31 10:53:34 <3> app42(14818) [libycp] Import.cc(import):97 No matching
component found

FAIL: Wrong stderr for SquidACL
See the diff above.
Running SquidErrorMessages ...
FAIL: Wrong stderr for SquidErrorMessages

The diff follows...

--- tests/SquidErrorMessages.err 2013-01-22 12:10:17.000000000 +0100
+++ tmp.err.SquidErrorMessages 2013-07-31 10:53:34.000000000 +0200
@@ -0,0 +1,2 @@
+2013-07-31 10:53:34 <3> app42(14844) [Interpreter] modules/Testsuite.rb:42
Loading module 'SquidErrorMessages' failed
+2013-07-31 10:53:34 <3> app42(14844) [libycp] Import.cc(import):97 No matching
component found

FAIL: Wrong stderr for SquidErrorMessages
See the diff above.

Checking finished


=== yast2-squid Summary ===

# of unexpected failures 8
make[2]: *** [check-DEJAGNU] Error 1
make[2]: Leaving directory
`<http://river.suse.de/job/yast-squid-HEAD/ws/checkout/testsuite'>
make[1]: *** [check-am] Error 2
make[1]: Leaving directory
`<http://river.suse.de/job/yast-squid-HEAD/ws/checkout/testsuite'>
make: *** [check-recursive] Error 1
++ error_exit 2
++ echo 'ERROR: detected exitcode 2'
ERROR: detected exitcode 2
++ cleanup
++ echo '==> Running cleanup'
==> Running cleanup
++ rm -f
<http://river.suse.de/job/yast-squid-HEAD/ws/ICECC/40c0ab7e54f59a1e4e493c1ea90a882a.tar.gz>
++ footer_and_exit 1
++ '[' -z 1 ']'
++ MYEXIT=1
++ '[' 1 == 0 ']'
++ ascii_failed
++ cat

( )
( ) (
) _ )
( \_
_(_\ \)__
(____\___))

build failed

++ exit 1
Build step 'Execute shell' marked build as failure
--
To unsubscribe, e-mail: yast-devel+unsubscribe@xxxxxxxxxxxx
To contact the owner, e-mail: yast-devel+owner@xxxxxxxxxxxx

< Previous Next >
This Thread
Follow Ups
References