Mailinglist Archive: yast-devel (251 mails)

< Previous Next >
[yast-devel] Build failed in Jenkins: yast-network-HEAD #360
  • From: hudson@xxxxxxx
  • Date: Wed, 31 Jul 2013 10:40:47 +0200 (CEST)
  • Message-id: <1787155141.187.1375260047472.JavaMail.jenkins@river>
See <http://river.suse.de/job/yast-network-HEAD/360/changes>

Changes:

[yast-devel] YCP Killer: Unify YaST module structure

[yast-devel] YCP Killer: Apply changes needed for Ruby translation

[yast-devel] YCP Killer: Translate YCP files into Ruby

[yast-devel] YCP Killer: Regenerate Makefile.am files in all source directories

[yast-devel] version 3.0.0

------------------------------------------
[...truncated 456 lines...]
FAIL: Wrong stderr for NetworkStorage
See the diff above.
Running Network_YaPI ...
FAIL: Wrong stderr for Network_YaPI

The diff follows...

--- tests/Network_YaPI.err 2013-01-22 11:31:22.000000000 +0100
+++ tmp.err.Network_YaPI 2013-07-31 10:40:43.000000000 +0200
@@ -0,0 +1,2 @@
+2013-07-31 10:40:43 <3> app42(27380) [Interpreter] modules/Testsuite.rb:42
Loading module 'Assert' failed
+2013-07-31 10:40:43 <3> app42(27380) [libycp] Import.cc(import):97 No matching
component found

FAIL: Wrong stderr for Network_YaPI
See the diff above.
Running Provider ...
FAIL: Wrong stderr for Provider

The diff follows...

--- tests/Provider.err 2013-01-22 11:31:22.000000000 +0100
+++ tmp.err.Provider 2013-07-31 10:40:44.000000000 +0200
@@ -0,0 +1,6 @@
+2013-07-31 10:40:44 <3> app42(27406) [Interpreter] yast/i18n.rb:83 Loading
module 'Summary' failed
+2013-07-31 10:40:44 <3> app42(27406) [libycp] Import.cc(import):97 No matching
component found
+2013-07-31 10:40:44 <3> app42(27406) [Y2Ruby] binary/YRuby.cc(loadModule):148
Module /usr/share/YaST2/modules/Provider load failed:component cannot import
namespace 'Summary' at /usr/lib64/ruby/vendor_ruby/1.9.1/yast/yast.rb:146:in
`import_pure'
+2013-07-31 10:40:44 <3> app42(27406) [Interpreter] yast/i18n.rb:83
Ruby::loadModule() / Can't load ruby module '/usr/share/YaST2/modules/Provider'
+2013-07-31 10:40:44 <3> app42(27406) [Interpreter] yast/i18n.rb:83 Loading
module 'Language' failed
+2013-07-31 10:40:44 <3> app42(27406) [libycp] Import.cc(import):97 No matching
component found

FAIL: Wrong stderr for Provider
See the diff above.
Running Routing ...
FAIL: Wrong stderr for Routing

The diff follows...

--- tests/Routing.err 2013-01-22 11:31:22.000000000 +0100
+++ tmp.err.Routing 2013-07-31 10:40:45.000000000 +0200
@@ -0,0 +1,17 @@
+2013-07-31 10:40:45 <3> app42(27432) [Interpreter] yast/i18n.rb:83 Loading
module 'Directory' failed
+2013-07-31 10:40:45 <3> app42(27432) [libycp] Import.cc(import):97 No matching
component found
+2013-07-31 10:40:45 <3> app42(27432) [Y2Ruby] binary/YRuby.cc(loadModule):148
Module /usr/share/YaST2/modules/NetHwDetection load failed:component cannot
import namespace 'Directory' at
/usr/lib64/ruby/vendor_ruby/1.9.1/yast/yast.rb:146:in `import_pure'
+2013-07-31 10:40:45 <3> app42(27432) [Interpreter] yast/i18n.rb:83
Ruby::loadModule() / Can't load ruby module
'/usr/share/YaST2/modules/NetHwDetection'
+2013-07-31 10:40:45 <3> app42(27432) [Interpreter] yast/i18n.rb:83 Loading
module 'Arch' failed
+2013-07-31 10:40:45 <3> app42(27432) [libycp] Import.cc(import):97 No matching
component found
+2013-07-31 10:40:45 <3> app42(27432) [Y2Ruby] binary/YRuby.cc(loadModule):148
Module /usr/share/YaST2/modules/NetworkInterfaces load failed:component cannot
import namespace 'Arch' at
/usr/lib64/ruby/vendor_ruby/1.9.1/yast/yast.rb:146:in `import_pure'
+2013-07-31 10:40:45 <3> app42(27432) [Interpreter] yast/i18n.rb:83
Ruby::loadModule() / Can't load ruby module
'/usr/share/YaST2/modules/NetworkInterfaces'
+2013-07-31 10:40:45 <3> app42(27432) [Interpreter] yast/i18n.rb:83 Loading
module 'Mode' failed
+2013-07-31 10:40:45 <3> app42(27432) [libycp] Import.cc(import):97 No matching
component found
+2013-07-31 10:40:45 <3> app42(27432) [Y2Ruby] binary/YRuby.cc(loadModule):148
Module /usr/share/YaST2/modules/SuSEFirewall load failed:component cannot
import namespace 'Mode' at
/usr/lib64/ruby/vendor_ruby/1.9.1/yast/yast.rb:146:in `import_pure'
+2013-07-31 10:40:45 <3> app42(27432) [Interpreter] yast/i18n.rb:83
Ruby::loadModule() / Can't load ruby module
'/usr/share/YaST2/modules/SuSEFirewall'
+2013-07-31 10:40:45 <3> app42(27432) [Interpreter] yast/i18n.rb:83 Loading
module 'Arch' failed
+2013-07-31 10:40:45 <3> app42(27432) [libycp] Import.cc(import):97 No matching
component found
+2013-07-31 10:40:45 <3> app42(27432) [Y2Ruby] binary/YRuby.cc(loadModule):148
Module /usr/share/YaST2/modules/Routing load failed:component cannot import
namespace 'Arch' at /usr/lib64/ruby/vendor_ruby/1.9.1/yast/yast.rb:146:in
`import_pure'
+2013-07-31 10:40:45 <3> app42(27432) [Interpreter] yast/i18n.rb:83
Ruby::loadModule() / Can't load ruby module '/usr/share/YaST2/modules/Routing'
+2013-07-31 10:40:45 <3> app42(27432) [Interpreter] modules/Routing.rb:162
Argument (nil) to Read(...) is nil

FAIL: Wrong stderr for Routing
See the diff above.
Running YaPI_bond ...
FAIL: Wrong stderr for YaPI_bond

The diff follows...

--- tests/YaPI_bond.err 2013-04-10 11:31:34.000000000 +0200
+++ tmp.err.YaPI_bond 2013-07-31 10:40:45.000000000 +0200
@@ -0,0 +1,2 @@
+2013-07-31 10:40:45 <3> app42(27454) [Interpreter] modules/Testsuite.rb:42
Loading module 'Assert' failed
+2013-07-31 10:40:45 <3> app42(27454) [libycp] Import.cc(import):97 No matching
component found

FAIL: Wrong stderr for YaPI_bond
See the diff above.
Running bond ...
FAIL: Wrong stderr for bond

The diff follows...

--- tests/bond.err 2013-01-22 11:31:22.000000000 +0100
+++ tmp.err.bond 2013-07-31 10:40:45.000000000 +0200
@@ -0,0 +1,2 @@
+2013-07-31 10:40:45 <3> app42(27476) [Interpreter] :0 Loading module 'Assert'
failed
+2013-07-31 10:40:45 <3> app42(27476) [libycp] Import.cc(import):97 No matching
component found

FAIL: Wrong stderr for bond
See the diff above.
Running bridge ...
FAIL: Wrong stderr for bridge

The diff follows...

--- tests/bridge.err 2013-04-17 13:23:13.000000000 +0200
+++ tmp.err.bridge 2013-07-31 10:40:45.000000000 +0200
@@ -0,0 +1,2 @@
+2013-07-31 10:40:45 <3> app42(27498) [Interpreter] :0 Loading module 'Assert'
failed
+2013-07-31 10:40:45 <3> app42(27498) [libycp] Import.cc(import):97 No matching
component found

FAIL: Wrong stderr for bridge
See the diff above.
Running complex ...
FAIL: Wrong stderr for complex

The diff follows...

--- tests/complex.err 2013-01-22 11:31:22.000000000 +0100
+++ tmp.err.complex 2013-07-31 10:40:46.000000000 +0200
@@ -0,0 +1,10 @@
+2013-07-31 10:40:45 <3> app42(27524) [Interpreter] yast/i18n.rb:83 Loading
module 'Directory' failed
+2013-07-31 10:40:45 <3> app42(27524) [libycp] Import.cc(import):97 No matching
component found
+2013-07-31 10:40:45 <3> app42(27524) [Y2Ruby] binary/YRuby.cc(loadModule):148
Module /usr/share/YaST2/modules/NetHwDetection load failed:component cannot
import namespace 'Directory' at
/usr/lib64/ruby/vendor_ruby/1.9.1/yast/yast.rb:146:in `import_pure'
+2013-07-31 10:40:45 <3> app42(27524) [Interpreter] yast/i18n.rb:83
Ruby::loadModule() / Can't load ruby module
'/usr/share/YaST2/modules/NetHwDetection'
+2013-07-31 10:40:45 <3> app42(27524) [Interpreter] yast/i18n.rb:83 Loading
module 'Arch' failed
+2013-07-31 10:40:45 <3> app42(27524) [libycp] Import.cc(import):97 No matching
component found
+2013-07-31 10:40:45 <3> app42(27524) [Y2Ruby] binary/YRuby.cc(loadModule):148
Module /usr/share/YaST2/modules/NetworkInterfaces load failed:component cannot
import namespace 'Arch' at
/usr/lib64/ruby/vendor_ruby/1.9.1/yast/yast.rb:146:in `import_pure'
+2013-07-31 10:40:45 <3> app42(27524) [Interpreter] yast/i18n.rb:83
Ruby::loadModule() / Can't load ruby module
'/usr/share/YaST2/modules/NetworkInterfaces'
+2013-07-31 10:40:45 <3> app42(27524) [Interpreter] yast/i18n.rb:83 Loading
module 'Popup' failed
+2013-07-31 10:40:45 <3> app42(27524) [libycp] Import.cc(import):97 No matching
component found

FAIL: Wrong stderr for complex
See the diff above.
Running dns ...
FAIL: Wrong stderr for dns

The diff follows...

--- tests/dns.err 2013-05-03 13:21:36.000000000 +0200
+++ tmp.err.dns 2013-07-31 10:40:46.000000000 +0200
@@ -0,0 +1,2 @@
+2013-07-31 10:40:46 <3> app42(27546) [Interpreter] :0 Loading module 'Assert'
failed
+2013-07-31 10:40:46 <3> app42(27546) [libycp] Import.cc(import):97 No matching
component found

FAIL: Wrong stderr for dns
See the diff above.
Running hardware ...
FAIL: Wrong stderr for hardware

The diff follows...

--- tests/hardware.err 2013-01-22 11:31:22.000000000 +0100
+++ tmp.err.hardware 2013-07-31 10:40:46.000000000 +0200
@@ -0,0 +1,2 @@
+2013-07-31 10:40:46 <3> app42(27572) [Interpreter] yast/i18n.rb:83 Loading
module 'Arch' failed
+2013-07-31 10:40:46 <3> app42(27572) [libycp] Import.cc(import):97 No matching
component found

FAIL: Wrong stderr for hardware
See the diff above.
Running include ...
FAIL: Wrong stderr for include

The diff follows...

--- tests/include.err 2013-01-22 11:31:22.000000000 +0100
+++ tmp.err.include 2013-07-31 10:40:46.000000000 +0200
@@ -0,0 +1,2 @@
+2013-07-31 10:40:46 <3> app42(27594) [Interpreter] yast/i18n.rb:83 Loading
module 'Arch' failed
+2013-07-31 10:40:46 <3> app42(27594) [libycp] Import.cc(import):97 No matching
component found

FAIL: Wrong stderr for include
See the diff above.
Running remote ...
FAIL: Wrong stderr for remote

The diff follows...

--- tests/remote.err 2013-06-28 15:40:58.000000000 +0200
+++ tmp.err.remote 2013-07-31 10:40:46.000000000 +0200
@@ -0,0 +1,2 @@
+2013-07-31 10:40:46 <3> app42(27616) [Interpreter] :0 Loading module 'Assert'
failed
+2013-07-31 10:40:46 <3> app42(27616) [libycp] Import.cc(import):97 No matching
component found

FAIL: Wrong stderr for remote
See the diff above.
Running routines ...
FAIL: Wrong stderr for routines

The diff follows...

--- tests/routines.err 2013-01-22 11:31:22.000000000 +0100
+++ tmp.err.routines 2013-07-31 10:40:46.000000000 +0200
@@ -0,0 +1,2 @@
+2013-07-31 10:40:46 <3> app42(27638) [Interpreter] yast/i18n.rb:83 Loading
module 'Call' failed
+2013-07-31 10:40:46 <3> app42(27638) [libycp] Import.cc(import):97 No matching
component found

FAIL: Wrong stderr for routines
See the diff above.
Running runtime ...
FAIL: Wrong stderr for runtime

The diff follows...

--- tests/runtime.err 2013-01-22 11:31:22.000000000 +0100
+++ tmp.err.runtime 2013-07-31 10:40:47.000000000 +0200
@@ -0,0 +1,2 @@
+2013-07-31 10:40:47 <3> app42(27664) [Interpreter] modules/Testsuite.rb:42
Loading module 'Arch' failed
+2013-07-31 10:40:47 <3> app42(27664) [libycp] Import.cc(import):97 No matching
component found

FAIL: Wrong stderr for runtime
See the diff above.
Running udev ...
FAIL: Wrong stderr for udev

The diff follows...

--- tests/udev.err 2013-01-22 11:31:22.000000000 +0100
+++ tmp.err.udev 2013-07-31 10:40:47.000000000 +0200
@@ -0,0 +1,2 @@
+2013-07-31 10:40:47 <3> app42(27686) [Interpreter] :0 Loading module 'Assert'
failed
+2013-07-31 10:40:47 <3> app42(27686) [libycp] Import.cc(import):97 No matching
component found

FAIL: Wrong stderr for udev
See the diff above.

Checking finished


=== yast2-network Summary ===

# of expected passes 1
# of unexpected failures 34
make[2]: *** [check-DEJAGNU] Error 1
make[2]: Leaving directory
`<http://river.suse.de/job/yast-network-HEAD/ws/checkout/testsuite'>
make[1]: *** [check-am] Error 2
make[1]: Leaving directory
`<http://river.suse.de/job/yast-network-HEAD/ws/checkout/testsuite'>
make: *** [check-recursive] Error 1
++ error_exit 2
++ echo 'ERROR: detected exitcode 2'
ERROR: detected exitcode 2
++ cleanup
++ echo '==> Running cleanup'
==> Running cleanup
++ rm -f
<http://river.suse.de/job/yast-network-HEAD/ws/ICECC/40c0ab7e54f59a1e4e493c1ea90a882a.tar.gz>
++ footer_and_exit 1
++ '[' -z 1 ']'
++ MYEXIT=1
++ '[' 1 == 0 ']'
++ ascii_failed
++ cat

( )
( ) (
) _ )
( \_
_(_\ \)__
(____\___))

build failed

++ exit 1
Build step 'Execute shell' marked build as failure
--
To unsubscribe, e-mail: yast-devel+unsubscribe@xxxxxxxxxxxx
To contact the owner, e-mail: yast-devel+owner@xxxxxxxxxxxx

< Previous Next >
This Thread
Follow Ups
References