Mailinglist Archive: yast-devel (251 mails)

< Previous Next >
[yast-devel] Build failed in Jenkins: yast-nfs-server-HEAD #130
  • From: hudson@xxxxxxx
  • Date: Wed, 31 Jul 2013 10:33:41 +0200 (CEST)
  • Message-id: <1454140067.182.1375259621973.JavaMail.jenkins@river>
See <http://river.suse.de/job/yast-nfs-server-HEAD/130/changes>

Changes:

[yast-devel] YCP Killer: Unify YaST module structure

[yast-devel] YCP Killer: Apply changes needed for Ruby translation

[yast-devel] YCP Killer: Translate YCP files into Ruby

[yast-devel] YCP Killer: Regenerate Makefile.am files in all source directories

------------------------------------------
[...truncated 147 lines...]
checking for xgettext... /usr/bin/xgettext
checking for ycpdoc... /usr/lib/YaST2/bin/ycpdoc
checking for ycpmakedep... /usr/lib/YaST2/bin/ycpmakedep
checking for ycpc... /usr/bin/ycpc
checking for /usr/share/YaST2/data/testsuite/Makefile.testsuite... yes
checking for expect... /usr/bin/expect
checking for runtest... /usr/bin/runtest
checking that generated files are newer than configure... done
configure: creating ./config.status
config.status: creating Makefile
config.status: creating agents/Makefile
config.status: creating doc/autodocs/Makefile
config.status: creating doc/Makefile
config.status: creating src/Makefile
config.status: creating testsuite/Makefile
+ make
Making all in agents
make[1]: Entering directory
`<http://river.suse.de/job/yast-nfs-server-HEAD/ws/checkout/agents'>
make[1]: Nothing to be done for `all'.
make[1]: Leaving directory
`<http://river.suse.de/job/yast-nfs-server-HEAD/ws/checkout/agents'>
Making all in doc
make[1]: Entering directory
`<http://river.suse.de/job/yast-nfs-server-HEAD/ws/checkout/doc'>
Making all in autodocs
make[2]: Entering directory
`<http://river.suse.de/job/yast-nfs-server-HEAD/ws/checkout/doc/autodocs'>
make[2]: Nothing to be done for `all'.
make[2]: Leaving directory
`<http://river.suse.de/job/yast-nfs-server-HEAD/ws/checkout/doc/autodocs'>
make[2]: Entering directory
`<http://river.suse.de/job/yast-nfs-server-HEAD/ws/checkout/doc'>
make[2]: Nothing to be done for `all-am'.
make[2]: Leaving directory
`<http://river.suse.de/job/yast-nfs-server-HEAD/ws/checkout/doc'>
make[1]: Leaving directory
`<http://river.suse.de/job/yast-nfs-server-HEAD/ws/checkout/doc'>
Making all in src
make[1]: Entering directory
`<http://river.suse.de/job/yast-nfs-server-HEAD/ws/checkout/src'>
make[1]: Nothing to be done for `all'.
make[1]: Leaving directory
`<http://river.suse.de/job/yast-nfs-server-HEAD/ws/checkout/src'>
Making all in testsuite
make[1]: Entering directory
`<http://river.suse.de/job/yast-nfs-server-HEAD/ws/checkout/testsuite'>
make -f /usr/share/YaST2/data/testsuite/Makefile.testsuite
RPMNAME=yast2-nfs-server srcdir=. \
dirs \
config/default.exp config/unix.exp config/unknown.exp \
run/runtest.sh yast2-nfs-server.test/testsuite.exp
make[2]: Entering directory
`<http://river.suse.de/job/yast-nfs-server-HEAD/ws/checkout/testsuite'>
make[2]: Nothing to be done for `dirs'.
make[2]: `config/default.exp' is up to date.
make[2]: `config/unix.exp' is up to date.
make[2]: `config/unknown.exp' is up to date.
make[2]: `run/runtest.sh' is up to date.
make[2]: `yast2-nfs-server.test/testsuite.exp' is up to date.
make[2]: Leaving directory
`<http://river.suse.de/job/yast-nfs-server-HEAD/ws/checkout/testsuite'>
mkdir -p tmp
make[1]: Leaving directory
`<http://river.suse.de/job/yast-nfs-server-HEAD/ws/checkout/testsuite'>
make[1]: Entering directory
`<http://river.suse.de/job/yast-nfs-server-HEAD/ws/checkout'>
make[1]: Nothing to be done for `all-am'.
make[1]: Leaving directory
`<http://river.suse.de/job/yast-nfs-server-HEAD/ws/checkout'>
+ make check
Making check in agents
make[1]: Entering directory
`<http://river.suse.de/job/yast-nfs-server-HEAD/ws/checkout/agents'>
make[1]: Nothing to be done for `check'.
make[1]: Leaving directory
`<http://river.suse.de/job/yast-nfs-server-HEAD/ws/checkout/agents'>
Making check in doc
make[1]: Entering directory
`<http://river.suse.de/job/yast-nfs-server-HEAD/ws/checkout/doc'>
Making check in autodocs
make[2]: Entering directory
`<http://river.suse.de/job/yast-nfs-server-HEAD/ws/checkout/doc/autodocs'>
make[2]: Nothing to be done for `check'.
make[2]: Leaving directory
`<http://river.suse.de/job/yast-nfs-server-HEAD/ws/checkout/doc/autodocs'>
make[2]: Entering directory
`<http://river.suse.de/job/yast-nfs-server-HEAD/ws/checkout/doc'>
make[2]: Nothing to be done for `check-am'.
make[2]: Leaving directory
`<http://river.suse.de/job/yast-nfs-server-HEAD/ws/checkout/doc'>
make[1]: Leaving directory
`<http://river.suse.de/job/yast-nfs-server-HEAD/ws/checkout/doc'>
Making check in src
make[1]: Entering directory
`<http://river.suse.de/job/yast-nfs-server-HEAD/ws/checkout/src'>
make[1]: Nothing to be done for `check'.
make[1]: Leaving directory
`<http://river.suse.de/job/yast-nfs-server-HEAD/ws/checkout/src'>
Making check in testsuite
make[1]: Entering directory
`<http://river.suse.de/job/yast-nfs-server-HEAD/ws/checkout/testsuite'>
make -f /usr/share/YaST2/data/testsuite/Makefile.testsuite
RPMNAME=yast2-nfs-server srcdir=. \
dirs \
config/default.exp config/unix.exp config/unknown.exp \
run/runtest.sh yast2-nfs-server.test/testsuite.exp
make[2]: Entering directory
`<http://river.suse.de/job/yast-nfs-server-HEAD/ws/checkout/testsuite'>
make[2]: Nothing to be done for `dirs'.
make[2]: `config/default.exp' is up to date.
make[2]: `config/unix.exp' is up to date.
make[2]: `config/unknown.exp' is up to date.
make[2]: `run/runtest.sh' is up to date.
make[2]: `yast2-nfs-server.test/testsuite.exp' is up to date.
make[2]: Leaving directory
`<http://river.suse.de/job/yast-nfs-server-HEAD/ws/checkout/testsuite'>
mkdir -p tmp
make check-DEJAGNU check-local
make[2]: Entering directory
`<http://river.suse.de/job/yast-nfs-server-HEAD/ws/checkout/testsuite'>
Making a new site.exp file ...
srcdir='.'; export srcdir; \
EXPECT=expect; export EXPECT; \
runtest=runtest; \
if /bin/sh -c "$runtest --version" > /dev/null 2>&1; then \
exit_status=0; l='yast2-nfs-server'; for tool in $l; do \
if $runtest --tool $tool --srcdir $srcdir ; \
then :; else exit_status=1; fi; \
done; \
else echo "WARNING: could not find 'runtest'" 1>&2; :;\
fi; \
exit $exit_status
WARNING: Couldn't find tool init file
Test Run By root on Wed Jul 31 10:33:40 2013
Native configuration is x86_64-suse-linux-gnu

=== yast2-nfs-server tests ===

Schedule of variations:
unix

Running target unix
Using /usr/share/dejagnu/baseboards/unix.exp as board description file for
target.
Using /usr/share/dejagnu/config/unix.exp as generic interface file for target.
Using ./config/unix.exp as tool-and-target-specific interface file.
Running ./yast2-nfs-server.test/ag_exports.exp ...
Running ./yast2-nfs-server.test/testsuite.exp ...

Checking started

Running readwrite-unfsd ...
FAIL: Wrong stderr for readwrite-unfsd

The diff follows...

--- tests/readwrite-unfsd.err 2013-01-23 18:54:21.000000000 +0100
+++ tmp.err.readwrite-unfsd 2013-07-31 10:33:41.000000000 +0200
@@ -0,0 +1,2 @@
+2013-07-31 10:33:41 <3> app42(1341) [Interpreter] modules/Testsuite.rb:42
Loading module 'NfsServer' failed
+2013-07-31 10:33:41 <3> app42(1341) [libycp] Import.cc(import):97 No matching
component found

FAIL: Wrong stderr for readwrite-unfsd
See the diff above.
Running readwrite ...
FAIL: Wrong stderr for readwrite

The diff follows...

--- tests/readwrite.err 2013-01-23 18:54:21.000000000 +0100
+++ tmp.err.readwrite 2013-07-31 10:33:41.000000000 +0200
@@ -0,0 +1,2 @@
+2013-07-31 10:33:41 <3> app42(1368) [Interpreter] modules/Testsuite.rb:42
Loading module 'NfsServer' failed
+2013-07-31 10:33:41 <3> app42(1368) [libycp] Import.cc(import):97 No matching
component found

FAIL: Wrong stderr for readwrite
See the diff above.
Running readwrite2 ...
FAIL: Wrong stderr for readwrite2

The diff follows...

--- tests/readwrite2.err 2013-01-23 18:54:21.000000000 +0100
+++ tmp.err.readwrite2 2013-07-31 10:33:41.000000000 +0200
@@ -0,0 +1,2 @@
+2013-07-31 10:33:41 <3> app42(1395) [Interpreter] modules/Testsuite.rb:42
Loading module 'NfsServer' failed
+2013-07-31 10:33:41 <3> app42(1395) [libycp] Import.cc(import):97 No matching
component found

FAIL: Wrong stderr for readwrite2
See the diff above.
Running routines1 ...
FAIL: Wrong stdout for routines1

The diff follows...

--- tests/routines1.out 2013-01-23 18:54:21.000000000 +0100
+++ tmp.out.routines1 2013-07-31 10:33:41.000000000 +0200
@@ -1,17 +0,0 @@
-Return ["host.com", "options"]
-Return ["noopts.host.com", ""]
-Return ["host.com", "noclose"]
-Return ["host.com", "(double"]
-Return ["", ""]
-Return [`item (`id (0), "*.local.domain ", "ro "), `item (`id (1), "@trusted
", "rw ")]
-Return []
-Return ["(ro,insecure,all_squash)"]
-Return nil
-Return nil
-Return [`item (`id ("/projects"), "/projects "), `item (`id ("/usr"), "/usr
"), `item (`id ("/pub"), "/pub ")]
-Return []
-Return `Table (`id (`exptable), `opt (`notify, `immediate), `header
("Directories", "Bindmount Targets"), [`item (`id ("/projects"), "/projects ",
""), `item (`id ("/usr"), "/usr ", ""), `item (`id ("/pub"), "/pub ", "")])
-Return `Table (`id (`exptable), `opt (`notify, `immediate), `header
("Directories", "Bindmount Targets"), [])
-Return [$["allowed":["proj*.local.domain(rw)"], "mountpoint":"/projects"],
$["allowed":["*.localdomain(ro)"], "mountpoint":"/usr"],
$["allowed":["(ro,insecure,all_squash)"], "mountpoint":"/pub"]]
-Return [$["allowed":["proj*.local.domain(rw)"], "mountpoint":"/projects"],
$["allowed":["*.local.domain(ro)", "@trusted(rw)"], "mountpoint":"/usr"],
$["allowed":["(ro,insecure,all_squash)"], "mountpoint":"/pub"]]
-Return []

FAIL: Wrong stdout for routines1
See the diff above.
Running routines2 ...
FAIL: Wrong stdout for routines2

The diff follows...

--- tests/routines2.out 2013-07-30 13:38:05.000000000 +0200
+++ tmp.out.routines2 2013-07-31 10:33:41.000000000 +0200
@@ -1,15 +0,0 @@
-Return true
-Return false
-Return false
-Return false
-Return false
-Return false
-Return false
-Return true
-Log Invalid option.
-Return false
-Return true
-Return true
-Return true
-Return false
-Return false

FAIL: Wrong stdout for routines2
See the diff above.

Checking finished


=== yast2-nfs-server Summary ===

# of unexpected failures 10
make[2]: *** [check-DEJAGNU] Error 1
make[2]: Leaving directory
`<http://river.suse.de/job/yast-nfs-server-HEAD/ws/checkout/testsuite'>
make[1]: *** [check-am] Error 2
make[1]: Leaving directory
`<http://river.suse.de/job/yast-nfs-server-HEAD/ws/checkout/testsuite'>
make: *** [check-recursive] Error 1
++ error_exit 2
++ echo 'ERROR: detected exitcode 2'
ERROR: detected exitcode 2
++ cleanup
++ echo '==> Running cleanup'
==> Running cleanup
++ rm -f
<http://river.suse.de/job/yast-nfs-server-HEAD/ws/ICECC/40c0ab7e54f59a1e4e493c1ea90a882a.tar.gz>
++ footer_and_exit 1
++ '[' -z 1 ']'
++ MYEXIT=1
++ '[' 1 == 0 ']'
++ ascii_failed
++ cat

( )
( ) (
) _ )
( \_
_(_\ \)__
(____\___))

build failed

++ exit 1
Build step 'Execute shell' marked build as failure
--
To unsubscribe, e-mail: yast-devel+unsubscribe@xxxxxxxxxxxx
To contact the owner, e-mail: yast-devel+owner@xxxxxxxxxxxx

< Previous Next >
This Thread
Follow Ups
References