Mailinglist Archive: yast-devel (251 mails)

< Previous Next >
[yast-devel] Build failed in Jenkins: yast-dhcp-server-HEAD #352
  • From: hudson@xxxxxxx
  • Date: Wed, 31 Jul 2013 10:29:05 +0200 (CEST)
  • Message-id: <1376565072.179.1375259346107.JavaMail.jenkins@river>
See <http://river.suse.de/job/yast-dhcp-server-HEAD/352/changes>

Changes:

[yast-devel] YCP Killer: Unify YaST module structure

[yast-devel] YCP Killer: Apply changes needed for Ruby translation

[yast-devel] YCP Killer: Translate YCP files into Ruby

[yast-devel] YCP Killer: Regenerate Makefile.am files in all source directories

[yast-devel] version 3.0.0

------------------------------------------
[...truncated 220 lines...]
exit_status=0; l='yast2-dhcp-server'; for tool in $l; do \
if $runtest --tool $tool --srcdir $srcdir ; \
then :; else exit_status=1; fi; \
done; \
else echo "WARNING: could not find 'runtest'" 1>&2; :;\
fi; \
exit $exit_status
WARNING: Couldn't find tool init file
Test Run By root on Wed Jul 31 10:29:00 2013
Native configuration is x86_64-suse-linux-gnu

=== yast2-dhcp-server tests ===

Schedule of variations:
unix

Running target unix
Using /usr/share/dejagnu/baseboards/unix.exp as board description file for
target.
Using /usr/share/dejagnu/config/unix.exp as generic interface file for target.
Using ./config/unix.exp as tool-and-target-specific interface file.
Running ./yast2-dhcp-server.test/testsuite.exp ...

Checking started

Running Read ...
FAIL: Wrong stderr for Read

The diff follows...

--- tests/Read.err 2013-01-22 11:17:11.000000000 +0100
+++ tmp.err.Read 2013-07-31 10:29:02.000000000 +0200
@@ -0,0 +1,18 @@
+2013-07-31 10:29:01 <3> app42(5202) [Interpreter] yast/i18n.rb:83 Loading
module 'Directory' failed
+2013-07-31 10:29:01 <3> app42(5202) [libycp] Import.cc(import):97 No matching
component found
+2013-07-31 10:29:01 <3> app42(5202) [Y2Ruby] binary/YRuby.cc(loadModule):148
Module /usr/share/YaST2/modules/CommandLine load failed:component cannot import
namespace 'Directory' at /usr/lib64/ruby/vendor_ruby/1.9.1/yast/yast.rb:146:in
`import_pure'
+2013-07-31 10:29:01 <3> app42(5202) [Interpreter] yast/i18n.rb:83
Ruby::loadModule() / Can't load ruby module
'/usr/share/YaST2/modules/CommandLine'
+2013-07-31 10:29:01 <3> app42(5202) [Interpreter] yast/i18n.rb:83 Loading
module 'Directory' failed
+2013-07-31 10:29:01 <3> app42(5202) [libycp] Import.cc(import):97 No matching
component found
+2013-07-31 10:29:01 <3> app42(5202) [Y2Ruby] binary/YRuby.cc(loadModule):148
Module /usr/share/YaST2/modules/Desktop load failed:component cannot import
namespace 'Directory' at /usr/lib64/ruby/vendor_ruby/1.9.1/yast/yast.rb:146:in
`import_pure'
+2013-07-31 10:29:01 <3> app42(5202) [Interpreter] yast/i18n.rb:83
Ruby::loadModule() / Can't load ruby module '/usr/share/YaST2/modules/Desktop'
+2013-07-31 10:29:01 <3> app42(5202) [Interpreter] yast/i18n.rb:83 Loading
module 'Label' failed
+2013-07-31 10:29:01 <3> app42(5202) [libycp] Import.cc(import):97 No matching
component found
+2013-07-31 10:29:01 <3> app42(5202) [Y2Ruby] binary/YRuby.cc(loadModule):148
Module /usr/share/YaST2/modules/Wizard load failed:component cannot import
namespace 'Label' at /usr/lib64/ruby/vendor_ruby/1.9.1/yast/yast.rb:146:in
`import_pure'
+2013-07-31 10:29:01 <3> app42(5202) [Interpreter] yast/i18n.rb:83
Ruby::loadModule() / Can't load ruby module '/usr/share/YaST2/modules/Wizard'
+2013-07-31 10:29:01 <3> app42(5202) [Interpreter] yast/i18n.rb:83 Loading
module 'Mode' failed
+2013-07-31 10:29:01 <3> app42(5202) [libycp] Import.cc(import):97 No matching
component found
+2013-07-31 10:29:01 <3> app42(5202) [Y2Ruby] binary/YRuby.cc(loadModule):148
Module /usr/share/YaST2/modules/Progress load failed:component cannot import
namespace 'Mode' at /usr/lib64/ruby/vendor_ruby/1.9.1/yast/yast.rb:146:in
`import_pure'
+2013-07-31 10:29:01 <3> app42(5202) [Interpreter] yast/i18n.rb:83
Ruby::loadModule() / Can't load ruby module '/usr/share/YaST2/modules/Progress'
+2013-07-31 10:29:02 <3> app42(5202) [Interpreter] yast/i18n.rb:83 Loading
module 'Mode' failed
+2013-07-31 10:29:02 <3> app42(5202) [libycp] Import.cc(import):97 No matching
component found

FAIL: Wrong stderr for Read
See the diff above.
Running Write ...
FAIL: Wrong stderr for Write

The diff follows...

--- tests/Write.err 2013-01-22 11:17:11.000000000 +0100
+++ tmp.err.Write 2013-07-31 10:29:02.000000000 +0200
@@ -0,0 +1,18 @@
+2013-07-31 10:29:02 <3> app42(5228) [Interpreter] yast/i18n.rb:83 Loading
module 'Directory' failed
+2013-07-31 10:29:02 <3> app42(5228) [libycp] Import.cc(import):97 No matching
component found
+2013-07-31 10:29:02 <3> app42(5228) [Y2Ruby] binary/YRuby.cc(loadModule):148
Module /usr/share/YaST2/modules/CommandLine load failed:component cannot import
namespace 'Directory' at /usr/lib64/ruby/vendor_ruby/1.9.1/yast/yast.rb:146:in
`import_pure'
+2013-07-31 10:29:02 <3> app42(5228) [Interpreter] yast/i18n.rb:83
Ruby::loadModule() / Can't load ruby module
'/usr/share/YaST2/modules/CommandLine'
+2013-07-31 10:29:02 <3> app42(5228) [Interpreter] yast/i18n.rb:83 Loading
module 'Directory' failed
+2013-07-31 10:29:02 <3> app42(5228) [libycp] Import.cc(import):97 No matching
component found
+2013-07-31 10:29:02 <3> app42(5228) [Y2Ruby] binary/YRuby.cc(loadModule):148
Module /usr/share/YaST2/modules/Desktop load failed:component cannot import
namespace 'Directory' at /usr/lib64/ruby/vendor_ruby/1.9.1/yast/yast.rb:146:in
`import_pure'
+2013-07-31 10:29:02 <3> app42(5228) [Interpreter] yast/i18n.rb:83
Ruby::loadModule() / Can't load ruby module '/usr/share/YaST2/modules/Desktop'
+2013-07-31 10:29:02 <3> app42(5228) [Interpreter] yast/i18n.rb:83 Loading
module 'Label' failed
+2013-07-31 10:29:02 <3> app42(5228) [libycp] Import.cc(import):97 No matching
component found
+2013-07-31 10:29:02 <3> app42(5228) [Y2Ruby] binary/YRuby.cc(loadModule):148
Module /usr/share/YaST2/modules/Wizard load failed:component cannot import
namespace 'Label' at /usr/lib64/ruby/vendor_ruby/1.9.1/yast/yast.rb:146:in
`import_pure'
+2013-07-31 10:29:02 <3> app42(5228) [Interpreter] yast/i18n.rb:83
Ruby::loadModule() / Can't load ruby module '/usr/share/YaST2/modules/Wizard'
+2013-07-31 10:29:02 <3> app42(5228) [Interpreter] yast/i18n.rb:83 Loading
module 'Mode' failed
+2013-07-31 10:29:02 <3> app42(5228) [libycp] Import.cc(import):97 No matching
component found
+2013-07-31 10:29:02 <3> app42(5228) [Y2Ruby] binary/YRuby.cc(loadModule):148
Module /usr/share/YaST2/modules/Progress load failed:component cannot import
namespace 'Mode' at /usr/lib64/ruby/vendor_ruby/1.9.1/yast/yast.rb:146:in
`import_pure'
+2013-07-31 10:29:02 <3> app42(5228) [Interpreter] yast/i18n.rb:83
Ruby::loadModule() / Can't load ruby module '/usr/share/YaST2/modules/Progress'
+2013-07-31 10:29:02 <3> app42(5228) [Interpreter] yast/i18n.rb:83 Loading
module 'Mode' failed
+2013-07-31 10:29:02 <3> app42(5228) [libycp] Import.cc(import):97 No matching
component found

FAIL: Wrong stderr for Write
See the diff above.
Running YaPIAddDeclaration ...
FAIL: Wrong stderr for YaPIAddDeclaration

The diff follows...

--- tests/YaPIAddDeclaration.err 2013-01-22 11:17:11.000000000 +0100
+++ tmp.err.YaPIAddDeclaration 2013-07-31 10:29:02.000000000 +0200
@@ -0,0 +1,2 @@
+2013-07-31 10:29:02 <3> app42(5254) [Interpreter] modules/Testsuite.rb:42
Loading module 'Mode' failed
+2013-07-31 10:29:02 <3> app42(5254) [libycp] Import.cc(import):97 No matching
component found

FAIL: Wrong stderr for YaPIAddDeclaration
See the diff above.
Running YaPIDeleteDeclartion ...
FAIL: Wrong stderr for YaPIDeleteDeclartion

The diff follows...

--- tests/YaPIDeleteDeclartion.err 2013-01-22 11:17:11.000000000 +0100
+++ tmp.err.YaPIDeleteDeclartion 2013-07-31 10:29:03.000000000 +0200
@@ -0,0 +1,2 @@
+2013-07-31 10:29:03 <3> app42(5280) [Interpreter] modules/Testsuite.rb:42
Loading module 'Mode' failed
+2013-07-31 10:29:03 <3> app42(5280) [libycp] Import.cc(import):97 No matching
component found

FAIL: Wrong stderr for YaPIDeleteDeclartion
See the diff above.
Running YaPIGetDeclarationChildren ...
FAIL: Wrong stderr for YaPIGetDeclarationChildren

The diff follows...

--- tests/YaPIGetDeclarationChildren.err 2013-01-22 11:17:11.000000000
+0100
+++ tmp.err.YaPIGetDeclarationChildren 2013-07-31 10:29:03.000000000 +0200
@@ -0,0 +1,2 @@
+2013-07-31 10:29:03 <3> app42(5306) [Interpreter] modules/Testsuite.rb:42
Loading module 'Mode' failed
+2013-07-31 10:29:03 <3> app42(5306) [libycp] Import.cc(import):97 No matching
component found

FAIL: Wrong stderr for YaPIGetDeclarationChildren
See the diff above.
Running YaPIGetDeclarationDirectives ...
FAIL: Wrong stderr for YaPIGetDeclarationDirectives

The diff follows...

--- tests/YaPIGetDeclarationDirectives.err 2013-01-22 11:17:11.000000000
+0100
+++ tmp.err.YaPIGetDeclarationDirectives 2013-07-31 10:29:03.000000000
+0200
@@ -0,0 +1,2 @@
+2013-07-31 10:29:03 <3> app42(5332) [Interpreter] modules/Testsuite.rb:42
Loading module 'Mode' failed
+2013-07-31 10:29:03 <3> app42(5332) [libycp] Import.cc(import):97 No matching
component found

FAIL: Wrong stderr for YaPIGetDeclarationDirectives
See the diff above.
Running YaPIGetDeclarationOptions ...
FAIL: Wrong stderr for YaPIGetDeclarationOptions

The diff follows...

--- tests/YaPIGetDeclarationOptions.err 2013-01-22 11:17:11.000000000 +0100
+++ tmp.err.YaPIGetDeclarationOptions 2013-07-31 10:29:04.000000000 +0200
@@ -0,0 +1,2 @@
+2013-07-31 10:29:04 <3> app42(5358) [Interpreter] modules/Testsuite.rb:42
Loading module 'Mode' failed
+2013-07-31 10:29:04 <3> app42(5358) [libycp] Import.cc(import):97 No matching
component found

FAIL: Wrong stderr for YaPIGetDeclarationOptions
See the diff above.
Running YaPIGetDeclarationParent ...
FAIL: Wrong stderr for YaPIGetDeclarationParent

The diff follows...

--- tests/YaPIGetDeclarationParent.err 2013-01-22 11:17:11.000000000 +0100
+++ tmp.err.YaPIGetDeclarationParent 2013-07-31 10:29:04.000000000 +0200
@@ -0,0 +1,2 @@
+2013-07-31 10:29:04 <3> app42(5384) [Interpreter] modules/Testsuite.rb:42
Loading module 'Mode' failed
+2013-07-31 10:29:04 <3> app42(5384) [libycp] Import.cc(import):97 No matching
component found

FAIL: Wrong stderr for YaPIGetDeclarationParent
See the diff above.
Running YaPISetDeclarationDirectives ...
FAIL: Wrong stderr for YaPISetDeclarationDirectives

The diff follows...

--- tests/YaPISetDeclarationDirectives.err 2013-01-22 11:17:11.000000000
+0100
+++ tmp.err.YaPISetDeclarationDirectives 2013-07-31 10:29:04.000000000
+0200
@@ -0,0 +1,2 @@
+2013-07-31 10:29:04 <3> app42(5410) [Interpreter] modules/Testsuite.rb:42
Loading module 'Mode' failed
+2013-07-31 10:29:04 <3> app42(5410) [libycp] Import.cc(import):97 No matching
component found

FAIL: Wrong stderr for YaPISetDeclarationDirectives
See the diff above.
Running YaPISetDeclarationOptions ...
FAIL: Wrong stderr for YaPISetDeclarationOptions

The diff follows...

--- tests/YaPISetDeclarationOptions.err 2013-01-22 11:17:11.000000000 +0100
+++ tmp.err.YaPISetDeclarationOptions 2013-07-31 10:29:05.000000000 +0200
@@ -0,0 +1,2 @@
+2013-07-31 10:29:05 <3> app42(5436) [Interpreter] modules/Testsuite.rb:42
Loading module 'Mode' failed
+2013-07-31 10:29:05 <3> app42(5436) [libycp] Import.cc(import):97 No matching
component found

FAIL: Wrong stderr for YaPISetDeclarationOptions
See the diff above.
Running YaPISetDeclarationParent ...
FAIL: Wrong stderr for YaPISetDeclarationParent

The diff follows...

--- tests/YaPISetDeclarationParent.err 2013-01-22 11:17:11.000000000 +0100
+++ tmp.err.YaPISetDeclarationParent 2013-07-31 10:29:05.000000000 +0200
@@ -0,0 +1,2 @@
+2013-07-31 10:29:05 <3> app42(5462) [Interpreter] modules/Testsuite.rb:42
Loading module 'Mode' failed
+2013-07-31 10:29:05 <3> app42(5462) [libycp] Import.cc(import):97 No matching
component found

FAIL: Wrong stderr for YaPISetDeclarationParent
See the diff above.
Running YaPIStartStopDhcpService ...
FAIL: Wrong stderr for YaPIStartStopDhcpService

The diff follows...

--- tests/YaPIStartStopDhcpService.err 2013-01-22 11:17:11.000000000 +0100
+++ tmp.err.YaPIStartStopDhcpService 2013-07-31 10:29:05.000000000 +0200
@@ -0,0 +1,2 @@
+2013-07-31 10:29:05 <3> app42(5488) [Interpreter] modules/Testsuite.rb:42
Loading module 'Mode' failed
+2013-07-31 10:29:05 <3> app42(5488) [libycp] Import.cc(import):97 No matching
component found

FAIL: Wrong stderr for YaPIStartStopDhcpService
See the diff above.

Checking finished


=== yast2-dhcp-server Summary ===

# of unexpected failures 24
make[2]: *** [check-DEJAGNU] Error 1
make[2]: Leaving directory
`<http://river.suse.de/job/yast-dhcp-server-HEAD/ws/checkout/testsuite'>
make[1]: *** [check-am] Error 2
make[1]: Leaving directory
`<http://river.suse.de/job/yast-dhcp-server-HEAD/ws/checkout/testsuite'>
make: *** [check-recursive] Error 1
++ error_exit 2
++ echo 'ERROR: detected exitcode 2'
ERROR: detected exitcode 2
++ cleanup
++ echo '==> Running cleanup'
==> Running cleanup
++ rm -f
<http://river.suse.de/job/yast-dhcp-server-HEAD/ws/ICECC/40c0ab7e54f59a1e4e493c1ea90a882a.tar.gz>
++ footer_and_exit 1
++ '[' -z 1 ']'
++ MYEXIT=1
++ '[' 1 == 0 ']'
++ ascii_failed
++ cat

( )
( ) (
) _ )
( \_
_(_\ \)__
(____\___))

build failed

++ exit 1
Build step 'Execute shell' marked build as failure
--
To unsubscribe, e-mail: yast-devel+unsubscribe@xxxxxxxxxxxx
To contact the owner, e-mail: yast-devel+owner@xxxxxxxxxxxx

< Previous Next >
This Thread
Follow Ups
References