Mailinglist Archive: yast-devel (251 mails)

< Previous Next >
[yast-devel] Build failed in Jenkins: yast-country-HEAD #134
  • From: hudson@xxxxxxx
  • Date: Wed, 31 Jul 2013 10:27:12 +0200 (CEST)
  • Message-id: <1429991352.175.1375259232447.JavaMail.jenkins@river>
See <http://river.suse.de/job/yast-country-HEAD/134/changes>

Changes:

[yast-devel] YCP Killer: Unify YaST module structure

[yast-devel] YCP Killer: Apply changes needed for Ruby translation

[yast-devel] YCP Killer: Translate YCP files into Ruby

[yast-devel] YCP Killer: Regenerate Makefile.am files in all source directories

------------------------------------------
[...truncated 201 lines...]
Making all in src
make[2]: Entering directory
`<http://river.suse.de/job/yast-country-HEAD/ws/checkout/console/src'>
make[2]: Nothing to be done for `all'.
make[2]: Leaving directory
`<http://river.suse.de/job/yast-country-HEAD/ws/checkout/console/src'>
make[2]: Entering directory
`<http://river.suse.de/job/yast-country-HEAD/ws/checkout/console'>
make[2]: Nothing to be done for `all-am'.
make[2]: Leaving directory
`<http://river.suse.de/job/yast-country-HEAD/ws/checkout/console'>
make[1]: Leaving directory
`<http://river.suse.de/job/yast-country-HEAD/ws/checkout/console'>
Making all in keyboard
make[1]: Entering directory
`<http://river.suse.de/job/yast-country-HEAD/ws/checkout/keyboard'>
Making all in doc
make[2]: Entering directory
`<http://river.suse.de/job/yast-country-HEAD/ws/checkout/keyboard/doc'>
Making all in autodocs
make[3]: Entering directory
`<http://river.suse.de/job/yast-country-HEAD/ws/checkout/keyboard/doc/autodocs'>
make[3]: Nothing to be done for `all'.
make[3]: Leaving directory
`<http://river.suse.de/job/yast-country-HEAD/ws/checkout/keyboard/doc/autodocs'>
make[3]: Entering directory
`<http://river.suse.de/job/yast-country-HEAD/ws/checkout/keyboard/doc'>
make[3]: Nothing to be done for `all-am'.
make[3]: Leaving directory
`<http://river.suse.de/job/yast-country-HEAD/ws/checkout/keyboard/doc'>
make[2]: Leaving directory
`<http://river.suse.de/job/yast-country-HEAD/ws/checkout/keyboard/doc'>
Making all in src
make[2]: Entering directory
`<http://river.suse.de/job/yast-country-HEAD/ws/checkout/keyboard/src'>
make[2]: Nothing to be done for `all'.
make[2]: Leaving directory
`<http://river.suse.de/job/yast-country-HEAD/ws/checkout/keyboard/src'>
Making all in testsuite
make[2]: Entering directory
`<http://river.suse.de/job/yast-country-HEAD/ws/checkout/keyboard/testsuite'>
make -f /usr/share/YaST2/data/testsuite/Makefile.testsuite
RPMNAME=yast2-country srcdir=.
make[3]: Entering directory
`<http://river.suse.de/job/yast-country-HEAD/ws/checkout/keyboard/testsuite'>
make[3]: Nothing to be done for `all'.
make[3]: Leaving directory
`<http://river.suse.de/job/yast-country-HEAD/ws/checkout/keyboard/testsuite'>
make[2]: Leaving directory
`<http://river.suse.de/job/yast-country-HEAD/ws/checkout/keyboard/testsuite'>
make[2]: Entering directory
`<http://river.suse.de/job/yast-country-HEAD/ws/checkout/keyboard'>
make[2]: Nothing to be done for `all-am'.
make[2]: Leaving directory
`<http://river.suse.de/job/yast-country-HEAD/ws/checkout/keyboard'>
make[1]: Leaving directory
`<http://river.suse.de/job/yast-country-HEAD/ws/checkout/keyboard'>
Making all in timezone
make[1]: Entering directory
`<http://river.suse.de/job/yast-country-HEAD/ws/checkout/timezone'>
Making all in doc
make[2]: Entering directory
`<http://river.suse.de/job/yast-country-HEAD/ws/checkout/timezone/doc'>
Making all in autodocs
make[3]: Entering directory
`<http://river.suse.de/job/yast-country-HEAD/ws/checkout/timezone/doc/autodocs'>
make[3]: Nothing to be done for `all'.
make[3]: Leaving directory
`<http://river.suse.de/job/yast-country-HEAD/ws/checkout/timezone/doc/autodocs'>
make[3]: Entering directory
`<http://river.suse.de/job/yast-country-HEAD/ws/checkout/timezone/doc'>
make[3]: Nothing to be done for `all-am'.
make[3]: Leaving directory
`<http://river.suse.de/job/yast-country-HEAD/ws/checkout/timezone/doc'>
make[2]: Leaving directory
`<http://river.suse.de/job/yast-country-HEAD/ws/checkout/timezone/doc'>
Making all in src
make[2]: Entering directory
`<http://river.suse.de/job/yast-country-HEAD/ws/checkout/timezone/src'>
make[2]: Nothing to be done for `all'.
make[2]: Leaving directory
`<http://river.suse.de/job/yast-country-HEAD/ws/checkout/timezone/src'>
Making all in testsuite
make[2]: Entering directory
`<http://river.suse.de/job/yast-country-HEAD/ws/checkout/timezone/testsuite'>
make -f /usr/share/YaST2/data/testsuite/Makefile.testsuite
RPMNAME=yast2-country srcdir=.
make[3]: Entering directory
`<http://river.suse.de/job/yast-country-HEAD/ws/checkout/timezone/testsuite'>
make[3]: Nothing to be done for `all'.
make[3]: Leaving directory
`<http://river.suse.de/job/yast-country-HEAD/ws/checkout/timezone/testsuite'>
make[2]: Leaving directory
`<http://river.suse.de/job/yast-country-HEAD/ws/checkout/timezone/testsuite'>
make[2]: Entering directory
`<http://river.suse.de/job/yast-country-HEAD/ws/checkout/timezone'>
make[2]: Nothing to be done for `all-am'.
make[2]: Leaving directory
`<http://river.suse.de/job/yast-country-HEAD/ws/checkout/timezone'>
make[1]: Leaving directory
`<http://river.suse.de/job/yast-country-HEAD/ws/checkout/timezone'>
make[1]: Entering directory
`<http://river.suse.de/job/yast-country-HEAD/ws/checkout'>
make[1]: Nothing to be done for `all-am'.
make[1]: Leaving directory
`<http://river.suse.de/job/yast-country-HEAD/ws/checkout'>
+ make check
Making check in language
make[1]: Entering directory
`<http://river.suse.de/job/yast-country-HEAD/ws/checkout/language'>
Making check in doc
make[2]: Entering directory
`<http://river.suse.de/job/yast-country-HEAD/ws/checkout/language/doc'>
Making check in autodocs
make[3]: Entering directory
`<http://river.suse.de/job/yast-country-HEAD/ws/checkout/language/doc/autodocs'>
make[3]: Nothing to be done for `check'.
make[3]: Leaving directory
`<http://river.suse.de/job/yast-country-HEAD/ws/checkout/language/doc/autodocs'>
make[3]: Entering directory
`<http://river.suse.de/job/yast-country-HEAD/ws/checkout/language/doc'>
make[3]: Nothing to be done for `check-am'.
make[3]: Leaving directory
`<http://river.suse.de/job/yast-country-HEAD/ws/checkout/language/doc'>
make[2]: Leaving directory
`<http://river.suse.de/job/yast-country-HEAD/ws/checkout/language/doc'>
Making check in src
make[2]: Entering directory
`<http://river.suse.de/job/yast-country-HEAD/ws/checkout/language/src'>
make[2]: Nothing to be done for `check'.
make[2]: Leaving directory
`<http://river.suse.de/job/yast-country-HEAD/ws/checkout/language/src'>
Making check in testsuite
make[2]: Entering directory
`<http://river.suse.de/job/yast-country-HEAD/ws/checkout/language/testsuite'>
make -f /usr/share/YaST2/data/testsuite/Makefile.testsuite
RPMNAME=yast2-country srcdir=.
make[3]: Entering directory
`<http://river.suse.de/job/yast-country-HEAD/ws/checkout/language/testsuite'>
make[3]: Nothing to be done for `all'.
make[3]: Leaving directory
`<http://river.suse.de/job/yast-country-HEAD/ws/checkout/language/testsuite'>
make check-DEJAGNU check-local
make[3]: Entering directory
`<http://river.suse.de/job/yast-country-HEAD/ws/checkout/language/testsuite'>
Making a new site.exp file ...
srcdir='.'; export srcdir; \
EXPECT=expect; export EXPECT; \
runtest=runtest; \
if /bin/sh -c "$runtest --version" > /dev/null 2>&1; then \
exit_status=0; l='yast2-country'; for tool in $l; do \
if $runtest --tool $tool --srcdir $srcdir ; \
then :; else exit_status=1; fi; \
done; \
else echo "WARNING: could not find 'runtest'" 1>&2; :;\
fi; \
exit $exit_status
WARNING: Couldn't find tool init file
Test Run By root on Wed Jul 31 10:27:10 2013
Native configuration is x86_64-suse-linux-gnu

=== yast2-country tests ===

Schedule of variations:
unix

Running target unix
Using /usr/share/dejagnu/baseboards/unix.exp as board description file for
target.
Using /usr/share/dejagnu/config/unix.exp as generic interface file for target.
Using ./config/unix.exp as tool-and-target-specific interface file.
Running ./yast2-country.test/testsuite.exp ...

Checking started

Running ImportExport ...
FAIL: Wrong stderr for ImportExport

The diff follows...

--- tests/ImportExport.err 2013-01-22 11:12:43.000000000 +0100
+++ tmp.err.ImportExport 2013-07-31 10:27:10.000000000 +0200
@@ -0,0 +1,2 @@
+2013-07-31 10:27:10 <3> app42(26094) [Interpreter] modules/Testsuite.rb:42
Loading module 'Mode' failed
+2013-07-31 10:27:10 <3> app42(26094) [libycp] Import.cc(import):97 No matching
component found

FAIL: Wrong stderr for ImportExport
See the diff above.
Running IncompleteTranslation ...
FAIL: Wrong stderr for IncompleteTranslation

The diff follows...

--- tests/IncompleteTranslation.err 2013-01-22 11:12:43.000000000 +0100
+++ tmp.err.IncompleteTranslation 2013-07-31 10:27:10.000000000 +0200
@@ -0,0 +1,2 @@
+2013-07-31 10:27:10 <3> app42(26120) [Interpreter] modules/Testsuite.rb:42
Loading module 'Language' failed
+2013-07-31 10:27:10 <3> app42(26120) [libycp] Import.cc(import):97 No matching
component found

FAIL: Wrong stderr for IncompleteTranslation
See the diff above.
Running Language ...
FAIL: Wrong stderr for Language

The diff follows...

--- tests/Language.err 2013-01-22 11:12:43.000000000 +0100
+++ tmp.err.Language 2013-07-31 10:27:11.000000000 +0200
@@ -0,0 +1,2 @@
+2013-07-31 10:27:11 <3> app42(26146) [Interpreter] modules/Testsuite.rb:42
Loading module 'Language' failed
+2013-07-31 10:27:11 <3> app42(26146) [libycp] Import.cc(import):97 No matching
component found

FAIL: Wrong stderr for Language
See the diff above.
Running MakeProposal ...
FAIL: Wrong stderr for MakeProposal

The diff follows...

--- tests/MakeProposal.err 2013-01-22 11:12:43.000000000 +0100
+++ tmp.err.MakeProposal 2013-07-31 10:27:11.000000000 +0200
@@ -0,0 +1,2 @@
+2013-07-31 10:27:11 <3> app42(26172) [Interpreter] modules/Testsuite.rb:42
Loading module 'Language' failed
+2013-07-31 10:27:11 <3> app42(26172) [libycp] Import.cc(import):97 No matching
component found

FAIL: Wrong stderr for MakeProposal
See the diff above.
Running ReadExport ...
FAIL: Wrong stderr for ReadExport

The diff follows...

--- tests/ReadExport.err 2013-01-22 11:12:43.000000000 +0100
+++ tmp.err.ReadExport 2013-07-31 10:27:11.000000000 +0200
@@ -0,0 +1,2 @@
+2013-07-31 10:27:11 <3> app42(26198) [Interpreter] modules/Testsuite.rb:42
Loading module 'Mode' failed
+2013-07-31 10:27:11 <3> app42(26198) [libycp] Import.cc(import):97 No matching
component found

FAIL: Wrong stderr for ReadExport
See the diff above.
Running Save ...
FAIL: Wrong stderr for Save

The diff follows...

--- tests/Save.err 2013-01-22 11:12:43.000000000 +0100
+++ tmp.err.Save 2013-07-31 10:27:12.000000000 +0200
@@ -0,0 +1,2 @@
+2013-07-31 10:27:12 <3> app42(26224) [Interpreter] modules/Testsuite.rb:42
Loading module 'Language' failed
+2013-07-31 10:27:12 <3> app42(26224) [libycp] Import.cc(import):97 No matching
component found

FAIL: Wrong stderr for Save
See the diff above.
Running Set ...
FAIL: Wrong stderr for Set

The diff follows...

--- tests/Set.err 2013-01-22 11:12:43.000000000 +0100
+++ tmp.err.Set 2013-07-31 10:27:12.000000000 +0200
@@ -0,0 +1,2 @@
+2013-07-31 10:27:12 <3> app42(26250) [Interpreter] modules/Testsuite.rb:42
Loading module 'Language' failed
+2013-07-31 10:27:12 <3> app42(26250) [libycp] Import.cc(import):97 No matching
component found

FAIL: Wrong stderr for Set
See the diff above.

Checking finished


=== yast2-country Summary ===

# of unexpected failures 14
make[3]: *** [check-DEJAGNU] Error 1
make[3]: Leaving directory
`<http://river.suse.de/job/yast-country-HEAD/ws/checkout/language/testsuite'>
make[2]: *** [check-am] Error 2
make[2]: Leaving directory
`<http://river.suse.de/job/yast-country-HEAD/ws/checkout/language/testsuite'>
make[1]: *** [check-recursive] Error 1
make[1]: Leaving directory
`<http://river.suse.de/job/yast-country-HEAD/ws/checkout/language'>
make: *** [check-recursive] Error 1
++ error_exit 2
++ echo 'ERROR: detected exitcode 2'
ERROR: detected exitcode 2
++ cleanup
++ echo '==> Running cleanup'
==> Running cleanup
++ rm -f
<http://river.suse.de/job/yast-country-HEAD/ws/ICECC/40c0ab7e54f59a1e4e493c1ea90a882a.tar.gz>
++ footer_and_exit 1
++ '[' -z 1 ']'
++ MYEXIT=1
++ '[' 1 == 0 ']'
++ ascii_failed
++ cat

( )
( ) (
) _ )
( \_
_(_\ \)__
(____\___))

build failed

++ exit 1
Build step 'Execute shell' marked build as failure
--
To unsubscribe, e-mail: yast-devel+unsubscribe@xxxxxxxxxxxx
To contact the owner, e-mail: yast-devel+owner@xxxxxxxxxxxx

< Previous Next >
This Thread
Follow Ups
References