Mailinglist Archive: yast-devel (251 mails)

< Previous Next >
[yast-devel] Build failed in Jenkins: yast-inetd-HEAD #385
  • From: hudson@xxxxxxx
  • Date: Wed, 31 Jul 2013 10:26:28 +0200 (CEST)
  • Message-id: <121971860.173.1375259188171.JavaMail.jenkins@river>
See <http://river.suse.de/job/yast-inetd-HEAD/385/changes>

Changes:

[yast-devel] YCP Killer: Unify YaST module structure

[yast-devel] YCP Killer: Apply changes needed for Ruby translation

[yast-devel] YCP Killer: Translate YCP files into Ruby

[yast-devel] YCP Killer: Regenerate Makefile.am files in all source directories

------------------------------------------
[...truncated 136 lines...]
checking target system type... x86_64-suse-linux-gnu
checking for a BSD-compatible install... /usr/bin/install -c
checking whether build environment is sane... yes
checking for a thread-safe mkdir -p... /usr/bin/mkdir -p
checking for gawk... gawk
checking whether make sets $(MAKE)... yes
checking how to create a ustar tar archive... gnutar
checking whether ln -s works... yes
checking whether make sets $(MAKE)... (cached) yes
checking for xgettext... /usr/bin/xgettext
checking for ycpdoc... /usr/lib/YaST2/bin/ycpdoc
checking for ycpmakedep... /usr/lib/YaST2/bin/ycpmakedep
checking for ycpc... /usr/bin/ycpc
checking for /usr/share/YaST2/data/testsuite/Makefile.testsuite... yes
checking that generated files are newer than configure... done
configure: creating ./config.status
config.status: creating Makefile
config.status: creating agents/Makefile
config.status: creating doc/autodocs/Makefile
config.status: creating doc/Makefile
config.status: creating src/Makefile
config.status: creating testsuite/Makefile
+ make
Making all in agents
make[1]: Entering directory
`<http://river.suse.de/job/yast-inetd-HEAD/ws/checkout/agents'>
make[1]: Nothing to be done for `all'.
make[1]: Leaving directory
`<http://river.suse.de/job/yast-inetd-HEAD/ws/checkout/agents'>
Making all in doc
make[1]: Entering directory
`<http://river.suse.de/job/yast-inetd-HEAD/ws/checkout/doc'>
Making all in autodocs
make[2]: Entering directory
`<http://river.suse.de/job/yast-inetd-HEAD/ws/checkout/doc/autodocs'>
make[2]: Nothing to be done for `all'.
make[2]: Leaving directory
`<http://river.suse.de/job/yast-inetd-HEAD/ws/checkout/doc/autodocs'>
make[2]: Entering directory
`<http://river.suse.de/job/yast-inetd-HEAD/ws/checkout/doc'>
make[2]: Nothing to be done for `all-am'.
make[2]: Leaving directory
`<http://river.suse.de/job/yast-inetd-HEAD/ws/checkout/doc'>
make[1]: Leaving directory
`<http://river.suse.de/job/yast-inetd-HEAD/ws/checkout/doc'>
Making all in src
make[1]: Entering directory
`<http://river.suse.de/job/yast-inetd-HEAD/ws/checkout/src'>
make[1]: Nothing to be done for `all'.
make[1]: Leaving directory
`<http://river.suse.de/job/yast-inetd-HEAD/ws/checkout/src'>
Making all in testsuite
make[1]: Entering directory
`<http://river.suse.de/job/yast-inetd-HEAD/ws/checkout/testsuite'>
make -f /usr/share/YaST2/data/testsuite/Makefile.testsuite RPMNAME=yast2-inetd
srcdir=. \
dirs \
config/default.exp config/unix.exp config/unknown.exp \
run/runtest.sh yast2-inetd.test/testsuite.exp
make[2]: Entering directory
`<http://river.suse.de/job/yast-inetd-HEAD/ws/checkout/testsuite'>
make[2]: Nothing to be done for `dirs'.
make[2]: `config/default.exp' is up to date.
make[2]: `config/unix.exp' is up to date.
make[2]: `config/unknown.exp' is up to date.
make[2]: `run/runtest.sh' is up to date.
make[2]: `yast2-inetd.test/testsuite.exp' is up to date.
make[2]: Leaving directory
`<http://river.suse.de/job/yast-inetd-HEAD/ws/checkout/testsuite'>
mkdir -p tmp
make[1]: Leaving directory
`<http://river.suse.de/job/yast-inetd-HEAD/ws/checkout/testsuite'>
make[1]: Entering directory
`<http://river.suse.de/job/yast-inetd-HEAD/ws/checkout'>
make[1]: Nothing to be done for `all-am'.
make[1]: Leaving directory
`<http://river.suse.de/job/yast-inetd-HEAD/ws/checkout'>
+ make check
Making check in agents
make[1]: Entering directory
`<http://river.suse.de/job/yast-inetd-HEAD/ws/checkout/agents'>
make[1]: Nothing to be done for `check'.
make[1]: Leaving directory
`<http://river.suse.de/job/yast-inetd-HEAD/ws/checkout/agents'>
Making check in doc
make[1]: Entering directory
`<http://river.suse.de/job/yast-inetd-HEAD/ws/checkout/doc'>
Making check in autodocs
make[2]: Entering directory
`<http://river.suse.de/job/yast-inetd-HEAD/ws/checkout/doc/autodocs'>
make[2]: Nothing to be done for `check'.
make[2]: Leaving directory
`<http://river.suse.de/job/yast-inetd-HEAD/ws/checkout/doc/autodocs'>
make[2]: Entering directory
`<http://river.suse.de/job/yast-inetd-HEAD/ws/checkout/doc'>
make[2]: Nothing to be done for `check-am'.
make[2]: Leaving directory
`<http://river.suse.de/job/yast-inetd-HEAD/ws/checkout/doc'>
make[1]: Leaving directory
`<http://river.suse.de/job/yast-inetd-HEAD/ws/checkout/doc'>
Making check in src
make[1]: Entering directory
`<http://river.suse.de/job/yast-inetd-HEAD/ws/checkout/src'>
make[1]: Nothing to be done for `check'.
make[1]: Leaving directory
`<http://river.suse.de/job/yast-inetd-HEAD/ws/checkout/src'>
Making check in testsuite
make[1]: Entering directory
`<http://river.suse.de/job/yast-inetd-HEAD/ws/checkout/testsuite'>
make -f /usr/share/YaST2/data/testsuite/Makefile.testsuite RPMNAME=yast2-inetd
srcdir=. \
dirs \
config/default.exp config/unix.exp config/unknown.exp \
run/runtest.sh yast2-inetd.test/testsuite.exp
make[2]: Entering directory
`<http://river.suse.de/job/yast-inetd-HEAD/ws/checkout/testsuite'>
make[2]: Nothing to be done for `dirs'.
make[2]: `config/default.exp' is up to date.
make[2]: `config/unix.exp' is up to date.
make[2]: `config/unknown.exp' is up to date.
make[2]: `run/runtest.sh' is up to date.
make[2]: `yast2-inetd.test/testsuite.exp' is up to date.
make[2]: Leaving directory
`<http://river.suse.de/job/yast-inetd-HEAD/ws/checkout/testsuite'>
mkdir -p tmp
make check-DEJAGNU check-local
make[2]: Entering directory
`<http://river.suse.de/job/yast-inetd-HEAD/ws/checkout/testsuite'>
Making a new site.exp file ...
srcdir='.'; export srcdir; \
EXPECT=expect; export EXPECT; \
runtest=runtest; \
if /bin/sh -c "$runtest --version" > /dev/null 2>&1; then \
exit_status=0; l='yast2-inetd'; for tool in $l; do \
if $runtest --tool $tool --srcdir $srcdir ; \
then :; else exit_status=1; fi; \
done; \
else echo "WARNING: could not find 'runtest'" 1>&2; :;\
fi; \
exit $exit_status
WARNING: Couldn't find tool init file
Test Run By root on Wed Jul 31 10:26:18 2013
Native configuration is x86_64-suse-linux-gnu

=== yast2-inetd tests ===

Schedule of variations:
unix

Running target unix
Using /usr/share/dejagnu/baseboards/unix.exp as board description file for
target.
Using /usr/share/dejagnu/config/unix.exp as generic interface file for target.
Using ./config/unix.exp as tool-and-target-specific interface file.
Running ./yast2-inetd.test/ag_netd.exp ...
Running ./tests.ag/i1.rb ...
Running ./tests.ag/i2.rb ...
Running ./tests.ag/i3.rb ...
Running ./tests.ag/i4.rb ...
Running ./tests.ag/i5.rb ...
Running ./tests.ag/i_add.rb ...
Running ./tests.ag/i_add2.rb ...
Running ./tests.ag/i_add3.rb ...
Running ./tests.ag/i_del.rb ...
Running ./tests.ag/x1.rb ...
Running ./tests.ag/x4.rb ...
Running ./tests.ag/x5.rb ...
Running ./tests.ag/x_81.rb ...
Running ./tests.ag/x_add.rb ...
Running ./tests.ag/x_add2.rb ...
Running ./tests.ag/x_add3.rb ...
Running ./tests.ag/x_del.rb ...
Running ./tests.ag/x_double.rb ...
Running ./tests.ag/x_multi.rb ...
Running ./tests.ag/x_multi_add.rb ...
Running ./yast2-inetd.test/testsuite.exp ...

Checking started

Running Inetd ...
FAIL: Wrong stderr for Inetd

The diff follows...

--- tests/Inetd.err 2013-01-22 11:22:04.000000000 +0100
+++ tmp.err.Inetd 2013-07-31 10:26:27.000000000 +0200
@@ -0,0 +1,2 @@
+2013-07-31 10:26:27 <3> app42(20040) [Interpreter] modules/Testsuite.rb:42
Loading module 'Inetd' failed
+2013-07-31 10:26:27 <3> app42(20040) [libycp] Import.cc(import):97 No matching
component found

FAIL: Wrong stderr for Inetd
See the diff above.
Running Inetd2 ...
FAIL: Wrong stderr for Inetd2

The diff follows...

--- tests/Inetd2.err 2013-01-22 11:22:04.000000000 +0100
+++ tmp.err.Inetd2 2013-07-31 10:26:27.000000000 +0200
@@ -0,0 +1,2 @@
+2013-07-31 10:26:27 <3> app42(20066) [Interpreter] modules/Testsuite.rb:42
Loading module 'Inetd' failed
+2013-07-31 10:26:27 <3> app42(20066) [libycp] Import.cc(import):97 No matching
component found

FAIL: Wrong stderr for Inetd2
See the diff above.
Running Inetd3 ...
FAIL: Wrong stderr for Inetd3

The diff follows...

--- tests/Inetd3.err 2013-01-22 11:22:04.000000000 +0100
+++ tmp.err.Inetd3 2013-07-31 10:26:27.000000000 +0200
@@ -0,0 +1,2 @@
+2013-07-31 10:26:27 <3> app42(20092) [Interpreter] modules/Testsuite.rb:42
Loading module 'Inetd' failed
+2013-07-31 10:26:27 <3> app42(20092) [libycp] Import.cc(import):97 No matching
component found

FAIL: Wrong stderr for Inetd3
See the diff above.
Running Inetd_r2 ...
FAIL: Wrong stderr for Inetd_r2

The diff follows...

--- tests/Inetd_r2.err 2013-01-22 11:22:04.000000000 +0100
+++ tmp.err.Inetd_r2 2013-07-31 10:26:27.000000000 +0200
@@ -0,0 +1,2 @@
+2013-07-31 10:26:27 <3> app42(20118) [Interpreter] modules/Testsuite.rb:42
Loading module 'Inetd' failed
+2013-07-31 10:26:27 <3> app42(20118) [libycp] Import.cc(import):97 No matching
component found

FAIL: Wrong stderr for Inetd_r2
See the diff above.
Running dialogs ...
FAIL: Wrong stderr for dialogs

The diff follows...

--- tests/dialogs.err 2013-01-22 11:22:04.000000000 +0100
+++ tmp.err.dialogs 2013-07-31 10:26:28.000000000 +0200
@@ -0,0 +1,2 @@
+2013-07-31 10:26:28 <3> app42(20144) [Interpreter] modules/Testsuite.rb:42
Loading module 'Inetd' failed
+2013-07-31 10:26:28 <3> app42(20144) [libycp] Import.cc(import):97 No matching
component found

FAIL: Wrong stderr for dialogs
See the diff above.

Checking finished


=== yast2-inetd Summary ===

# of expected passes 20
# of unexpected failures 10
make[2]: *** [check-DEJAGNU] Error 1
make[2]: Leaving directory
`<http://river.suse.de/job/yast-inetd-HEAD/ws/checkout/testsuite'>
make[1]: *** [check-am] Error 2
make[1]: Leaving directory
`<http://river.suse.de/job/yast-inetd-HEAD/ws/checkout/testsuite'>
make: *** [check-recursive] Error 1
++ error_exit 2
++ echo 'ERROR: detected exitcode 2'
ERROR: detected exitcode 2
++ cleanup
++ echo '==> Running cleanup'
==> Running cleanup
++ rm -f
<http://river.suse.de/job/yast-inetd-HEAD/ws/ICECC/40c0ab7e54f59a1e4e493c1ea90a882a.tar.gz>
++ footer_and_exit 1
++ '[' -z 1 ']'
++ MYEXIT=1
++ '[' 1 == 0 ']'
++ ascii_failed
++ cat

( )
( ) (
) _ )
( \_
_(_\ \)__
(____\___))

build failed

++ exit 1
Build step 'Execute shell' marked build as failure
--
To unsubscribe, e-mail: yast-devel+unsubscribe@xxxxxxxxxxxx
To contact the owner, e-mail: yast-devel+owner@xxxxxxxxxxxx

< Previous Next >
This Thread
Follow Ups
References