Mailinglist Archive: yast-devel (251 mails)

< Previous Next >
[yast-devel] Build failed in Jenkins: yast-audit-laf-HEAD #128
  • From: hudson@xxxxxxx
  • Date: Wed, 31 Jul 2013 10:23:38 +0200 (CEST)
  • Message-id: <1160516315.168.1375259018835.JavaMail.jenkins@river>
See <http://river.suse.de/job/yast-audit-laf-HEAD/128/changes>

Changes:

[yast-devel] YCP Killer: Unify YaST module structure

[yast-devel] YCP Killer: Apply changes needed for Ruby translation

[yast-devel] YCP Killer: Translate YCP files into Ruby

[yast-devel] YCP Killer: Regenerate Makefile.am files in all source directories

------------------------------------------
[...truncated 44 lines...]
++ ICEJOBS=4
++ export CMAKE_INSTALL_PREFIX=/usr
++ CMAKE_INSTALL_PREFIX=/usr
+++ uname -m
+++ hostname -f
++ export 'CMAKEPARAS=-DBUILDNAME=x86_64 -DSITE=app42
-DCMAKE_INSTALL_PREFIX=/usr'
++ CMAKEPARAS='-DBUILDNAME=x86_64 -DSITE=app42 -DCMAKE_INSTALL_PREFIX=/usr'
++ export ICECCDIR=<http://river.suse.de/job/yast-audit-laf-HEAD/ws/ICECC>
++ ICECCDIR=<http://river.suse.de/job/yast-audit-laf-HEAD/ws/ICECC>
++ echo 'Configuring cmake for Icecream ...'
Configuring cmake for Icecream ...
++ rm -rf <http://river.suse.de/job/yast-audit-laf-HEAD/ws/ICECC>
++ mkdir -p <http://river.suse.de/job/yast-audit-laf-HEAD/ws/ICECC>
++ pushd <http://river.suse.de/job/yast-audit-laf-HEAD/ws/ICECC>
<http://river.suse.de/job/yast-audit-laf-HEAD/ws/ICECC>
<http://river.suse.de/job/yast-audit-laf-HEAD/ws/>
+++ icecc --build-native
+++ tail -1
+++ grep .tar.gz
+++ sed -e 's/creating //'
++ export ICECC_ENV=40c0ab7e54f59a1e4e493c1ea90a882a.tar.gz
++ ICECC_ENV=40c0ab7e54f59a1e4e493c1ea90a882a.tar.gz
++ export ICECC_ENV=40c0ab7e54f59a1e4e493c1ea90a882a.tar.gz
++ ICECC_ENV=40c0ab7e54f59a1e4e493c1ea90a882a.tar.gz
++ export
ICECC_VERSION=<http://river.suse.de/job/yast-audit-laf-HEAD/ws/ICECC/40c0ab7e54f59a1e4e493c1ea90a882a.tar.gz>
++
ICECC_VERSION=<http://river.suse.de/job/yast-audit-laf-HEAD/ws/ICECC/40c0ab7e54f59a1e4e493c1ea90a882a.tar.gz>
++ popd
<http://river.suse.de/job/yast-audit-laf-HEAD/ws/>
++ pushd <http://river.suse.de/job/yast-audit-laf-HEAD/ws/>
<http://river.suse.de/job/yast-audit-laf-HEAD/ws/>
<http://river.suse.de/job/yast-audit-laf-HEAD/ws/>
++ export ICECREAM=-DCMAKE_CXX_COMPILER=/opt/icecream/bin/g++
++ ICECREAM=-DCMAKE_CXX_COMPILER=/opt/icecream/bin/g++
++ export CXX=/opt/icecream/bin/g++
++ CXX=/opt/icecream/bin/g++
++ export 'MAKECMD=make -j 4'
++ MAKECMD='make -j 4'
++ export MAKEBIN=make
++ MAKEBIN=make
++ export
PATH=/opt/icecream/bin:/usr/lib64/mpi/gcc/openmpi/bin:/sbin:/usr/sbin:/usr/local/sbin:/root/bin:/usr/local/bin:/usr/bin:/bin:/usr/X11R6/bin:/usr/games
++
PATH=/opt/icecream/bin:/usr/lib64/mpi/gcc/openmpi/bin:/sbin:/usr/sbin:/usr/local/sbin:/root/bin:/usr/local/bin:/usr/bin:/bin:/usr/X11R6/bin:/usr/games
++ popd
<http://river.suse.de/job/yast-audit-laf-HEAD/ws/>
++ export CHECKOUTDIR=<http://river.suse.de/job/yast-audit-laf-HEAD/ws/checkout>
++ CHECKOUTDIR=<http://river.suse.de/job/yast-audit-laf-HEAD/ws/checkout>
++ export BUILDDIR=<http://river.suse.de/job/yast-audit-laf-HEAD/ws/build>
++ BUILDDIR=<http://river.suse.de/job/yast-audit-laf-HEAD/ws/build>
++ export
PACKAGEDIR=<http://river.suse.de/job/yast-audit-laf-HEAD/ws/build/package>
++ PACKAGEDIR=<http://river.suse.de/job/yast-audit-laf-HEAD/ws/build/package>
++ export ARTIFACTS=<http://river.suse.de/job/yast-audit-laf-HEAD/ws/.artifacts>
++ ARTIFACTS=<http://river.suse.de/job/yast-audit-laf-HEAD/ws/.artifacts>
++ export OBSDIR=<http://river.suse.de/job/yast-audit-laf-HEAD/ws/OBS>
++ OBSDIR=<http://river.suse.de/job/yast-audit-laf-HEAD/ws/OBS>
++ export RPMTOPDIR=<http://river.suse.de/job/yast-audit-laf-HEAD/ws/rpm>
++ RPMTOPDIR=<http://river.suse.de/job/yast-audit-laf-HEAD/ws/rpm>
++ export RPMOUT=<http://river.suse.de/job/yast-audit-laf-HEAD/ws/rpm/rpms>
++ RPMOUT=<http://river.suse.de/job/yast-audit-laf-HEAD/ws/rpm/rpms>
++ export
RPMBUILDDIR=<http://river.suse.de/job/yast-audit-laf-HEAD/ws/rpm/rpmbuild>
++ RPMBUILDDIR=<http://river.suse.de/job/yast-audit-laf-HEAD/ws/rpm/rpmbuild>
++ export
RPMBUILDROOT=<http://river.suse.de/job/yast-audit-laf-HEAD/ws/rpm/rpmbuildroot>
++
RPMBUILDROOT=<http://river.suse.de/job/yast-audit-laf-HEAD/ws/rpm/rpmbuildroot>
++ rm -rf <http://river.suse.de/job/yast-audit-laf-HEAD/ws/rpm/rpms>
++ rm -rf <http://river.suse.de/job/yast-audit-laf-HEAD/ws/rpm/rpmbuild>
++ rm -rf <http://river.suse.de/job/yast-audit-laf-HEAD/ws/rpm/rpmbuildroot>
++ rm -rf <http://river.suse.de/job/yast-audit-laf-HEAD/ws/.artifacts>
++ rm -rf <http://river.suse.de/job/yast-audit-laf-HEAD/ws/OBS>
++ rm -rf '<http://river.suse.de/job/yast-audit-laf-HEAD/ws/copy-to-slave*.dir'>
++ [[ 1 == 1 ]]
++ echo 'Using autotools for building'
Using autotools for building
++ export BUILDDIR=<http://river.suse.de/job/yast-audit-laf-HEAD/ws/checkout>
++ BUILDDIR=<http://river.suse.de/job/yast-audit-laf-HEAD/ws/checkout>
++ export
PACKAGEDIR=<http://river.suse.de/job/yast-audit-laf-HEAD/ws/checkout/package>
++ PACKAGEDIR=<http://river.suse.de/job/yast-audit-laf-HEAD/ws/checkout/package>
++ mkdir -p <http://river.suse.de/job/yast-audit-laf-HEAD/ws/rpm>
++ mkdir -p <http://river.suse.de/job/yast-audit-laf-HEAD/ws/rpm/rpms>
++ mkdir -p <http://river.suse.de/job/yast-audit-laf-HEAD/ws/rpm/rpmbuild>
++ mkdir -p <http://river.suse.de/job/yast-audit-laf-HEAD/ws/rpm/rpmbuildroot>
++ mkdir -p <http://river.suse.de/job/yast-audit-laf-HEAD/ws/.artifacts>
++ mkdir -p <http://river.suse.de/job/yast-audit-laf-HEAD/ws/OBS>
++ cat
+ PACKAGENAME=yast-audit-laf
+ PACKAGENAME=yast2-audit-laf
+ cd <http://river.suse.de/job/yast-audit-laf-HEAD/ws/checkout>
+ make -f Makefile.cvs
y2tool y2autoconf
y2autoconf: Generating toplevel configure.ac
y2tool y2automake
y2automake: Copying automakefiles for inclusion
y2automake: Generating toplevel Makefile.am
autoreconf --force --install
./configure --prefix=/usr --libdir=/usr/lib64
checking build system type... x86_64-suse-linux-gnu
checking host system type... x86_64-suse-linux-gnu
checking target system type... x86_64-suse-linux-gnu
checking for a BSD-compatible install... /usr/bin/install -c
checking whether build environment is sane... yes
checking for a thread-safe mkdir -p... /usr/bin/mkdir -p
checking for gawk... gawk
checking whether make sets $(MAKE)... yes
checking how to create a ustar tar archive... gnutar
checking whether ln -s works... yes
checking whether make sets $(MAKE)... (cached) yes
checking for xgettext... /usr/bin/xgettext
checking for ycpdoc... /usr/lib/YaST2/bin/ycpdoc
checking for ycpmakedep... /usr/lib/YaST2/bin/ycpmakedep
checking for ycpc... /usr/bin/ycpc
checking for /usr/share/YaST2/data/testsuite/Makefile.testsuite... yes
checking that generated files are newer than configure... done
configure: creating ./config.status
config.status: creating Makefile
config.status: creating agents/Makefile
config.status: creating doc/autodocs/Makefile
config.status: creating doc/Makefile
config.status: creating src/Makefile
config.status: creating testsuite/Makefile
+ make
Making all in agents
make[1]: Entering directory
`<http://river.suse.de/job/yast-audit-laf-HEAD/ws/checkout/agents'>
make[1]: Nothing to be done for `all'.
make[1]: Leaving directory
`<http://river.suse.de/job/yast-audit-laf-HEAD/ws/checkout/agents'>
Making all in doc
make[1]: Entering directory
`<http://river.suse.de/job/yast-audit-laf-HEAD/ws/checkout/doc'>
Making all in autodocs
make[2]: Entering directory
`<http://river.suse.de/job/yast-audit-laf-HEAD/ws/checkout/doc/autodocs'>
make[2]: Nothing to be done for `all'.
make[2]: Leaving directory
`<http://river.suse.de/job/yast-audit-laf-HEAD/ws/checkout/doc/autodocs'>
make[2]: Entering directory
`<http://river.suse.de/job/yast-audit-laf-HEAD/ws/checkout/doc'>
make[2]: Nothing to be done for `all-am'.
make[2]: Leaving directory
`<http://river.suse.de/job/yast-audit-laf-HEAD/ws/checkout/doc'>
make[1]: Leaving directory
`<http://river.suse.de/job/yast-audit-laf-HEAD/ws/checkout/doc'>
Making all in src
make[1]: Entering directory
`<http://river.suse.de/job/yast-audit-laf-HEAD/ws/checkout/src'>
make[1]: Nothing to be done for `all'.
make[1]: Leaving directory
`<http://river.suse.de/job/yast-audit-laf-HEAD/ws/checkout/src'>
Making all in testsuite
make[1]: Entering directory
`<http://river.suse.de/job/yast-audit-laf-HEAD/ws/checkout/testsuite'>
make -f /usr/share/YaST2/data/testsuite/Makefile.testsuite
RPMNAME=yast2-audit-laf srcdir=.
make[2]: Entering directory
`<http://river.suse.de/job/yast-audit-laf-HEAD/ws/checkout/testsuite'>
make[2]: Nothing to be done for `all'.
make[2]: Leaving directory
`<http://river.suse.de/job/yast-audit-laf-HEAD/ws/checkout/testsuite'>
make[1]: Leaving directory
`<http://river.suse.de/job/yast-audit-laf-HEAD/ws/checkout/testsuite'>
make[1]: Entering directory
`<http://river.suse.de/job/yast-audit-laf-HEAD/ws/checkout'>
make[1]: Nothing to be done for `all-am'.
make[1]: Leaving directory
`<http://river.suse.de/job/yast-audit-laf-HEAD/ws/checkout'>
+ make check
Making check in agents
make[1]: Entering directory
`<http://river.suse.de/job/yast-audit-laf-HEAD/ws/checkout/agents'>
make[1]: Nothing to be done for `check'.
make[1]: Leaving directory
`<http://river.suse.de/job/yast-audit-laf-HEAD/ws/checkout/agents'>
Making check in doc
make[1]: Entering directory
`<http://river.suse.de/job/yast-audit-laf-HEAD/ws/checkout/doc'>
Making check in autodocs
make[2]: Entering directory
`<http://river.suse.de/job/yast-audit-laf-HEAD/ws/checkout/doc/autodocs'>
make[2]: Nothing to be done for `check'.
make[2]: Leaving directory
`<http://river.suse.de/job/yast-audit-laf-HEAD/ws/checkout/doc/autodocs'>
make[2]: Entering directory
`<http://river.suse.de/job/yast-audit-laf-HEAD/ws/checkout/doc'>
make[2]: Nothing to be done for `check-am'.
make[2]: Leaving directory
`<http://river.suse.de/job/yast-audit-laf-HEAD/ws/checkout/doc'>
make[1]: Leaving directory
`<http://river.suse.de/job/yast-audit-laf-HEAD/ws/checkout/doc'>
Making check in src
make[1]: Entering directory
`<http://river.suse.de/job/yast-audit-laf-HEAD/ws/checkout/src'>
make[1]: Nothing to be done for `check'.
make[1]: Leaving directory
`<http://river.suse.de/job/yast-audit-laf-HEAD/ws/checkout/src'>
Making check in testsuite
make[1]: Entering directory
`<http://river.suse.de/job/yast-audit-laf-HEAD/ws/checkout/testsuite'>
make -f /usr/share/YaST2/data/testsuite/Makefile.testsuite
RPMNAME=yast2-audit-laf srcdir=.
make[2]: Entering directory
`<http://river.suse.de/job/yast-audit-laf-HEAD/ws/checkout/testsuite'>
make[2]: Nothing to be done for `all'.
make[2]: Leaving directory
`<http://river.suse.de/job/yast-audit-laf-HEAD/ws/checkout/testsuite'>
make check-DEJAGNU check-local
make[2]: Entering directory
`<http://river.suse.de/job/yast-audit-laf-HEAD/ws/checkout/testsuite'>
Making a new site.exp file ...
srcdir='.'; export srcdir; \
EXPECT=expect; export EXPECT; \
runtest=runtest; \
if /bin/sh -c "$runtest --version" > /dev/null 2>&1; then \
exit_status=0; l='yast2-audit-laf'; for tool in $l; do \
if $runtest --tool $tool --srcdir $srcdir ; \
then :; else exit_status=1; fi; \
done; \
else echo "WARNING: could not find 'runtest'" 1>&2; :;\
fi; \
exit $exit_status
WARNING: Couldn't find tool init file
Test Run By root on Wed Jul 31 10:23:38 2013
Native configuration is x86_64-suse-linux-gnu

=== yast2-audit-laf tests ===

Schedule of variations:
unix

Running target unix
Using /usr/share/dejagnu/baseboards/unix.exp as board description file for
target.
Using /usr/share/dejagnu/config/unix.exp as generic interface file for target.
Using ./config/unix.exp as tool-and-target-specific interface file.
Running ./yast2-audit-laf.test/testsuite.exp ...

Checking started

Running TestModule ...
FAIL: Wrong stderr for TestModule

The diff follows...

--- tests/TestModule.err 2013-01-22 11:07:13.000000000 +0100
+++ tmp.err.TestModule 2013-07-31 10:23:38.000000000 +0200
@@ -0,0 +1,2 @@
+2013-07-31 10:23:38 <3> app42(2294) [Interpreter] modules/Testsuite.rb:42
Loading module 'AuditLaf' failed
+2013-07-31 10:23:38 <3> app42(2294) [libycp] Import.cc(import):97 No matching
component found

FAIL: Wrong stderr for TestModule
See the diff above.

Checking finished


=== yast2-audit-laf Summary ===

# of unexpected failures 2
make[2]: *** [check-DEJAGNU] Error 1
make[2]: Leaving directory
`<http://river.suse.de/job/yast-audit-laf-HEAD/ws/checkout/testsuite'>
make[1]: *** [check-am] Error 2
make[1]: Leaving directory
`<http://river.suse.de/job/yast-audit-laf-HEAD/ws/checkout/testsuite'>
make: *** [check-recursive] Error 1
++ error_exit 2
++ echo 'ERROR: detected exitcode 2'
ERROR: detected exitcode 2
++ cleanup
++ echo '==> Running cleanup'
==> Running cleanup
++ rm -f
<http://river.suse.de/job/yast-audit-laf-HEAD/ws/ICECC/40c0ab7e54f59a1e4e493c1ea90a882a.tar.gz>
++ footer_and_exit 1
++ '[' -z 1 ']'
++ MYEXIT=1
++ '[' 1 == 0 ']'
++ ascii_failed
++ cat

( )
( ) (
) _ )
( \_
_(_\ \)__
(____\___))

build failed

++ exit 1
Build step 'Execute shell' marked build as failure
--
To unsubscribe, e-mail: yast-devel+unsubscribe@xxxxxxxxxxxx
To contact the owner, e-mail: yast-devel+owner@xxxxxxxxxxxx

< Previous Next >
This Thread
Follow Ups
References