Mailinglist Archive: yast-devel (251 mails)

< Previous Next >
[yast-devel] Build failed in Jenkins: yast-dbus-server-HEAD #25
  • From: hudson@xxxxxxx
  • Date: Wed, 31 Jul 2013 10:12:50 +0200 (CEST)
  • Message-id: <1036443425.164.1375258370529.JavaMail.jenkins@river>
See <http://river.suse.de/job/yast-dbus-server-HEAD/25/changes>

Changes:

[yast-devel] YCP Killer: Apply changes needed for Ruby translation

[yast-devel] YCP Killer: Translate YCP files into Ruby

------------------------------------------
[...truncated 217 lines...]
checking for inttypes.h... yes
checking for stdint.h... yes
checking for unistd.h... yes
checking for dlfcn.h... yes
checking for objdir... .libs
checking if gcc supports -fno-rtti -fno-exceptions... no
checking for gcc option to produce PIC... -fPIC -DPIC
checking if gcc PIC flag -fPIC -DPIC works... yes
checking if gcc static flag -static works... no
checking if gcc supports -c -o file.o... yes
checking if gcc supports -c -o file.o... (cached) yes
checking whether the gcc linker (/usr/x86_64-suse-linux/bin/ld -m elf_x86_64)
supports shared libraries... yes
checking whether -lc should be explicitly linked in... no
checking dynamic linker characteristics... GNU/Linux ld.so
checking how to hardcode library paths into programs... immediate
checking whether stripping libraries is possible... yes
checking if libtool supports shared libraries... yes
checking whether to build shared libraries... yes
checking whether to build static libraries... no
checking how to run the C++ preprocessor... /opt/icecream/bin/g++ -E
checking for ld used by /opt/icecream/bin/g++... /usr/x86_64-suse-linux/bin/ld
-m elf_x86_64
checking if the linker (/usr/x86_64-suse-linux/bin/ld -m elf_x86_64) is GNU
ld... yes
checking whether the /opt/icecream/bin/g++ linker
(/usr/x86_64-suse-linux/bin/ld -m elf_x86_64) supports shared libraries... yes
checking for /opt/icecream/bin/g++ option to produce PIC... -fPIC -DPIC
checking if /opt/icecream/bin/g++ PIC flag -fPIC -DPIC works... yes
checking if /opt/icecream/bin/g++ static flag -static works... no
checking if /opt/icecream/bin/g++ supports -c -o file.o... yes
checking if /opt/icecream/bin/g++ supports -c -o file.o... (cached) yes
checking whether the /opt/icecream/bin/g++ linker
(/usr/x86_64-suse-linux/bin/ld -m elf_x86_64) supports shared libraries... yes
checking dynamic linker characteristics... (cached) GNU/Linux ld.so
checking how to hardcode library paths into programs... immediate
checking for size_t... yes
checking for working alloca.h... yes
checking for alloca... yes
checking for ANSI C header files... (cached) yes
checking for docbook stylesheets...
/usr/share/xml/docbook/stylesheet/nwalsh/current
checking for xsltproc... /usr/bin/xsltproc
checking whether xsltproc works... yes
checking for DBUS... yes
checking for POLKIT... yes
checking that generated files are newer than configure... done
configure: creating ./config.status
config.status: creating src/services/namespace_service/src/yast_dbus_names.h
config.status: creating
src/services/namespace_service/src/org.opensuse.yast.module-manager.policy
config.status: creating
src/services/namespace_service/src/org.opensuse.YaST.modules.conf
config.status: creating
src/services/namespace_service/src/org.opensuse.YaST.modules.service.in
config.status: creating src/services/SCR_service/org.opensuse.yast.SCR.conf
config.status: creating
src/services/SCR_service/org.opensuse.yast.SCR.service.in
config.status: creating src/services/SCR_service/scr_names.h
config.status: creating src/services/SCR_service/test_SCR_dbus_server.rb
config.status: creating Makefile
config.status: creating src/liby2dbus/src/Makefile
config.status: creating src/liby2dbus/Makefile
config.status: creating src/services/SCR_service/Makefile
config.status: creating src/services/namespace_service/src/Makefile
config.status: creating src/services/namespace_service/doc/Makefile
config.status: creating
src/services/namespace_service/testsuite/modules/Makefile
config.status: creating src/services/namespace_service/testsuite/Makefile
config.status: creating src/services/namespace_service/Makefile
config.status: creating src/services/Makefile
config.status: creating src/Makefile
config.status: creating config.h
config.status: executing depfiles commands
config.status: executing libtool commands
+ make
make all-recursive
make[1]: Entering directory
`<http://river.suse.de/job/yast-dbus-server-HEAD/ws/checkout'>
Making all in src
make[2]: Entering directory
`<http://river.suse.de/job/yast-dbus-server-HEAD/ws/checkout/src'>
Making all in liby2dbus
make[3]: Entering directory
`<http://river.suse.de/job/yast-dbus-server-HEAD/ws/checkout/src/liby2dbus'>
Making all in src
make[4]: Entering directory
`<http://river.suse.de/job/yast-dbus-server-HEAD/ws/checkout/src/liby2dbus/src'>
CXX liby2dbus_la-DBusServerBase.lo
CXXLD liby2dbus.la
make[4]: Leaving directory
`<http://river.suse.de/job/yast-dbus-server-HEAD/ws/checkout/src/liby2dbus/src'>
make[4]: Entering directory
`<http://river.suse.de/job/yast-dbus-server-HEAD/ws/checkout/src/liby2dbus'>
make[4]: Nothing to be done for `all-am'.
make[4]: Leaving directory
`<http://river.suse.de/job/yast-dbus-server-HEAD/ws/checkout/src/liby2dbus'>
make[3]: Leaving directory
`<http://river.suse.de/job/yast-dbus-server-HEAD/ws/checkout/src/liby2dbus'>
Making all in services
make[3]: Entering directory
`<http://river.suse.de/job/yast-dbus-server-HEAD/ws/checkout/src/services'>
Making all in SCR_service
make[4]: Entering directory
`<http://river.suse.de/job/yast-dbus-server-HEAD/ws/checkout/src/services/SCR_service'>
CXX SCR_dbus_server-SCR_dbus_server.o
CXX SCR_dbus_server-DBusServer.o
CXXLD SCR_dbus_server
sed -e "s|\%YBINDIR\%|/usr/lib/YaST2/bin|" org.opensuse.yast.SCR.service.in >
org.opensuse.yast.SCR.service
make[4]: Leaving directory
`<http://river.suse.de/job/yast-dbus-server-HEAD/ws/checkout/src/services/SCR_service'>
Making all in namespace_service
make[4]: Entering directory
`<http://river.suse.de/job/yast-dbus-server-HEAD/ws/checkout/src/services/namespace_service'>
Making all in src
make[5]: Entering directory
`<http://river.suse.de/job/yast-dbus-server-HEAD/ws/checkout/src/services/namespace_service/src'>
CXX yast_modules_dbus_server-yast_modules_dbus_server.o
CXX yast_modules_dbus_server-DBusModulesServer.o
CXXLD yast_modules_dbus_server
sed -e "s|\%YBINDIR\%|/usr/lib/YaST2/bin|" org.opensuse.YaST.modules.service.in
org.opensuse.YaST.modules.service
make[5]: Leaving directory
`<http://river.suse.de/job/yast-dbus-server-HEAD/ws/checkout/src/services/namespace_service/src'>
Making all in doc
make[5]: Entering directory
`<http://river.suse.de/job/yast-dbus-server-HEAD/ws/checkout/src/services/namespace_service/doc'>
make[5]: Nothing to be done for `all'.
make[5]: Leaving directory
`<http://river.suse.de/job/yast-dbus-server-HEAD/ws/checkout/src/services/namespace_service/doc'>
Making all in testsuite
make[5]: Entering directory
`<http://river.suse.de/job/yast-dbus-server-HEAD/ws/checkout/src/services/namespace_service/testsuite'>
Making all in modules
make[6]: Entering directory
`<http://river.suse.de/job/yast-dbus-server-HEAD/ws/checkout/src/services/namespace_service/testsuite/modules'>
make[6]: Nothing to be done for `all'.
make[6]: Leaving directory
`<http://river.suse.de/job/yast-dbus-server-HEAD/ws/checkout/src/services/namespace_service/testsuite/modules'>
make[6]: Entering directory
`<http://river.suse.de/job/yast-dbus-server-HEAD/ws/checkout/src/services/namespace_service/testsuite'>
make[6]: Nothing to be done for `all-am'.
make[6]: Leaving directory
`<http://river.suse.de/job/yast-dbus-server-HEAD/ws/checkout/src/services/namespace_service/testsuite'>
make[5]: Leaving directory
`<http://river.suse.de/job/yast-dbus-server-HEAD/ws/checkout/src/services/namespace_service/testsuite'>
make[5]: Entering directory
`<http://river.suse.de/job/yast-dbus-server-HEAD/ws/checkout/src/services/namespace_service'>
make[5]: Nothing to be done for `all-am'.
make[5]: Leaving directory
`<http://river.suse.de/job/yast-dbus-server-HEAD/ws/checkout/src/services/namespace_service'>
make[4]: Leaving directory
`<http://river.suse.de/job/yast-dbus-server-HEAD/ws/checkout/src/services/namespace_service'>
make[4]: Entering directory
`<http://river.suse.de/job/yast-dbus-server-HEAD/ws/checkout/src/services'>
make[4]: Nothing to be done for `all-am'.
make[4]: Leaving directory
`<http://river.suse.de/job/yast-dbus-server-HEAD/ws/checkout/src/services'>
make[3]: Leaving directory
`<http://river.suse.de/job/yast-dbus-server-HEAD/ws/checkout/src/services'>
make[3]: Entering directory
`<http://river.suse.de/job/yast-dbus-server-HEAD/ws/checkout/src'>
make[3]: Nothing to be done for `all-am'.
make[3]: Leaving directory
`<http://river.suse.de/job/yast-dbus-server-HEAD/ws/checkout/src'>
make[2]: Leaving directory
`<http://river.suse.de/job/yast-dbus-server-HEAD/ws/checkout/src'>
make[2]: Entering directory
`<http://river.suse.de/job/yast-dbus-server-HEAD/ws/checkout'>
make[2]: Nothing to be done for `all-am'.
make[2]: Leaving directory
`<http://river.suse.de/job/yast-dbus-server-HEAD/ws/checkout'>
make[1]: Leaving directory
`<http://river.suse.de/job/yast-dbus-server-HEAD/ws/checkout'>
+ make check
Making check in src
make[1]: Entering directory
`<http://river.suse.de/job/yast-dbus-server-HEAD/ws/checkout/src'>
Making check in liby2dbus
make[2]: Entering directory
`<http://river.suse.de/job/yast-dbus-server-HEAD/ws/checkout/src/liby2dbus'>
Making check in src
make[3]: Entering directory
`<http://river.suse.de/job/yast-dbus-server-HEAD/ws/checkout/src/liby2dbus/src'>
make[3]: Nothing to be done for `check'.
make[3]: Leaving directory
`<http://river.suse.de/job/yast-dbus-server-HEAD/ws/checkout/src/liby2dbus/src'>
make[3]: Entering directory
`<http://river.suse.de/job/yast-dbus-server-HEAD/ws/checkout/src/liby2dbus'>
make[3]: Nothing to be done for `check-am'.
make[3]: Leaving directory
`<http://river.suse.de/job/yast-dbus-server-HEAD/ws/checkout/src/liby2dbus'>
make[2]: Leaving directory
`<http://river.suse.de/job/yast-dbus-server-HEAD/ws/checkout/src/liby2dbus'>
Making check in services
make[2]: Entering directory
`<http://river.suse.de/job/yast-dbus-server-HEAD/ws/checkout/src/services'>
Making check in SCR_service
make[3]: Entering directory
`<http://river.suse.de/job/yast-dbus-server-HEAD/ws/checkout/src/services/SCR_service'>
make check-local
make[4]: Entering directory
`<http://river.suse.de/job/yast-dbus-server-HEAD/ws/checkout/src/services/SCR_service'>
if type ruby; then \
ruby test_SCR_dbus_server.rb; \
else \
echo skiping test; \
fi
ruby is /usr/bin/ruby
Please install ruby-dbus
make[4]: Leaving directory
`<http://river.suse.de/job/yast-dbus-server-HEAD/ws/checkout/src/services/SCR_service'>
make[3]: Leaving directory
`<http://river.suse.de/job/yast-dbus-server-HEAD/ws/checkout/src/services/SCR_service'>
Making check in namespace_service
make[3]: Entering directory
`<http://river.suse.de/job/yast-dbus-server-HEAD/ws/checkout/src/services/namespace_service'>
Making check in src
make[4]: Entering directory
`<http://river.suse.de/job/yast-dbus-server-HEAD/ws/checkout/src/services/namespace_service/src'>
make[4]: Nothing to be done for `check'.
make[4]: Leaving directory
`<http://river.suse.de/job/yast-dbus-server-HEAD/ws/checkout/src/services/namespace_service/src'>
Making check in doc
make[4]: Entering directory
`<http://river.suse.de/job/yast-dbus-server-HEAD/ws/checkout/src/services/namespace_service/doc'>
make[4]: Nothing to be done for `check'.
make[4]: Leaving directory
`<http://river.suse.de/job/yast-dbus-server-HEAD/ws/checkout/src/services/namespace_service/doc'>
Making check in testsuite
make[4]: Entering directory
`<http://river.suse.de/job/yast-dbus-server-HEAD/ws/checkout/src/services/namespace_service/testsuite'>
Making check in modules
make[5]: Entering directory
`<http://river.suse.de/job/yast-dbus-server-HEAD/ws/checkout/src/services/namespace_service/testsuite/modules'>
make[5]: Nothing to be done for `check'.
make[5]: Leaving directory
`<http://river.suse.de/job/yast-dbus-server-HEAD/ws/checkout/src/services/namespace_service/testsuite/modules'>
make[5]: Entering directory
`<http://river.suse.de/job/yast-dbus-server-HEAD/ws/checkout/src/services/namespace_service/testsuite'>
make check-TESTS
make[6]: Entering directory
`<http://river.suse.de/job/yast-dbus-server-HEAD/ws/checkout/src/services/namespace_service/testsuite'>
/usr/bin/python
Hey, server, get on da bus... off we go!
Stress test, 1 iterations to go.
Running ./t1
Testing org.opensuse.YaST.Values.ListMapStringAny ... Error
org.freedesktop.DBus.Error.ServiceUnknown: The name org.opensuse.YaST.modules
was not provided by any .service files
FAILED!
Diff:
--- ./org.opensuse.YaST.Values.ListMapStringAny.test 2013-01-22
11:16:37.000000000 +0100
+++ ./org.opensuse.YaST.Values.ListMapStringAny.test.reply 2013-07-31
10:12:07.000000000 +0200
@@ -1,19 +0,0 @@
- array [
- array [
- dict entry(
- string "a"
- variant string "b"
- )
- ]
- array [
- dict entry(
- string "c"
- variant array [
- variant int64 10
- variant int64 20
- variant string "haha"
- variant string "`Symbol"
- ]
- )
- ]
- ]
FAIL: test_all
==========================================
1 of 1 test failed
Please report to http://bugs.opensuse.org/
==========================================
make[6]: *** [check-TESTS] Error 1
make[6]: Leaving directory
`<http://river.suse.de/job/yast-dbus-server-HEAD/ws/checkout/src/services/namespace_service/testsuite'>
make[5]: *** [check-am] Error 2
make[5]: Leaving directory
`<http://river.suse.de/job/yast-dbus-server-HEAD/ws/checkout/src/services/namespace_service/testsuite'>
make[4]: *** [check-recursive] Error 1
make[4]: Leaving directory
`<http://river.suse.de/job/yast-dbus-server-HEAD/ws/checkout/src/services/namespace_service/testsuite'>
make[3]: *** [check-recursive] Error 1
make[3]: Leaving directory
`<http://river.suse.de/job/yast-dbus-server-HEAD/ws/checkout/src/services/namespace_service'>
make[2]: *** [check-recursive] Error 1
make[2]: Leaving directory
`<http://river.suse.de/job/yast-dbus-server-HEAD/ws/checkout/src/services'>
make[1]: *** [check-recursive] Error 1
make[1]: Leaving directory
`<http://river.suse.de/job/yast-dbus-server-HEAD/ws/checkout/src'>
make: *** [check-recursive] Error 1
++ error_exit 2
++ echo 'ERROR: detected exitcode 2'
ERROR: detected exitcode 2
++ cleanup
++ echo '==> Running cleanup'
==> Running cleanup
++ rm -f
<http://river.suse.de/job/yast-dbus-server-HEAD/ws/ICECC/40c0ab7e54f59a1e4e493c1ea90a882a.tar.gz>
++ footer_and_exit 1
++ '[' -z 1 ']'
++ MYEXIT=1
++ '[' 1 == 0 ']'
++ ascii_failed
++ cat

( )
( ) (
) _ )
( \_
_(_\ \)__
(____\___))

build failed

++ exit 1
Process leaked file descriptors. See
http://wiki.jenkins-ci.org/display/JENKINS/Spawning+processes+from+build for
more information
Build step 'Execute shell' marked build as failure
ruby:
--
To unsubscribe, e-mail: yast-devel+unsubscribe@xxxxxxxxxxxx
To contact the owner, e-mail: yast-devel+owner@xxxxxxxxxxxx

< Previous Next >
This Thread
Follow Ups