Mailinglist Archive: yast-devel (251 mails)

< Previous Next >
[yast-devel] Build failed in Jenkins: yast-samba-server-HEAD #423
  • From: hudson@xxxxxxx
  • Date: Tue, 30 Jul 2013 14:40:18 +0200 (CEST)
  • Message-id: <304590234.153.1375188018395.JavaMail.jenkins@river>
See <http://river.suse.de/job/yast-samba-server-HEAD/423/>

------------------------------------------
[...truncated 515 lines...]
See the diff above.
Running YaPI-EditServerDescription ...
FAIL: Wrong stderr for YaPI-EditServerDescription

The diff follows...

--- tests/YaPI-EditServerDescription.err 2013-01-22 11:58:52.000000000
+0100
+++ tmp.err.YaPI-EditServerDescription 2013-07-30 14:40:12.000000000 +0200
@@ -0,0 +1,2 @@
+2013-07-30 14:40:12 <3> app42(19638) [Interpreter] modules/Testsuite.rb:42
Loading module 'Mode' failed
+2013-07-30 14:40:12 <3> app42(19638) [libycp] Import.cc(import):97 No matching
component found

FAIL: Wrong stderr for YaPI-EditServerDescription
See the diff above.
Running YaPI-EditService ...
FAIL: Wrong stderr for YaPI-EditService

The diff follows...

--- tests/YaPI-EditService.err 2013-01-22 11:58:52.000000000 +0100
+++ tmp.err.YaPI-EditService 2013-07-30 14:40:12.000000000 +0200
@@ -0,0 +1,2 @@
+2013-07-30 14:40:12 <3> app42(19664) [Interpreter] modules/Testsuite.rb:42
Loading module 'Mode' failed
+2013-07-30 14:40:12 <3> app42(19664) [libycp] Import.cc(import):97 No matching
component found

FAIL: Wrong stderr for YaPI-EditService
See the diff above.
Running YaPI-EditShare ...
FAIL: Wrong stderr for YaPI-EditShare

The diff follows...

--- tests/YaPI-EditShare.err 2013-01-22 11:58:52.000000000 +0100
+++ tmp.err.YaPI-EditShare 2013-07-30 14:40:12.000000000 +0200
@@ -0,0 +1,2 @@
+2013-07-30 14:40:12 <3> app42(19690) [Interpreter] modules/Testsuite.rb:42
Loading module 'Mode' failed
+2013-07-30 14:40:12 <3> app42(19690) [libycp] Import.cc(import):97 No matching
component found

FAIL: Wrong stderr for YaPI-EditShare
See the diff above.
Running YaPI-EnableHomes ...
FAIL: Wrong stderr for YaPI-EnableHomes

The diff follows...

--- tests/YaPI-EnableHomes.err 2013-01-22 11:58:52.000000000 +0100
+++ tmp.err.YaPI-EnableHomes 2013-07-30 14:40:13.000000000 +0200
@@ -0,0 +1,2 @@
+2013-07-30 14:40:13 <3> app42(19716) [Interpreter] modules/Testsuite.rb:42
Loading module 'Mode' failed
+2013-07-30 14:40:13 <3> app42(19716) [libycp] Import.cc(import):97 No matching
component found

FAIL: Wrong stderr for YaPI-EnableHomes
See the diff above.
Running YaPI-EnableNetlogon ...
FAIL: Wrong stderr for YaPI-EnableNetlogon

The diff follows...

--- tests/YaPI-EnableNetlogon.err 2013-01-22 11:58:52.000000000 +0100
+++ tmp.err.YaPI-EnableNetlogon 2013-07-30 14:40:13.000000000 +0200
@@ -0,0 +1,2 @@
+2013-07-30 14:40:13 <3> app42(19742) [Interpreter] modules/Testsuite.rb:42
Loading module 'Mode' failed
+2013-07-30 14:40:13 <3> app42(19742) [libycp] Import.cc(import):97 No matching
component found

FAIL: Wrong stderr for YaPI-EnableNetlogon
See the diff above.
Running YaPI-EnablePrinters ...
FAIL: Wrong stderr for YaPI-EnablePrinters

The diff follows...

--- tests/YaPI-EnablePrinters.err 2013-01-22 11:58:52.000000000 +0100
+++ tmp.err.YaPI-EnablePrinters 2013-07-30 14:40:14.000000000 +0200
@@ -0,0 +1,2 @@
+2013-07-30 14:40:14 <3> app42(19768) [Interpreter] modules/Testsuite.rb:42
Loading module 'Mode' failed
+2013-07-30 14:40:14 <3> app42(19768) [libycp] Import.cc(import):97 No matching
component found

FAIL: Wrong stderr for YaPI-EnablePrinters
See the diff above.
Running YaPI-EnableShare-2 ...
FAIL: Wrong stderr for YaPI-EnableShare-2

The diff follows...

--- tests/YaPI-EnableShare-2.err 2013-01-22 11:58:52.000000000 +0100
+++ tmp.err.YaPI-EnableShare-2 2013-07-30 14:40:14.000000000 +0200
@@ -0,0 +1,2 @@
+2013-07-30 14:40:14 <3> app42(19794) [Interpreter] modules/Testsuite.rb:42
Loading module 'Mode' failed
+2013-07-30 14:40:14 <3> app42(19794) [libycp] Import.cc(import):97 No matching
component found

FAIL: Wrong stderr for YaPI-EnableShare-2
See the diff above.
Running YaPI-EnableShare ...
FAIL: Wrong stderr for YaPI-EnableShare

The diff follows...

--- tests/YaPI-EnableShare.err 2013-01-22 11:58:52.000000000 +0100
+++ tmp.err.YaPI-EnableShare 2013-07-30 14:40:14.000000000 +0200
@@ -0,0 +1,2 @@
+2013-07-30 14:40:14 <3> app42(19820) [Interpreter] modules/Testsuite.rb:42
Loading module 'Mode' failed
+2013-07-30 14:40:14 <3> app42(19820) [libycp] Import.cc(import):97 No matching
component found

FAIL: Wrong stderr for YaPI-EnableShare
See the diff above.
Running YaPI-GetAllDirectories ...
FAIL: Wrong stderr for YaPI-GetAllDirectories

The diff follows...

--- tests/YaPI-GetAllDirectories.err 2013-01-22 11:58:52.000000000 +0100
+++ tmp.err.YaPI-GetAllDirectories 2013-07-30 14:40:15.000000000 +0200
@@ -0,0 +1,2 @@
+2013-07-30 14:40:15 <3> app42(19846) [Interpreter] modules/Testsuite.rb:42
Loading module 'Mode' failed
+2013-07-30 14:40:15 <3> app42(19846) [libycp] Import.cc(import):97 No matching
component found

FAIL: Wrong stderr for YaPI-GetAllDirectories
See the diff above.
Running YaPI-GetAllPrinters ...
FAIL: Wrong stderr for YaPI-GetAllPrinters

The diff follows...

--- tests/YaPI-GetAllPrinters.err 2013-01-22 11:58:52.000000000 +0100
+++ tmp.err.YaPI-GetAllPrinters 2013-07-30 14:40:15.000000000 +0200
@@ -0,0 +1,2 @@
+2013-07-30 14:40:15 <3> app42(19872) [Interpreter] modules/Testsuite.rb:42
Loading module 'Mode' failed
+2013-07-30 14:40:15 <3> app42(19872) [libycp] Import.cc(import):97 No matching
component found

FAIL: Wrong stderr for YaPI-GetAllPrinters
See the diff above.
Running YaPI-GetSAMBackends ...
FAIL: Wrong stderr for YaPI-GetSAMBackends

The diff follows...

--- tests/YaPI-GetSAMBackends.err 2013-01-22 11:58:52.000000000 +0100
+++ tmp.err.YaPI-GetSAMBackends 2013-07-30 14:40:16.000000000 +0200
@@ -0,0 +1,2 @@
+2013-07-30 14:40:16 <3> app42(19898) [Interpreter] modules/Testsuite.rb:42
Loading module 'Mode' failed
+2013-07-30 14:40:16 <3> app42(19898) [libycp] Import.cc(import):97 No matching
component found

FAIL: Wrong stderr for YaPI-GetSAMBackends
See the diff above.
Running YaPI-GetSAMConfiguration ...
FAIL: Wrong stderr for YaPI-GetSAMConfiguration

The diff follows...

--- tests/YaPI-GetSAMConfiguration.err 2013-01-22 11:58:52.000000000 +0100
+++ tmp.err.YaPI-GetSAMConfiguration 2013-07-30 14:40:16.000000000 +0200
@@ -0,0 +1,2 @@
+2013-07-30 14:40:16 <3> app42(19924) [Interpreter] modules/Testsuite.rb:42
Loading module 'Mode' failed
+2013-07-30 14:40:16 <3> app42(19924) [libycp] Import.cc(import):97 No matching
component found

FAIL: Wrong stderr for YaPI-GetSAMConfiguration
See the diff above.
Running YaPI-GetServerDescription ...
FAIL: Wrong stderr for YaPI-GetServerDescription

The diff follows...

--- tests/YaPI-GetServerDescription.err 2013-01-22 11:58:52.000000000 +0100
+++ tmp.err.YaPI-GetServerDescription 2013-07-30 14:40:17.000000000 +0200
@@ -0,0 +1,2 @@
+2013-07-30 14:40:16 <3> app42(19950) [Interpreter] modules/Testsuite.rb:42
Loading module 'Mode' failed
+2013-07-30 14:40:16 <3> app42(19950) [libycp] Import.cc(import):97 No matching
component found

FAIL: Wrong stderr for YaPI-GetServerDescription
See the diff above.
Running YaPI-GetServiceStatus ...
FAIL: Wrong stderr for YaPI-GetServiceStatus

The diff follows...

--- tests/YaPI-GetServiceStatus.err 2013-01-22 11:58:52.000000000 +0100
+++ tmp.err.YaPI-GetServiceStatus 2013-07-30 14:40:17.000000000 +0200
@@ -0,0 +1,2 @@
+2013-07-30 14:40:17 <3> app42(19972) [Interpreter] modules/Testsuite.rb:42
Loading module 'Mode' failed
+2013-07-30 14:40:17 <3> app42(19972) [libycp] Import.cc(import):97 No matching
component found

FAIL: Wrong stderr for YaPI-GetServiceStatus
See the diff above.
Running YaPI-GetShare ...
FAIL: Wrong stderr for YaPI-GetShare

The diff follows...

--- tests/YaPI-GetShare.err 2013-01-22 11:58:52.000000000 +0100
+++ tmp.err.YaPI-GetShare 2013-07-30 14:40:17.000000000 +0200
@@ -0,0 +1,2 @@
+2013-07-30 14:40:17 <3> app42(19998) [Interpreter] modules/Testsuite.rb:42
Loading module 'Mode' failed
+2013-07-30 14:40:17 <3> app42(19998) [libycp] Import.cc(import):97 No matching
component found

FAIL: Wrong stderr for YaPI-GetShare
See the diff above.
Running YaPI-ShareEnabled ...
FAIL: Wrong stderr for YaPI-ShareEnabled

The diff follows...

--- tests/YaPI-ShareEnabled.err 2013-01-22 11:58:52.000000000 +0100
+++ tmp.err.YaPI-ShareEnabled 2013-07-30 14:40:18.000000000 +0200
@@ -0,0 +1,2 @@
+2013-07-30 14:40:18 <3> app42(20024) [Interpreter] modules/Testsuite.rb:42
Loading module 'Mode' failed
+2013-07-30 14:40:18 <3> app42(20024) [libycp] Import.cc(import):97 No matching
component found

FAIL: Wrong stderr for YaPI-ShareEnabled
See the diff above.
Skipping file tests-common.rb ...

Checking finished


=== yast2-samba-server Summary ===

# of unexpected failures 64
make[3]: *** [check-DEJAGNU] Error 1
make[3]: Leaving directory
`<http://river.suse.de/job/yast-samba-server-HEAD/ws/checkout/testsuite/YaPI'>
make[2]: *** [check-am] Error 2
make[2]: Leaving directory
`<http://river.suse.de/job/yast-samba-server-HEAD/ws/checkout/testsuite/YaPI'>
make[1]: *** [check-recursive] Error 1
make[1]: Leaving directory
`<http://river.suse.de/job/yast-samba-server-HEAD/ws/checkout/testsuite'>
make: *** [check-recursive] Error 1
++ error_exit 2
++ echo 'ERROR: detected exitcode 2'
ERROR: detected exitcode 2
++ cleanup
++ echo '==> Running cleanup'
==> Running cleanup
++ rm -f
<http://river.suse.de/job/yast-samba-server-HEAD/ws/ICECC/40c0ab7e54f59a1e4e493c1ea90a882a.tar.gz>
++ footer_and_exit 1
++ '[' -z 1 ']'
++ MYEXIT=1
++ '[' 1 == 0 ']'
++ ascii_failed
++ cat

( )
( ) (
) _ )
( \_
_(_\ \)__
(____\___))

build failed

++ exit 1
Build step 'Execute shell' marked build as failure
--
To unsubscribe, e-mail: yast-devel+unsubscribe@xxxxxxxxxxxx
To contact the owner, e-mail: yast-devel+owner@xxxxxxxxxxxx

< Previous Next >
Follow Ups
References