Mailinglist Archive: yast-devel (251 mails)

< Previous Next >
[yast-devel] Build failed in Jenkins: yast-profile-manager-HEAD #383
  • From: hudson@xxxxxxx
  • Date: Tue, 30 Jul 2013 14:39:34 +0200 (CEST)
  • Message-id: <1124425623.152.1375187974048.JavaMail.jenkins@river>
See <http://river.suse.de/job/yast-profile-manager-HEAD/383/>

------------------------------------------
[...truncated 269 lines...]
Making all in agent-scpm
make[2]: Entering directory
`<http://river.suse.de/job/yast-profile-manager-HEAD/ws/checkout/agent-scpm'>
Making all in conf
make[3]: Entering directory
`<http://river.suse.de/job/yast-profile-manager-HEAD/ws/checkout/agent-scpm/conf'>
make[3]: Nothing to be done for `all'.
make[3]: Leaving directory
`<http://river.suse.de/job/yast-profile-manager-HEAD/ws/checkout/agent-scpm/conf'>
Making all in doc
make[3]: Entering directory
`<http://river.suse.de/job/yast-profile-manager-HEAD/ws/checkout/agent-scpm/doc'>
Making all in autodocs
make[4]: Entering directory
`<http://river.suse.de/job/yast-profile-manager-HEAD/ws/checkout/agent-scpm/doc/autodocs'>
make[4]: Nothing to be done for `all'.
make[4]: Leaving directory
`<http://river.suse.de/job/yast-profile-manager-HEAD/ws/checkout/agent-scpm/doc/autodocs'>
make[4]: Entering directory
`<http://river.suse.de/job/yast-profile-manager-HEAD/ws/checkout/agent-scpm/doc'>
make[4]: Nothing to be done for `all-am'.
make[4]: Leaving directory
`<http://river.suse.de/job/yast-profile-manager-HEAD/ws/checkout/agent-scpm/doc'>
make[3]: Leaving directory
`<http://river.suse.de/job/yast-profile-manager-HEAD/ws/checkout/agent-scpm/doc'>
Making all in src
make[3]: Entering directory
`<http://river.suse.de/job/yast-profile-manager-HEAD/ws/checkout/agent-scpm/src'>
make[3]: Nothing to be done for `all'.
make[3]: Leaving directory
`<http://river.suse.de/job/yast-profile-manager-HEAD/ws/checkout/agent-scpm/src'>
Making all in testsuite
make[3]: Entering directory
`<http://river.suse.de/job/yast-profile-manager-HEAD/ws/checkout/agent-scpm/testsuite'>
make[3]: Nothing to be done for `all'.
make[3]: Leaving directory
`<http://river.suse.de/job/yast-profile-manager-HEAD/ws/checkout/agent-scpm/testsuite'>
make[3]: Entering directory
`<http://river.suse.de/job/yast-profile-manager-HEAD/ws/checkout/agent-scpm'>
make[3]: Nothing to be done for `all-am'.
make[3]: Leaving directory
`<http://river.suse.de/job/yast-profile-manager-HEAD/ws/checkout/agent-scpm'>
make[2]: Leaving directory
`<http://river.suse.de/job/yast-profile-manager-HEAD/ws/checkout/agent-scpm'>
Making all in agents
make[2]: Entering directory
`<http://river.suse.de/job/yast-profile-manager-HEAD/ws/checkout/agents'>
make[2]: Nothing to be done for `all'.
make[2]: Leaving directory
`<http://river.suse.de/job/yast-profile-manager-HEAD/ws/checkout/agents'>
Making all in doc
make[2]: Entering directory
`<http://river.suse.de/job/yast-profile-manager-HEAD/ws/checkout/doc'>
Making all in autodocs
make[3]: Entering directory
`<http://river.suse.de/job/yast-profile-manager-HEAD/ws/checkout/doc/autodocs'>
make[3]: Nothing to be done for `all'.
make[3]: Leaving directory
`<http://river.suse.de/job/yast-profile-manager-HEAD/ws/checkout/doc/autodocs'>
Making all in images
make[3]: Entering directory
`<http://river.suse.de/job/yast-profile-manager-HEAD/ws/checkout/doc/images'>
make[3]: Nothing to be done for `all'.
make[3]: Leaving directory
`<http://river.suse.de/job/yast-profile-manager-HEAD/ws/checkout/doc/images'>
make[3]: Entering directory
`<http://river.suse.de/job/yast-profile-manager-HEAD/ws/checkout/doc'>
make[3]: Nothing to be done for `all-am'.
make[3]: Leaving directory
`<http://river.suse.de/job/yast-profile-manager-HEAD/ws/checkout/doc'>
make[2]: Leaving directory
`<http://river.suse.de/job/yast-profile-manager-HEAD/ws/checkout/doc'>
Making all in src
make[2]: Entering directory
`<http://river.suse.de/job/yast-profile-manager-HEAD/ws/checkout/src'>
make[2]: Nothing to be done for `all'.
make[2]: Leaving directory
`<http://river.suse.de/job/yast-profile-manager-HEAD/ws/checkout/src'>
Making all in testsuite
make[2]: Entering directory
`<http://river.suse.de/job/yast-profile-manager-HEAD/ws/checkout/testsuite'>
make -f /usr/share/YaST2/data/testsuite/Makefile.testsuite
RPMNAME=yast2-profile-manager srcdir=.
make[3]: Entering directory
`<http://river.suse.de/job/yast-profile-manager-HEAD/ws/checkout/testsuite'>
make[3]: Nothing to be done for `all'.
make[3]: Leaving directory
`<http://river.suse.de/job/yast-profile-manager-HEAD/ws/checkout/testsuite'>
make[2]: Leaving directory
`<http://river.suse.de/job/yast-profile-manager-HEAD/ws/checkout/testsuite'>
make[2]: Entering directory
`<http://river.suse.de/job/yast-profile-manager-HEAD/ws/checkout'>
make[2]: Leaving directory
`<http://river.suse.de/job/yast-profile-manager-HEAD/ws/checkout'>
make[1]: Leaving directory
`<http://river.suse.de/job/yast-profile-manager-HEAD/ws/checkout'>
+ make check
Making check in agent-scpm
make[1]: Entering directory
`<http://river.suse.de/job/yast-profile-manager-HEAD/ws/checkout/agent-scpm'>
Making check in conf
make[2]: Entering directory
`<http://river.suse.de/job/yast-profile-manager-HEAD/ws/checkout/agent-scpm/conf'>
make[2]: Nothing to be done for `check'.
make[2]: Leaving directory
`<http://river.suse.de/job/yast-profile-manager-HEAD/ws/checkout/agent-scpm/conf'>
Making check in doc
make[2]: Entering directory
`<http://river.suse.de/job/yast-profile-manager-HEAD/ws/checkout/agent-scpm/doc'>
Making check in autodocs
make[3]: Entering directory
`<http://river.suse.de/job/yast-profile-manager-HEAD/ws/checkout/agent-scpm/doc/autodocs'>
make[3]: Nothing to be done for `check'.
make[3]: Leaving directory
`<http://river.suse.de/job/yast-profile-manager-HEAD/ws/checkout/agent-scpm/doc/autodocs'>
make[3]: Entering directory
`<http://river.suse.de/job/yast-profile-manager-HEAD/ws/checkout/agent-scpm/doc'>
make[3]: Nothing to be done for `check-am'.
make[3]: Leaving directory
`<http://river.suse.de/job/yast-profile-manager-HEAD/ws/checkout/agent-scpm/doc'>
make[2]: Leaving directory
`<http://river.suse.de/job/yast-profile-manager-HEAD/ws/checkout/agent-scpm/doc'>
Making check in src
make[2]: Entering directory
`<http://river.suse.de/job/yast-profile-manager-HEAD/ws/checkout/agent-scpm/src'>
make[2]: Nothing to be done for `check'.
make[2]: Leaving directory
`<http://river.suse.de/job/yast-profile-manager-HEAD/ws/checkout/agent-scpm/src'>
Making check in testsuite
make[2]: Entering directory
`<http://river.suse.de/job/yast-profile-manager-HEAD/ws/checkout/agent-scpm/testsuite'>
make check-DEJAGNU
make[3]: Entering directory
`<http://river.suse.de/job/yast-profile-manager-HEAD/ws/checkout/agent-scpm/testsuite'>
Making a new site.exp file ...
srcdir='.'; export srcdir; \
EXPECT=expect; export EXPECT; \
runtest=runtest; \
if /bin/sh -c "$runtest --version" > /dev/null 2>&1; then \
exit_status=0; l='yast2-profile-manager'; for tool in $l; do \
if $runtest --tool $tool --srcdir $srcdir ; \
then :; else exit_status=1; fi; \
done; \
else echo "WARNING: could not find 'runtest'" 1>&2; :;\
fi; \
exit $exit_status
WARNING: Couldn't find tool init file
Test Run By root on Tue Jul 30 14:39:33 2013
Native configuration is x86_64-suse-linux-gnu

=== yast2-profile-manager tests ===

Schedule of variations:
unix

Running target unix
Using /usr/share/dejagnu/baseboards/unix.exp as board description file for
target.
Using /usr/share/dejagnu/config/unix.exp as generic interface file for target.
WARNING: Couldn't find tool config file for unix, using default.

=== yast2-profile-manager Summary ===

make[3]: Leaving directory
`<http://river.suse.de/job/yast-profile-manager-HEAD/ws/checkout/agent-scpm/testsuite'>
make[2]: Leaving directory
`<http://river.suse.de/job/yast-profile-manager-HEAD/ws/checkout/agent-scpm/testsuite'>
make[2]: Entering directory
`<http://river.suse.de/job/yast-profile-manager-HEAD/ws/checkout/agent-scpm'>
make[2]: Nothing to be done for `check-am'.
make[2]: Leaving directory
`<http://river.suse.de/job/yast-profile-manager-HEAD/ws/checkout/agent-scpm'>
make[1]: Leaving directory
`<http://river.suse.de/job/yast-profile-manager-HEAD/ws/checkout/agent-scpm'>
Making check in agents
make[1]: Entering directory
`<http://river.suse.de/job/yast-profile-manager-HEAD/ws/checkout/agents'>
make[1]: Nothing to be done for `check'.
make[1]: Leaving directory
`<http://river.suse.de/job/yast-profile-manager-HEAD/ws/checkout/agents'>
Making check in doc
make[1]: Entering directory
`<http://river.suse.de/job/yast-profile-manager-HEAD/ws/checkout/doc'>
Making check in autodocs
make[2]: Entering directory
`<http://river.suse.de/job/yast-profile-manager-HEAD/ws/checkout/doc/autodocs'>
make[2]: Nothing to be done for `check'.
make[2]: Leaving directory
`<http://river.suse.de/job/yast-profile-manager-HEAD/ws/checkout/doc/autodocs'>
Making check in images
make[2]: Entering directory
`<http://river.suse.de/job/yast-profile-manager-HEAD/ws/checkout/doc/images'>
make[2]: Nothing to be done for `check'.
make[2]: Leaving directory
`<http://river.suse.de/job/yast-profile-manager-HEAD/ws/checkout/doc/images'>
make[2]: Entering directory
`<http://river.suse.de/job/yast-profile-manager-HEAD/ws/checkout/doc'>
make[2]: Nothing to be done for `check-am'.
make[2]: Leaving directory
`<http://river.suse.de/job/yast-profile-manager-HEAD/ws/checkout/doc'>
make[1]: Leaving directory
`<http://river.suse.de/job/yast-profile-manager-HEAD/ws/checkout/doc'>
Making check in src
make[1]: Entering directory
`<http://river.suse.de/job/yast-profile-manager-HEAD/ws/checkout/src'>
make[1]: Nothing to be done for `check'.
make[1]: Leaving directory
`<http://river.suse.de/job/yast-profile-manager-HEAD/ws/checkout/src'>
Making check in testsuite
make[1]: Entering directory
`<http://river.suse.de/job/yast-profile-manager-HEAD/ws/checkout/testsuite'>
make -f /usr/share/YaST2/data/testsuite/Makefile.testsuite
RPMNAME=yast2-profile-manager srcdir=.
make[2]: Entering directory
`<http://river.suse.de/job/yast-profile-manager-HEAD/ws/checkout/testsuite'>
make[2]: Nothing to be done for `all'.
make[2]: Leaving directory
`<http://river.suse.de/job/yast-profile-manager-HEAD/ws/checkout/testsuite'>
make check-DEJAGNU check-local
make[2]: Entering directory
`<http://river.suse.de/job/yast-profile-manager-HEAD/ws/checkout/testsuite'>
Making a new site.exp file ...
srcdir='.'; export srcdir; \
EXPECT=expect; export EXPECT; \
runtest=runtest; \
if /bin/sh -c "$runtest --version" > /dev/null 2>&1; then \
exit_status=0; l='yast2-profile-manager'; for tool in $l; do \
if $runtest --tool $tool --srcdir $srcdir ; \
then :; else exit_status=1; fi; \
done; \
else echo "WARNING: could not find 'runtest'" 1>&2; :;\
fi; \
exit $exit_status
WARNING: Couldn't find tool init file
Test Run By root on Tue Jul 30 14:39:33 2013
Native configuration is x86_64-suse-linux-gnu

=== yast2-profile-manager tests ===

Schedule of variations:
unix

Running target unix
Using /usr/share/dejagnu/baseboards/unix.exp as board description file for
target.
Using /usr/share/dejagnu/config/unix.exp as generic interface file for target.
Using ./config/unix.exp as tool-and-target-specific interface file.
Running ./yast2-profile-manager.test/testsuite.exp ...

Checking started

Running CheckNameValidity ...
FAIL: Wrong stderr for CheckNameValidity

The diff follows...

--- tests/CheckNameValidity.err 2013-01-22 11:48:34.000000000 +0100
+++ tmp.err.CheckNameValidity 2013-07-30 14:39:33.000000000 +0200
@@ -0,0 +1,6 @@
+2013-07-30 14:39:33 <3> app42(17105) [Interpreter] modules/Testsuite.rb:42
Loading module 'Directory' failed
+2013-07-30 14:39:33 <3> app42(17105) [libycp] Import.cc(import):97 No matching
component found
+2013-07-30 14:39:33 <3> app42(17105) [Interpreter] modules/Testsuite.rb:42
Import 'Directory' failed...
+2013-07-30 14:39:33 <3> app42(17105) [Interpreter] modules/Testsuite.rb:42
Could not create its namespace
+2013-07-30 14:39:33 <3> app42(17105) [libycp] Bytecode.cc(readFile):1161
Caught invalid bytecode in
'<http://river.suse.de/job/yast-profile-manager-HEAD/ws/checkout/src/ProfileManager.ybc'>
+2013-07-30 14:39:33 <3> app42(17105) [Interpreter] modules/Testsuite.rb:42
Loading module 'ProfileManager' failed

FAIL: Wrong stderr for CheckNameValidity
See the diff above.
Running GetProgressText ...
FAIL: Wrong stderr for GetProgressText

The diff follows...

--- tests/GetProgressText.err 2013-01-22 11:48:34.000000000 +0100
+++ tmp.err.GetProgressText 2013-07-30 14:39:33.000000000 +0200
@@ -0,0 +1,6 @@
+2013-07-30 14:39:33 <3> app42(17131) [Interpreter] modules/Testsuite.rb:42
Loading module 'Directory' failed
+2013-07-30 14:39:33 <3> app42(17131) [libycp] Import.cc(import):97 No matching
component found
+2013-07-30 14:39:33 <3> app42(17131) [Interpreter] modules/Testsuite.rb:42
Import 'Directory' failed...
+2013-07-30 14:39:33 <3> app42(17131) [Interpreter] modules/Testsuite.rb:42
Could not create its namespace
+2013-07-30 14:39:33 <3> app42(17131) [libycp] Bytecode.cc(readFile):1161
Caught invalid bytecode in
'<http://river.suse.de/job/yast-profile-manager-HEAD/ws/checkout/src/ProfileManager.ybc'>
+2013-07-30 14:39:33 <3> app42(17131) [Interpreter] modules/Testsuite.rb:42
Loading module 'ProfileManager' failed

FAIL: Wrong stderr for GetProgressText
See the diff above.

Checking finished


=== yast2-profile-manager Summary ===

# of unexpected failures 4
make[2]: *** [check-DEJAGNU] Error 1
make[2]: Leaving directory
`<http://river.suse.de/job/yast-profile-manager-HEAD/ws/checkout/testsuite'>
make[1]: *** [check-am] Error 2
make[1]: Leaving directory
`<http://river.suse.de/job/yast-profile-manager-HEAD/ws/checkout/testsuite'>
make: *** [check-recursive] Error 1
++ error_exit 2
++ echo 'ERROR: detected exitcode 2'
ERROR: detected exitcode 2
++ cleanup
++ echo '==> Running cleanup'
==> Running cleanup
++ rm -f
<http://river.suse.de/job/yast-profile-manager-HEAD/ws/ICECC/40c0ab7e54f59a1e4e493c1ea90a882a.tar.gz>
++ footer_and_exit 1
++ '[' -z 1 ']'
++ MYEXIT=1
++ '[' 1 == 0 ']'
++ ascii_failed
++ cat

( )
( ) (
) _ )
( \_
_(_\ \)__
(____\___))

build failed

++ exit 1
Build step 'Execute shell' marked build as failure
--
To unsubscribe, e-mail: yast-devel+unsubscribe@xxxxxxxxxxxx
To contact the owner, e-mail: yast-devel+owner@xxxxxxxxxxxx

< Previous Next >
This Thread
Follow Ups
References