Mailinglist Archive: yast-devel (251 mails)

< Previous Next >
[yast-devel] Build failed in Jenkins: yast-packager-HEAD #135
  • From: hudson@xxxxxxx
  • Date: Tue, 30 Jul 2013 14:36:21 +0200 (CEST)
  • Message-id: <2070664558.148.1375187781586.JavaMail.jenkins@river>
See <http://river.suse.de/job/yast-packager-HEAD/135/>

------------------------------------------
[...truncated 236 lines...]
make[1]: Entering directory
`<http://river.suse.de/job/yast-packager-HEAD/ws/checkout/src'>
make[1]: Nothing to be done for `all'.
make[1]: Leaving directory
`<http://river.suse.de/job/yast-packager-HEAD/ws/checkout/src'>
Making all in testsuite
make[1]: Entering directory
`<http://river.suse.de/job/yast-packager-HEAD/ws/checkout/testsuite'>
make -f /usr/share/YaST2/data/testsuite/Makefile.testsuite
RPMNAME=yast2-packager srcdir=.
make[2]: Entering directory
`<http://river.suse.de/job/yast-packager-HEAD/ws/checkout/testsuite'>
make[2]: Nothing to be done for `all'.
make[2]: Leaving directory
`<http://river.suse.de/job/yast-packager-HEAD/ws/checkout/testsuite'>
make[1]: Leaving directory
`<http://river.suse.de/job/yast-packager-HEAD/ws/checkout/testsuite'>
make[1]: Entering directory
`<http://river.suse.de/job/yast-packager-HEAD/ws/checkout'>
make[1]: Nothing to be done for `all-am'.
make[1]: Leaving directory
`<http://river.suse.de/job/yast-packager-HEAD/ws/checkout'>
+ make check
Making check in agents
make[1]: Entering directory
`<http://river.suse.de/job/yast-packager-HEAD/ws/checkout/agents'>
make[1]: Nothing to be done for `check'.
make[1]: Leaving directory
`<http://river.suse.de/job/yast-packager-HEAD/ws/checkout/agents'>
Making check in doc
make[1]: Entering directory
`<http://river.suse.de/job/yast-packager-HEAD/ws/checkout/doc'>
Making check in autodocs
make[2]: Entering directory
`<http://river.suse.de/job/yast-packager-HEAD/ws/checkout/doc/autodocs'>
make[2]: Nothing to be done for `check'.
make[2]: Leaving directory
`<http://river.suse.de/job/yast-packager-HEAD/ws/checkout/doc/autodocs'>
make[2]: Entering directory
`<http://river.suse.de/job/yast-packager-HEAD/ws/checkout/doc'>
make[2]: Nothing to be done for `check-am'.
make[2]: Leaving directory
`<http://river.suse.de/job/yast-packager-HEAD/ws/checkout/doc'>
make[1]: Leaving directory
`<http://river.suse.de/job/yast-packager-HEAD/ws/checkout/doc'>
Making check in src
make[1]: Entering directory
`<http://river.suse.de/job/yast-packager-HEAD/ws/checkout/src'>
make[1]: Nothing to be done for `check'.
make[1]: Leaving directory
`<http://river.suse.de/job/yast-packager-HEAD/ws/checkout/src'>
Making check in testsuite
make[1]: Entering directory
`<http://river.suse.de/job/yast-packager-HEAD/ws/checkout/testsuite'>
make -f /usr/share/YaST2/data/testsuite/Makefile.testsuite
RPMNAME=yast2-packager srcdir=.
make[2]: Entering directory
`<http://river.suse.de/job/yast-packager-HEAD/ws/checkout/testsuite'>
make[2]: Nothing to be done for `all'.
make[2]: Leaving directory
`<http://river.suse.de/job/yast-packager-HEAD/ws/checkout/testsuite'>
make check-DEJAGNU check-local
make[2]: Entering directory
`<http://river.suse.de/job/yast-packager-HEAD/ws/checkout/testsuite'>
Making a new site.exp file ...
srcdir='.'; export srcdir; \
EXPECT=expect; export EXPECT; \
runtest=runtest; \
if /bin/sh -c "$runtest --version" > /dev/null 2>&1; then \
exit_status=0; l='yast2-packager'; for tool in $l; do \
if $runtest --tool $tool --srcdir $srcdir ; \
then :; else exit_status=1; fi; \
done; \
else echo "WARNING: could not find 'runtest'" 1>&2; :;\
fi; \
exit $exit_status
WARNING: Couldn't find tool init file
Test Run By root on Tue Jul 30 14:36:19 2013
Native configuration is x86_64-suse-linux-gnu

=== yast2-packager tests ===

Schedule of variations:
unix

Running target unix
Using /usr/share/dejagnu/baseboards/unix.exp as board description file for
target.
Using /usr/share/dejagnu/config/unix.exp as generic interface file for target.
Using ./config/unix.exp as tool-and-target-specific interface file.
Running ./yast2-packager.test/testsuite.exp ...

Checking started

Running AddOnProduct_test ...
FAIL: Wrong stderr for AddOnProduct_test

The diff follows...

--- tests/AddOnProduct_test.err 2013-01-22 11:40:37.000000000 +0100
+++ tmp.err.AddOnProduct_test 2013-07-30 14:36:19.000000000 +0200
@@ -0,0 +1,2 @@
+2013-07-30 14:36:19 <3> app42(31879) [Interpreter] modules/Testsuite.rb:42
Loading module 'AddOnProduct' failed
+2013-07-30 14:36:19 <3> app42(31879) [libycp] Import.cc(import):97 No matching
component found

FAIL: Wrong stderr for AddOnProduct_test
See the diff above.
Running DefaultDesktop ...
FAIL: Wrong stderr for DefaultDesktop

The diff follows...

--- tests/DefaultDesktop.err 2013-01-22 11:40:37.000000000 +0100
+++ tmp.err.DefaultDesktop 2013-07-30 14:36:19.000000000 +0200
@@ -0,0 +1,2 @@
+2013-07-30 14:36:19 <3> app42(31905) [Interpreter] modules/Testsuite.rb:42
Loading module 'DefaultDesktop' failed
+2013-07-30 14:36:19 <3> app42(31905) [libycp] Import.cc(import):97 No matching
component found

FAIL: Wrong stderr for DefaultDesktop
See the diff above.
Running PackageSlideShow ...
FAIL: Wrong stderr for PackageSlideShow

The diff follows...

--- tests/PackageSlideShow.err 2013-01-22 11:40:37.000000000 +0100
+++ tmp.err.PackageSlideShow 2013-07-30 14:36:20.000000000 +0200
@@ -0,0 +1,2 @@
+2013-07-30 14:36:20 <3> app42(31927) [Interpreter] modules/Testsuite.rb:42
Loading module 'PackageSlideShow' failed
+2013-07-30 14:36:20 <3> app42(31927) [libycp] Import.cc(import):97 No matching
component found

FAIL: Wrong stderr for PackageSlideShow
See the diff above.
Running Packages ...
FAIL: Wrong stderr for Packages

The diff follows...

--- tests/Packages.err 2013-01-22 11:40:37.000000000 +0100
+++ tmp.err.Packages 2013-07-30 14:36:20.000000000 +0200
@@ -0,0 +1,2 @@
+2013-07-30 14:36:20 <3> app42(31949) [Interpreter] modules/Testsuite.rb:42
Loading module 'Packages' failed
+2013-07-30 14:36:20 <3> app42(31949) [libycp] Import.cc(import):97 No matching
component found

FAIL: Wrong stderr for Packages
See the diff above.
Running SpaceCalculation ...
FAIL: Wrong stderr for SpaceCalculation

The diff follows...

--- tests/SpaceCalculation.err 2013-01-22 11:40:37.000000000 +0100
+++ tmp.err.SpaceCalculation 2013-07-30 14:36:20.000000000 +0200
@@ -0,0 +1,2 @@
+2013-07-30 14:36:20 <3> app42(31971) [Interpreter] modules/Testsuite.rb:42
Loading module 'SpaceCalculation' failed
+2013-07-30 14:36:20 <3> app42(31971) [libycp] Import.cc(import):97 No matching
component found

FAIL: Wrong stderr for SpaceCalculation
See the diff above.
Running insturl-cd ...
FAIL: Wrong stderr for insturl-cd

The diff follows...

--- tests/insturl-cd.err 2013-01-22 11:40:37.000000000 +0100
+++ tmp.err.insturl-cd 2013-07-30 14:36:20.000000000 +0200
@@ -0,0 +1,2 @@
+2013-07-30 14:36:20 <3> app42(31993) [Interpreter] modules/Testsuite.rb:42
Loading module 'InstURL' failed
+2013-07-30 14:36:20 <3> app42(31993) [libycp] Import.cc(import):97 No matching
component found

FAIL: Wrong stderr for insturl-cd
See the diff above.
Running insturl-ftp ...
FAIL: Wrong stderr for insturl-ftp

The diff follows...

--- tests/insturl-ftp.err 2013-01-22 11:40:37.000000000 +0100
+++ tmp.err.insturl-ftp 2013-07-30 14:36:20.000000000 +0200
@@ -0,0 +1,2 @@
+2013-07-30 14:36:20 <3> app42(32015) [Interpreter] modules/Testsuite.rb:42
Loading module 'InstURL' failed
+2013-07-30 14:36:20 <3> app42(32015) [libycp] Import.cc(import):97 No matching
component found

FAIL: Wrong stderr for insturl-ftp
See the diff above.
Running insturl-http ...
FAIL: Wrong stderr for insturl-http

The diff follows...

--- tests/insturl-http.err 2013-01-22 11:40:37.000000000 +0100
+++ tmp.err.insturl-http 2013-07-30 14:36:20.000000000 +0200
@@ -0,0 +1,2 @@
+2013-07-30 14:36:20 <3> app42(32037) [Interpreter] modules/Testsuite.rb:42
Loading module 'InstURL' failed
+2013-07-30 14:36:20 <3> app42(32037) [libycp] Import.cc(import):97 No matching
component found

FAIL: Wrong stderr for insturl-http
See the diff above.
Running insturl-iso ...
FAIL: Wrong stderr for insturl-iso

The diff follows...

--- tests/insturl-iso.err 2013-01-22 11:40:37.000000000 +0100
+++ tmp.err.insturl-iso 2013-07-30 14:36:21.000000000 +0200
@@ -0,0 +1,2 @@
+2013-07-30 14:36:21 <3> app42(32059) [Interpreter] modules/Testsuite.rb:42
Loading module 'InstURL' failed
+2013-07-30 14:36:21 <3> app42(32059) [libycp] Import.cc(import):97 No matching
component found

FAIL: Wrong stderr for insturl-iso
See the diff above.
Running insturl-ops ...
FAIL: Wrong stderr for insturl-ops

The diff follows...

--- tests/insturl-ops.err 2013-01-22 11:40:37.000000000 +0100
+++ tmp.err.insturl-ops 2013-07-30 14:36:21.000000000 +0200
@@ -0,0 +1,2 @@
+2013-07-30 14:36:21 <3> app42(32081) [Interpreter] modules/Testsuite.rb:42
Loading module 'InstURL' failed
+2013-07-30 14:36:21 <3> app42(32081) [libycp] Import.cc(import):97 No matching
component found

FAIL: Wrong stderr for insturl-ops
See the diff above.
Running insturl-smb ...
FAIL: Wrong stderr for insturl-smb

The diff follows...

--- tests/insturl-smb.err 2013-01-22 11:40:37.000000000 +0100
+++ tmp.err.insturl-smb 2013-07-30 14:36:21.000000000 +0200
@@ -0,0 +1,2 @@
+2013-07-30 14:36:21 <3> app42(32103) [Interpreter] modules/Testsuite.rb:42
Loading module 'InstURL' failed
+2013-07-30 14:36:21 <3> app42(32103) [libycp] Import.cc(import):97 No matching
component found

FAIL: Wrong stderr for insturl-smb
See the diff above.

Checking finished


=== yast2-packager Summary ===

# of unexpected failures 22
make[2]: *** [check-DEJAGNU] Error 1
make[2]: Leaving directory
`<http://river.suse.de/job/yast-packager-HEAD/ws/checkout/testsuite'>
make[1]: *** [check-am] Error 2
make[1]: Leaving directory
`<http://river.suse.de/job/yast-packager-HEAD/ws/checkout/testsuite'>
make: *** [check-recursive] Error 1
++ error_exit 2
++ echo 'ERROR: detected exitcode 2'
ERROR: detected exitcode 2
++ cleanup
++ echo '==> Running cleanup'
==> Running cleanup
++ rm -f
<http://river.suse.de/job/yast-packager-HEAD/ws/ICECC/40c0ab7e54f59a1e4e493c1ea90a882a.tar.gz>
++ footer_and_exit 1
++ '[' -z 1 ']'
++ MYEXIT=1
++ '[' 1 == 0 ']'
++ ascii_failed
++ cat

( )
( ) (
) _ )
( \_
_(_\ \)__
(____\___))

build failed

++ exit 1
Build step 'Execute shell' marked build as failure
--
To unsubscribe, e-mail: yast-devel+unsubscribe@xxxxxxxxxxxx
To contact the owner, e-mail: yast-devel+owner@xxxxxxxxxxxx

< Previous Next >
This Thread
Follow Ups
References