Mailinglist Archive: yast-devel (251 mails)

< Previous Next >
[yast-devel] Build failed in Jenkins: yast-nis-client-HEAD #129
  • From: hudson@xxxxxxx
  • Date: Tue, 30 Jul 2013 14:35:10 +0200 (CEST)
  • Message-id: <411259260.145.1375187710721.JavaMail.jenkins@river>
See <http://river.suse.de/job/yast-nis-client-HEAD/129/>

------------------------------------------
[...truncated 210 lines...]
checking for memory.h... yes
checking for strings.h... yes
checking for inttypes.h... yes
checking for stdint.h... yes
checking for unistd.h... yes
checking for dlfcn.h... yes
checking for objdir... .libs
checking if gcc supports -fno-rtti -fno-exceptions... no
checking for gcc option to produce PIC... -fPIC -DPIC
checking if gcc PIC flag -fPIC -DPIC works... yes
checking if gcc static flag -static works... no
checking if gcc supports -c -o file.o... yes
checking if gcc supports -c -o file.o... (cached) yes
checking whether the gcc linker (/usr/x86_64-suse-linux/bin/ld -m elf_x86_64)
supports shared libraries... yes
checking whether -lc should be explicitly linked in... no
checking dynamic linker characteristics... GNU/Linux ld.so
checking how to hardcode library paths into programs... immediate
checking whether stripping libraries is possible... yes
checking if libtool supports shared libraries... yes
checking whether to build shared libraries... yes
checking whether to build static libraries... no
checking how to run the C++ preprocessor... /opt/icecream/bin/g++ -E
checking for ld used by /opt/icecream/bin/g++... /usr/x86_64-suse-linux/bin/ld
-m elf_x86_64
checking if the linker (/usr/x86_64-suse-linux/bin/ld -m elf_x86_64) is GNU
ld... yes
checking whether the /opt/icecream/bin/g++ linker
(/usr/x86_64-suse-linux/bin/ld -m elf_x86_64) supports shared libraries... yes
checking for /opt/icecream/bin/g++ option to produce PIC... -fPIC -DPIC
checking if /opt/icecream/bin/g++ PIC flag -fPIC -DPIC works... yes
checking if /opt/icecream/bin/g++ static flag -static works... no
checking if /opt/icecream/bin/g++ supports -c -o file.o... yes
checking if /opt/icecream/bin/g++ supports -c -o file.o... (cached) yes
checking whether the /opt/icecream/bin/g++ linker
(/usr/x86_64-suse-linux/bin/ld -m elf_x86_64) supports shared libraries... yes
checking dynamic linker characteristics... (cached) GNU/Linux ld.so
checking how to hardcode library paths into programs... immediate
checking for size_t... yes
checking for working alloca.h... yes
checking for alloca... yes
checking for ANSI C header files... (cached) yes
checking for expect... /usr/bin/expect
checking for runtest... /usr/bin/runtest
checking that generated files are newer than configure... done
configure: creating ./config.status
config.status: creating Makefile
config.status: creating agent-ypserv/conf/Makefile
config.status: creating agent-ypserv/src/Makefile
config.status: creating agent-ypserv/Makefile
config.status: creating agents/Makefile
config.status: creating doc/autodocs/Makefile
config.status: creating doc/Makefile
config.status: creating src/Makefile
config.status: creating testsuite/Makefile
config.status: creating config.h
config.status: config.h is unchanged
config.status: executing depfiles commands
config.status: executing libtool commands
+ make
make all-recursive
make[1]: Entering directory
`<http://river.suse.de/job/yast-nis-client-HEAD/ws/checkout'>
Making all in agent-ypserv
make[2]: Entering directory
`<http://river.suse.de/job/yast-nis-client-HEAD/ws/checkout/agent-ypserv'>
Making all in conf
make[3]: Entering directory
`<http://river.suse.de/job/yast-nis-client-HEAD/ws/checkout/agent-ypserv/conf'>
make[3]: Nothing to be done for `all'.
make[3]: Leaving directory
`<http://river.suse.de/job/yast-nis-client-HEAD/ws/checkout/agent-ypserv/conf'>
Making all in src
make[3]: Entering directory
`<http://river.suse.de/job/yast-nis-client-HEAD/ws/checkout/agent-ypserv/src'>
make[3]: Nothing to be done for `all'.
make[3]: Leaving directory
`<http://river.suse.de/job/yast-nis-client-HEAD/ws/checkout/agent-ypserv/src'>
make[3]: Entering directory
`<http://river.suse.de/job/yast-nis-client-HEAD/ws/checkout/agent-ypserv'>
make[3]: Nothing to be done for `all-am'.
make[3]: Leaving directory
`<http://river.suse.de/job/yast-nis-client-HEAD/ws/checkout/agent-ypserv'>
make[2]: Leaving directory
`<http://river.suse.de/job/yast-nis-client-HEAD/ws/checkout/agent-ypserv'>
Making all in agents
make[2]: Entering directory
`<http://river.suse.de/job/yast-nis-client-HEAD/ws/checkout/agents'>
make[2]: Nothing to be done for `all'.
make[2]: Leaving directory
`<http://river.suse.de/job/yast-nis-client-HEAD/ws/checkout/agents'>
Making all in doc
make[2]: Entering directory
`<http://river.suse.de/job/yast-nis-client-HEAD/ws/checkout/doc'>
Making all in autodocs
make[3]: Entering directory
`<http://river.suse.de/job/yast-nis-client-HEAD/ws/checkout/doc/autodocs'>
if [ -n "" ]; then /usr/lib/YaST2/bin/ycpdoc -d. -s./../../src ; fi
for i in ; do \
b=${i##./../../src}; b=${b#/}; b=${b//\//__}; b=${b%.pm}; \
pod2html --title=$b --infile=$i --outfile=$b.html; \
echo "<a href='$b.html'>${b/__/::}</a>" > $b.mod.html; \
done
if [ -n "./../../src/modules/Nis.rb ./../../src/include/nis/ui.rb" ]; then yard
doc --title "yast2-nis-client -- Development Documentation" -o . -m markdown
./../../src/modules/Nis.rb ./../../src/include/nis/ui.rb; fi
[warn]: Invalid tag format for @return in file `../../src/modules/Nis.rb` near
line 746
[warn]: In file `../../src/include/nis/ui.rb':822: Cannot resolve link to
#server_sp from text:
[warn]: ...{#server_sp}...
[warn]: In file `../../src/include/nis/ui.rb':768: Cannot resolve link to
#server_sp from text:
[warn]: ...{#server_sp}...
Files: 2
Modules: 2 ( 1 undocumented)
Classes: 1 ( 1 undocumented)
Constants: 1 ( 1 undocumented)
Methods: 50 ( 2 undocumented)
90.74% documented
make[3]: Leaving directory
`<http://river.suse.de/job/yast-nis-client-HEAD/ws/checkout/doc/autodocs'>
make[3]: Entering directory
`<http://river.suse.de/job/yast-nis-client-HEAD/ws/checkout/doc'>
make[3]: Nothing to be done for `all-am'.
make[3]: Leaving directory
`<http://river.suse.de/job/yast-nis-client-HEAD/ws/checkout/doc'>
make[2]: Leaving directory
`<http://river.suse.de/job/yast-nis-client-HEAD/ws/checkout/doc'>
Making all in src
make[2]: Entering directory
`<http://river.suse.de/job/yast-nis-client-HEAD/ws/checkout/src'>
make[2]: Nothing to be done for `all'.
make[2]: Leaving directory
`<http://river.suse.de/job/yast-nis-client-HEAD/ws/checkout/src'>
Making all in testsuite
make[2]: Entering directory
`<http://river.suse.de/job/yast-nis-client-HEAD/ws/checkout/testsuite'>
make -f /usr/share/YaST2/data/testsuite/Makefile.testsuite
RPMNAME=yast2-nis-client srcdir=.
make[3]: Entering directory
`<http://river.suse.de/job/yast-nis-client-HEAD/ws/checkout/testsuite'>
make[3]: Nothing to be done for `all'.
make[3]: Leaving directory
`<http://river.suse.de/job/yast-nis-client-HEAD/ws/checkout/testsuite'>
make[2]: Leaving directory
`<http://river.suse.de/job/yast-nis-client-HEAD/ws/checkout/testsuite'>
make[2]: Entering directory
`<http://river.suse.de/job/yast-nis-client-HEAD/ws/checkout'>
make[2]: Leaving directory
`<http://river.suse.de/job/yast-nis-client-HEAD/ws/checkout'>
make[1]: Leaving directory
`<http://river.suse.de/job/yast-nis-client-HEAD/ws/checkout'>
+ make check
Making check in agent-ypserv
make[1]: Entering directory
`<http://river.suse.de/job/yast-nis-client-HEAD/ws/checkout/agent-ypserv'>
Making check in conf
make[2]: Entering directory
`<http://river.suse.de/job/yast-nis-client-HEAD/ws/checkout/agent-ypserv/conf'>
make[2]: Nothing to be done for `check'.
make[2]: Leaving directory
`<http://river.suse.de/job/yast-nis-client-HEAD/ws/checkout/agent-ypserv/conf'>
Making check in src
make[2]: Entering directory
`<http://river.suse.de/job/yast-nis-client-HEAD/ws/checkout/agent-ypserv/src'>
make[2]: Nothing to be done for `check'.
make[2]: Leaving directory
`<http://river.suse.de/job/yast-nis-client-HEAD/ws/checkout/agent-ypserv/src'>
make[2]: Entering directory
`<http://river.suse.de/job/yast-nis-client-HEAD/ws/checkout/agent-ypserv'>
make[2]: Nothing to be done for `check-am'.
make[2]: Leaving directory
`<http://river.suse.de/job/yast-nis-client-HEAD/ws/checkout/agent-ypserv'>
make[1]: Leaving directory
`<http://river.suse.de/job/yast-nis-client-HEAD/ws/checkout/agent-ypserv'>
Making check in agents
make[1]: Entering directory
`<http://river.suse.de/job/yast-nis-client-HEAD/ws/checkout/agents'>
make check-TESTS
make[2]: Entering directory
`<http://river.suse.de/job/yast-nis-client-HEAD/ws/checkout/agents'>
parsing '-'
done
Parsed:
PASS: test-ypconf
=============
1 test passed
=============
make[2]: Leaving directory
`<http://river.suse.de/job/yast-nis-client-HEAD/ws/checkout/agents'>
make[1]: Leaving directory
`<http://river.suse.de/job/yast-nis-client-HEAD/ws/checkout/agents'>
Making check in doc
make[1]: Entering directory
`<http://river.suse.de/job/yast-nis-client-HEAD/ws/checkout/doc'>
Making check in autodocs
make[2]: Entering directory
`<http://river.suse.de/job/yast-nis-client-HEAD/ws/checkout/doc/autodocs'>
make[2]: Nothing to be done for `check'.
make[2]: Leaving directory
`<http://river.suse.de/job/yast-nis-client-HEAD/ws/checkout/doc/autodocs'>
make[2]: Entering directory
`<http://river.suse.de/job/yast-nis-client-HEAD/ws/checkout/doc'>
make[2]: Nothing to be done for `check-am'.
make[2]: Leaving directory
`<http://river.suse.de/job/yast-nis-client-HEAD/ws/checkout/doc'>
make[1]: Leaving directory
`<http://river.suse.de/job/yast-nis-client-HEAD/ws/checkout/doc'>
Making check in src
make[1]: Entering directory
`<http://river.suse.de/job/yast-nis-client-HEAD/ws/checkout/src'>
make[1]: Nothing to be done for `check'.
make[1]: Leaving directory
`<http://river.suse.de/job/yast-nis-client-HEAD/ws/checkout/src'>
Making check in testsuite
make[1]: Entering directory
`<http://river.suse.de/job/yast-nis-client-HEAD/ws/checkout/testsuite'>
make -f /usr/share/YaST2/data/testsuite/Makefile.testsuite
RPMNAME=yast2-nis-client srcdir=.
make[2]: Entering directory
`<http://river.suse.de/job/yast-nis-client-HEAD/ws/checkout/testsuite'>
make[2]: Nothing to be done for `all'.
make[2]: Leaving directory
`<http://river.suse.de/job/yast-nis-client-HEAD/ws/checkout/testsuite'>
make check-DEJAGNU check-local
make[2]: Entering directory
`<http://river.suse.de/job/yast-nis-client-HEAD/ws/checkout/testsuite'>
Making a new site.exp file ...
srcdir='.'; export srcdir; \
EXPECT=expect; export EXPECT; \
runtest=runtest; \
if /bin/sh -c "$runtest --version" > /dev/null 2>&1; then \
exit_status=0; l='yast2-nis-client'; for tool in $l; do \
if $runtest --tool $tool --srcdir $srcdir ; \
then :; else exit_status=1; fi; \
done; \
else echo "WARNING: could not find 'runtest'" 1>&2; :;\
fi; \
exit $exit_status
WARNING: Couldn't find tool init file
Test Run By root on Tue Jul 30 14:35:09 2013
Native configuration is x86_64-suse-linux-gnu

=== yast2-nis-client tests ===

Schedule of variations:
unix

Running target unix
Using /usr/share/dejagnu/baseboards/unix.exp as board description file for
target.
Using /usr/share/dejagnu/config/unix.exp as generic interface file for target.
Using ./config/unix.exp as tool-and-target-specific interface file.
Running ./yast2-nis-client.test/testsuite.exp ...

Checking started

Running readwrite ...
FAIL: Wrong stderr for readwrite

The diff follows...

--- tests/readwrite.err 2013-01-22 11:36:05.000000000 +0100
+++ tmp.err.readwrite 2013-07-30 14:35:10.000000000 +0200
@@ -0,0 +1,6 @@
+2013-07-30 14:35:10 <3> app42(26153) [Interpreter] modules/Testsuite.rb:42
Loading module 'Address' failed
+2013-07-30 14:35:10 <3> app42(26153) [libycp] Import.cc(import):97 No matching
component found
+2013-07-30 14:35:10 <3> app42(26153) [Interpreter] modules/Testsuite.rb:42
Import 'Address' failed...
+2013-07-30 14:35:10 <3> app42(26153) [Interpreter] modules/Testsuite.rb:42
Could not create its namespace
+2013-07-30 14:35:10 <3> app42(26153) [libycp] Bytecode.cc(readFile):1161
Caught invalid bytecode in
'<http://river.suse.de/job/yast-nis-client-HEAD/ws/checkout/src/Nis.ybc'>
+2013-07-30 14:35:10 <3> app42(26153) [Interpreter] modules/Testsuite.rb:42
Loading module 'Nis' failed

FAIL: Wrong stderr for readwrite
See the diff above.

Checking finished


=== yast2-nis-client Summary ===

# of unexpected failures 2
make[2]: *** [check-DEJAGNU] Error 1
make[2]: Leaving directory
`<http://river.suse.de/job/yast-nis-client-HEAD/ws/checkout/testsuite'>
make[1]: *** [check-am] Error 2
make[1]: Leaving directory
`<http://river.suse.de/job/yast-nis-client-HEAD/ws/checkout/testsuite'>
make: *** [check-recursive] Error 1
++ error_exit 2
++ echo 'ERROR: detected exitcode 2'
ERROR: detected exitcode 2
++ cleanup
++ echo '==> Running cleanup'
==> Running cleanup
++ rm -f
<http://river.suse.de/job/yast-nis-client-HEAD/ws/ICECC/40c0ab7e54f59a1e4e493c1ea90a882a.tar.gz>
++ footer_and_exit 1
++ '[' -z 1 ']'
++ MYEXIT=1
++ '[' 1 == 0 ']'
++ ascii_failed
++ cat

( )
( ) (
) _ )
( \_
_(_\ \)__
(____\___))

build failed

++ exit 1
Build step 'Execute shell' marked build as failure
--
To unsubscribe, e-mail: yast-devel+unsubscribe@xxxxxxxxxxxx
To contact the owner, e-mail: yast-devel+owner@xxxxxxxxxxxx

< Previous Next >
This Thread
Follow Ups
References