Mailinglist Archive: yast-devel (251 mails)

< Previous Next >
[yast-devel] Build failed in Jenkins: yast-kerberos-client-HEAD #125
  • From: hudson@xxxxxxx
  • Date: Tue, 30 Jul 2013 14:34:35 +0200 (CEST)
  • Message-id: <1942185486.144.1375187675237.JavaMail.jenkins@river>
See <http://river.suse.de/job/yast-kerberos-client-HEAD/125/>

------------------------------------------
[...truncated 127 lines...]
y2automake: Copying automakefiles for inclusion
y2automake: Generating toplevel Makefile.am
autoreconf --force --install
./configure --prefix=/usr --libdir=/usr/lib64
checking build system type... x86_64-suse-linux-gnu
checking host system type... x86_64-suse-linux-gnu
checking target system type... x86_64-suse-linux-gnu
checking for a BSD-compatible install... /usr/bin/install -c
checking whether build environment is sane... yes
checking for a thread-safe mkdir -p... /usr/bin/mkdir -p
checking for gawk... gawk
checking whether make sets $(MAKE)... yes
checking how to create a ustar tar archive... gnutar
checking whether ln -s works... yes
checking whether make sets $(MAKE)... (cached) yes
checking for xgettext... /usr/bin/xgettext
checking for ycpdoc... /usr/lib/YaST2/bin/ycpdoc
checking for ycpmakedep... /usr/lib/YaST2/bin/ycpmakedep
checking for ycpc... /usr/bin/ycpc
checking for /usr/share/YaST2/data/testsuite/Makefile.testsuite... yes
checking that generated files are newer than configure... done
configure: creating ./config.status
config.status: creating Makefile
config.status: creating agents/Makefile
config.status: creating doc/autodocs/Makefile
config.status: creating doc/Makefile
config.status: creating src/Makefile
config.status: creating testsuite/Makefile
+ make
Making all in agents
make[1]: Entering directory
`<http://river.suse.de/job/yast-kerberos-client-HEAD/ws/checkout/agents'>
make[1]: Nothing to be done for `all'.
make[1]: Leaving directory
`<http://river.suse.de/job/yast-kerberos-client-HEAD/ws/checkout/agents'>
Making all in doc
make[1]: Entering directory
`<http://river.suse.de/job/yast-kerberos-client-HEAD/ws/checkout/doc'>
Making all in autodocs
make[2]: Entering directory
`<http://river.suse.de/job/yast-kerberos-client-HEAD/ws/checkout/doc/autodocs'>
if [ -n "" ]; then /usr/lib/YaST2/bin/ycpdoc -d. -s./../../src ; fi
for i in ; do \
b=${i##./../../src}; b=${b#/}; b=${b//\//__}; b=${b%.pm}; \
pod2html --title=$b --infile=$i --outfile=$b.html; \
echo "<a href='$b.html'>${b/__/::}</a>" > $b.mod.html; \
done
if [ -n "./../../src/modules/Kerberos.rb
./../../src/include/kerberos-client/dialogs.rb
./../../src/include/kerberos-client/wizards.rb" ]; then yard doc --title
"yast2-kerberos-client -- Development Documentation" -o . -m markdown
./../../src/modules/Kerberos.rb ./../../src/include/kerberos-client/dialogs.rb
./../../src/include/kerberos-client/wizards.rb; fi
[warn]: @param tag has unknown parameter name: value
in file `../../src/modules/Kerberos.rb' near line 245
Files: 3
Modules: 3 ( 2 undocumented)
Classes: 1 ( 1 undocumented)
Constants: 1 ( 1 undocumented)
Methods: 41 ( 3 undocumented)
84.78% documented
make[2]: Leaving directory
`<http://river.suse.de/job/yast-kerberos-client-HEAD/ws/checkout/doc/autodocs'>
make[2]: Entering directory
`<http://river.suse.de/job/yast-kerberos-client-HEAD/ws/checkout/doc'>
make[2]: Nothing to be done for `all-am'.
make[2]: Leaving directory
`<http://river.suse.de/job/yast-kerberos-client-HEAD/ws/checkout/doc'>
make[1]: Leaving directory
`<http://river.suse.de/job/yast-kerberos-client-HEAD/ws/checkout/doc'>
Making all in src
make[1]: Entering directory
`<http://river.suse.de/job/yast-kerberos-client-HEAD/ws/checkout/src'>
make[1]: Nothing to be done for `all'.
make[1]: Leaving directory
`<http://river.suse.de/job/yast-kerberos-client-HEAD/ws/checkout/src'>
Making all in testsuite
make[1]: Entering directory
`<http://river.suse.de/job/yast-kerberos-client-HEAD/ws/checkout/testsuite'>
make -f /usr/share/YaST2/data/testsuite/Makefile.testsuite
RPMNAME=yast2-kerberos-client srcdir=.
make[2]: Entering directory
`<http://river.suse.de/job/yast-kerberos-client-HEAD/ws/checkout/testsuite'>
make[2]: Nothing to be done for `all'.
make[2]: Leaving directory
`<http://river.suse.de/job/yast-kerberos-client-HEAD/ws/checkout/testsuite'>
make[1]: Leaving directory
`<http://river.suse.de/job/yast-kerberos-client-HEAD/ws/checkout/testsuite'>
make[1]: Entering directory
`<http://river.suse.de/job/yast-kerberos-client-HEAD/ws/checkout'>
make[1]: Nothing to be done for `all-am'.
make[1]: Leaving directory
`<http://river.suse.de/job/yast-kerberos-client-HEAD/ws/checkout'>
+ make check
Making check in agents
make[1]: Entering directory
`<http://river.suse.de/job/yast-kerberos-client-HEAD/ws/checkout/agents'>
make[1]: Nothing to be done for `check'.
make[1]: Leaving directory
`<http://river.suse.de/job/yast-kerberos-client-HEAD/ws/checkout/agents'>
Making check in doc
make[1]: Entering directory
`<http://river.suse.de/job/yast-kerberos-client-HEAD/ws/checkout/doc'>
Making check in autodocs
make[2]: Entering directory
`<http://river.suse.de/job/yast-kerberos-client-HEAD/ws/checkout/doc/autodocs'>
make[2]: Nothing to be done for `check'.
make[2]: Leaving directory
`<http://river.suse.de/job/yast-kerberos-client-HEAD/ws/checkout/doc/autodocs'>
make[2]: Entering directory
`<http://river.suse.de/job/yast-kerberos-client-HEAD/ws/checkout/doc'>
make[2]: Nothing to be done for `check-am'.
make[2]: Leaving directory
`<http://river.suse.de/job/yast-kerberos-client-HEAD/ws/checkout/doc'>
make[1]: Leaving directory
`<http://river.suse.de/job/yast-kerberos-client-HEAD/ws/checkout/doc'>
Making check in src
make[1]: Entering directory
`<http://river.suse.de/job/yast-kerberos-client-HEAD/ws/checkout/src'>
make[1]: Nothing to be done for `check'.
make[1]: Leaving directory
`<http://river.suse.de/job/yast-kerberos-client-HEAD/ws/checkout/src'>
Making check in testsuite
make[1]: Entering directory
`<http://river.suse.de/job/yast-kerberos-client-HEAD/ws/checkout/testsuite'>
make -f /usr/share/YaST2/data/testsuite/Makefile.testsuite
RPMNAME=yast2-kerberos-client srcdir=.
make[2]: Entering directory
`<http://river.suse.de/job/yast-kerberos-client-HEAD/ws/checkout/testsuite'>
make[2]: Nothing to be done for `all'.
make[2]: Leaving directory
`<http://river.suse.de/job/yast-kerberos-client-HEAD/ws/checkout/testsuite'>
make check-DEJAGNU check-local
make[2]: Entering directory
`<http://river.suse.de/job/yast-kerberos-client-HEAD/ws/checkout/testsuite'>
Making a new site.exp file ...
srcdir='.'; export srcdir; \
EXPECT=expect; export EXPECT; \
runtest=runtest; \
if /bin/sh -c "$runtest --version" > /dev/null 2>&1; then \
exit_status=0; l='yast2-kerberos-client'; for tool in $l; do \
if $runtest --tool $tool --srcdir $srcdir ; \
then :; else exit_status=1; fi; \
done; \
else echo "WARNING: could not find 'runtest'" 1>&2; :;\
fi; \
exit $exit_status
WARNING: Couldn't find tool init file
Test Run By root on Tue Jul 30 14:34:34 2013
Native configuration is x86_64-suse-linux-gnu

=== yast2-kerberos-client tests ===

Schedule of variations:
unix

Running target unix
Using /usr/share/dejagnu/baseboards/unix.exp as board description file for
target.
Using /usr/share/dejagnu/config/unix.exp as generic interface file for target.
Using ./config/unix.exp as tool-and-target-specific interface file.
Running ./yast2-kerberos-client.test/testsuite.exp ...

Checking started

Running ImportExport ...
FAIL: Wrong stderr for ImportExport

The diff follows...

--- tests/ImportExport.err 2013-01-22 11:25:53.000000000 +0100
+++ tmp.err.ImportExport 2013-07-30 14:34:34.000000000 +0200
@@ -0,0 +1,6 @@
+2013-07-30 14:34:34 <3> app42(21616) [Interpreter] modules/Testsuite.rb:42
Loading module 'FileUtils' failed
+2013-07-30 14:34:34 <3> app42(21616) [libycp] Import.cc(import):97 No matching
component found
+2013-07-30 14:34:34 <3> app42(21616) [Interpreter] modules/Testsuite.rb:42
Import 'FileUtils' failed...
+2013-07-30 14:34:34 <3> app42(21616) [Interpreter] modules/Testsuite.rb:42
Could not create its namespace
+2013-07-30 14:34:34 <3> app42(21616) [libycp] Bytecode.cc(readFile):1161
Caught invalid bytecode in
'<http://river.suse.de/job/yast-kerberos-client-HEAD/ws/checkout/src/Kerberos.ybc'>
+2013-07-30 14:34:34 <3> app42(21616) [Interpreter] modules/Testsuite.rb:42
Loading module 'Kerberos' failed

FAIL: Wrong stderr for ImportExport
See the diff above.
Running Read ...
FAIL: Wrong stderr for Read

The diff follows...

--- tests/Read.err 2013-01-22 11:25:53.000000000 +0100
+++ tmp.err.Read 2013-07-30 14:34:34.000000000 +0200
@@ -0,0 +1,6 @@
+2013-07-30 14:34:34 <3> app42(21642) [Interpreter] modules/Testsuite.rb:42
Loading module 'FileUtils' failed
+2013-07-30 14:34:34 <3> app42(21642) [libycp] Import.cc(import):97 No matching
component found
+2013-07-30 14:34:34 <3> app42(21642) [Interpreter] modules/Testsuite.rb:42
Import 'FileUtils' failed...
+2013-07-30 14:34:34 <3> app42(21642) [Interpreter] modules/Testsuite.rb:42
Could not create its namespace
+2013-07-30 14:34:34 <3> app42(21642) [libycp] Bytecode.cc(readFile):1161
Caught invalid bytecode in
'<http://river.suse.de/job/yast-kerberos-client-HEAD/ws/checkout/src/Kerberos.ybc'>
+2013-07-30 14:34:34 <3> app42(21642) [Interpreter] modules/Testsuite.rb:42
Loading module 'Kerberos' failed

FAIL: Wrong stderr for Read
See the diff above.
Running ReadKrb5ConfValue ...
FAIL: Wrong stderr for ReadKrb5ConfValue

The diff follows...

--- tests/ReadKrb5ConfValue.err 2013-01-22 11:25:53.000000000 +0100
+++ tmp.err.ReadKrb5ConfValue 2013-07-30 14:34:34.000000000 +0200
@@ -0,0 +1,6 @@
+2013-07-30 14:34:34 <3> app42(21668) [Interpreter] modules/Testsuite.rb:42
Loading module 'FileUtils' failed
+2013-07-30 14:34:34 <3> app42(21668) [libycp] Import.cc(import):97 No matching
component found
+2013-07-30 14:34:34 <3> app42(21668) [Interpreter] modules/Testsuite.rb:42
Import 'FileUtils' failed...
+2013-07-30 14:34:34 <3> app42(21668) [Interpreter] modules/Testsuite.rb:42
Could not create its namespace
+2013-07-30 14:34:34 <3> app42(21668) [libycp] Bytecode.cc(readFile):1161
Caught invalid bytecode in
'<http://river.suse.de/job/yast-kerberos-client-HEAD/ws/checkout/src/Kerberos.ybc'>
+2013-07-30 14:34:34 <3> app42(21668) [Interpreter] modules/Testsuite.rb:42
Loading module 'Kerberos' failed

FAIL: Wrong stderr for ReadKrb5ConfValue
See the diff above.
Running Write ...
FAIL: Wrong stderr for Write

The diff follows...

--- tests/Write.err 2013-01-22 11:25:53.000000000 +0100
+++ tmp.err.Write 2013-07-30 14:34:34.000000000 +0200
@@ -0,0 +1,6 @@
+2013-07-30 14:34:34 <3> app42(21694) [Interpreter] modules/Testsuite.rb:42
Loading module 'FileUtils' failed
+2013-07-30 14:34:34 <3> app42(21694) [libycp] Import.cc(import):97 No matching
component found
+2013-07-30 14:34:34 <3> app42(21694) [Interpreter] modules/Testsuite.rb:42
Import 'FileUtils' failed...
+2013-07-30 14:34:34 <3> app42(21694) [Interpreter] modules/Testsuite.rb:42
Could not create its namespace
+2013-07-30 14:34:34 <3> app42(21694) [libycp] Bytecode.cc(readFile):1161
Caught invalid bytecode in
'<http://river.suse.de/job/yast-kerberos-client-HEAD/ws/checkout/src/Kerberos.ybc'>
+2013-07-30 14:34:34 <3> app42(21694) [Interpreter] modules/Testsuite.rb:42
Loading module 'Kerberos' failed

FAIL: Wrong stderr for Write
See the diff above.
Running WriteKrb5ConfValue ...
FAIL: Wrong stderr for WriteKrb5ConfValue

The diff follows...

--- tests/WriteKrb5ConfValue.err 2013-01-22 11:25:53.000000000 +0100
+++ tmp.err.WriteKrb5ConfValue 2013-07-30 14:34:35.000000000 +0200
@@ -0,0 +1,6 @@
+2013-07-30 14:34:35 <3> app42(21720) [Interpreter] modules/Testsuite.rb:42
Loading module 'FileUtils' failed
+2013-07-30 14:34:35 <3> app42(21720) [libycp] Import.cc(import):97 No matching
component found
+2013-07-30 14:34:35 <3> app42(21720) [Interpreter] modules/Testsuite.rb:42
Import 'FileUtils' failed...
+2013-07-30 14:34:35 <3> app42(21720) [Interpreter] modules/Testsuite.rb:42
Could not create its namespace
+2013-07-30 14:34:35 <3> app42(21720) [libycp] Bytecode.cc(readFile):1161
Caught invalid bytecode in
'<http://river.suse.de/job/yast-kerberos-client-HEAD/ws/checkout/src/Kerberos.ybc'>
+2013-07-30 14:34:35 <3> app42(21720) [Interpreter] modules/Testsuite.rb:42
Loading module 'Kerberos' failed

FAIL: Wrong stderr for WriteKrb5ConfValue
See the diff above.

Checking finished


=== yast2-kerberos-client Summary ===

# of unexpected failures 10
make[2]: *** [check-DEJAGNU] Error 1
make[2]: Leaving directory
`<http://river.suse.de/job/yast-kerberos-client-HEAD/ws/checkout/testsuite'>
make[1]: *** [check-am] Error 2
make[1]: Leaving directory
`<http://river.suse.de/job/yast-kerberos-client-HEAD/ws/checkout/testsuite'>
make: *** [check-recursive] Error 1
++ error_exit 2
++ echo 'ERROR: detected exitcode 2'
ERROR: detected exitcode 2
++ cleanup
++ echo '==> Running cleanup'
==> Running cleanup
++ rm -f
<http://river.suse.de/job/yast-kerberos-client-HEAD/ws/ICECC/40c0ab7e54f59a1e4e493c1ea90a882a.tar.gz>
++ footer_and_exit 1
++ '[' -z 1 ']'
++ MYEXIT=1
++ '[' 1 == 0 ']'
++ ascii_failed
++ cat

( )
( ) (
) _ )
( \_
_(_\ \)__
(____\___))

build failed

++ exit 1
Build step 'Execute shell' marked build as failure
--
To unsubscribe, e-mail: yast-devel+unsubscribe@xxxxxxxxxxxx
To contact the owner, e-mail: yast-devel+owner@xxxxxxxxxxxx

< Previous Next >
Follow Ups
References