Mailinglist Archive: yast-devel (251 mails)

< Previous Next >
[yast-devel] Build failed in Jenkins: yast-nis-server-HEAD #315
  • From: hudson@xxxxxxx
  • Date: Tue, 30 Jul 2013 14:20:39 +0200 (CEST)
  • Message-id: <2082800222.123.1375186839447.JavaMail.jenkins@river>
See <http://river.suse.de/job/yast-nis-server-HEAD/315/changes>

Changes:

[yast-devel] version 3.0.0

------------------------------------------
[...truncated 142 lines...]
./configure --prefix=/usr --libdir=/usr/lib64
checking build system type... x86_64-suse-linux-gnu
checking host system type... x86_64-suse-linux-gnu
checking target system type... x86_64-suse-linux-gnu
checking for a BSD-compatible install... /usr/bin/install -c
checking whether build environment is sane... yes
checking for a thread-safe mkdir -p... /usr/bin/mkdir -p
checking for gawk... gawk
checking whether make sets $(MAKE)... yes
checking how to create a ustar tar archive... gnutar
checking whether ln -s works... yes
checking whether make sets $(MAKE)... (cached) yes
checking for xgettext... /usr/bin/xgettext
checking for ycpdoc... /usr/lib/YaST2/bin/ycpdoc
checking for ycpmakedep... /usr/lib/YaST2/bin/ycpmakedep
checking for ycpc... /usr/bin/ycpc
checking for /usr/share/YaST2/data/testsuite/Makefile.testsuite... yes
checking for expect... /usr/bin/expect
checking for runtest... /usr/bin/runtest
checking that generated files are newer than configure... done
configure: creating ./config.status
config.status: creating Makefile
config.status: creating agents/Makefile
config.status: creating doc/autodocs/Makefile
config.status: creating doc/images/Makefile
config.status: creating doc/Makefile
config.status: creating src/Makefile
config.status: creating testsuite/Makefile
+ make
Making all in agents
make[1]: Entering directory
`<http://river.suse.de/job/yast-nis-server-HEAD/ws/checkout/agents'>
make[1]: Nothing to be done for `all'.
make[1]: Leaving directory
`<http://river.suse.de/job/yast-nis-server-HEAD/ws/checkout/agents'>
Making all in doc
make[1]: Entering directory
`<http://river.suse.de/job/yast-nis-server-HEAD/ws/checkout/doc'>
Making all in autodocs
make[2]: Entering directory
`<http://river.suse.de/job/yast-nis-server-HEAD/ws/checkout/doc/autodocs'>
if [ -n "" ]; then /usr/lib/YaST2/bin/ycpdoc -d. -s./../../src ; fi
for i in ; do \
b=${i##./../../src}; b=${b#/}; b=${b//\//__}; b=${b%.pm}; \
pod2html --title=$b --infile=$i --outfile=$b.html; \
echo "<a href='$b.html'>${b/__/::}</a>" > $b.mod.html; \
done
if [ -n "./../../src/modules/NisServer.rb
./../../src/include/nis_server/details.rb ./../../src/include/nis_server/ui.rb
./../../src/include/nis_server/slaves.rb
./../../src/include/nis_server/routines.rb
./../../src/include/nis_server/what.rb ./../../src/include/nis_server/slave.rb
./../../src/include/nis_server/maps.rb
./../../src/include/nis_server/wizards.rb
./../../src/include/nis_server/securenets.rb
./../../src/include/nis_server/master.rb" ]; then yard doc --title
"yast2-nis-server -- Development Documentation" -o . -m markdown
./../../src/modules/NisServer.rb ./../../src/include/nis_server/details.rb
./../../src/include/nis_server/ui.rb ./../../src/include/nis_server/slaves.rb
./../../src/include/nis_server/routines.rb
./../../src/include/nis_server/what.rb ./../../src/include/nis_server/slave.rb
./../../src/include/nis_server/maps.rb
./../../src/include/nis_server/wizards.rb
./../../src/include/nis_server/securenets.rb
./../../src/include/nis_server/master.rb; fi
Files: 11
Modules: 11 ( 10 undocumented)
Classes: 1 ( 1 undocumented)
Constants: 1 ( 1 undocumented)
Methods: 70 ( 18 undocumented)
63.86% documented
make[2]: Leaving directory
`<http://river.suse.de/job/yast-nis-server-HEAD/ws/checkout/doc/autodocs'>
Making all in images
make[2]: Entering directory
`<http://river.suse.de/job/yast-nis-server-HEAD/ws/checkout/doc/images'>
make[2]: Nothing to be done for `all'.
make[2]: Leaving directory
`<http://river.suse.de/job/yast-nis-server-HEAD/ws/checkout/doc/images'>
make[2]: Entering directory
`<http://river.suse.de/job/yast-nis-server-HEAD/ws/checkout/doc'>
make[2]: Nothing to be done for `all-am'.
make[2]: Leaving directory
`<http://river.suse.de/job/yast-nis-server-HEAD/ws/checkout/doc'>
make[1]: Leaving directory
`<http://river.suse.de/job/yast-nis-server-HEAD/ws/checkout/doc'>
Making all in src
make[1]: Entering directory
`<http://river.suse.de/job/yast-nis-server-HEAD/ws/checkout/src'>
make[1]: Nothing to be done for `all'.
make[1]: Leaving directory
`<http://river.suse.de/job/yast-nis-server-HEAD/ws/checkout/src'>
Making all in testsuite
make[1]: Entering directory
`<http://river.suse.de/job/yast-nis-server-HEAD/ws/checkout/testsuite'>
make -f /usr/share/YaST2/data/testsuite/Makefile.testsuite
RPMNAME=yast2-nis-server srcdir=.
make[2]: Entering directory
`<http://river.suse.de/job/yast-nis-server-HEAD/ws/checkout/testsuite'>
make[2]: Nothing to be done for `all'.
make[2]: Leaving directory
`<http://river.suse.de/job/yast-nis-server-HEAD/ws/checkout/testsuite'>
make[1]: Leaving directory
`<http://river.suse.de/job/yast-nis-server-HEAD/ws/checkout/testsuite'>
make[1]: Entering directory
`<http://river.suse.de/job/yast-nis-server-HEAD/ws/checkout'>
make[1]: Nothing to be done for `all-am'.
make[1]: Leaving directory
`<http://river.suse.de/job/yast-nis-server-HEAD/ws/checkout'>
+ make check
Making check in agents
make[1]: Entering directory
`<http://river.suse.de/job/yast-nis-server-HEAD/ws/checkout/agents'>
make[1]: Nothing to be done for `check'.
make[1]: Leaving directory
`<http://river.suse.de/job/yast-nis-server-HEAD/ws/checkout/agents'>
Making check in doc
make[1]: Entering directory
`<http://river.suse.de/job/yast-nis-server-HEAD/ws/checkout/doc'>
Making check in autodocs
make[2]: Entering directory
`<http://river.suse.de/job/yast-nis-server-HEAD/ws/checkout/doc/autodocs'>
make[2]: Nothing to be done for `check'.
make[2]: Leaving directory
`<http://river.suse.de/job/yast-nis-server-HEAD/ws/checkout/doc/autodocs'>
Making check in images
make[2]: Entering directory
`<http://river.suse.de/job/yast-nis-server-HEAD/ws/checkout/doc/images'>
make[2]: Nothing to be done for `check'.
make[2]: Leaving directory
`<http://river.suse.de/job/yast-nis-server-HEAD/ws/checkout/doc/images'>
make[2]: Entering directory
`<http://river.suse.de/job/yast-nis-server-HEAD/ws/checkout/doc'>
make[2]: Nothing to be done for `check-am'.
make[2]: Leaving directory
`<http://river.suse.de/job/yast-nis-server-HEAD/ws/checkout/doc'>
make[1]: Leaving directory
`<http://river.suse.de/job/yast-nis-server-HEAD/ws/checkout/doc'>
Making check in src
make[1]: Entering directory
`<http://river.suse.de/job/yast-nis-server-HEAD/ws/checkout/src'>
make[1]: Nothing to be done for `check'.
make[1]: Leaving directory
`<http://river.suse.de/job/yast-nis-server-HEAD/ws/checkout/src'>
Making check in testsuite
make[1]: Entering directory
`<http://river.suse.de/job/yast-nis-server-HEAD/ws/checkout/testsuite'>
make -f /usr/share/YaST2/data/testsuite/Makefile.testsuite
RPMNAME=yast2-nis-server srcdir=.
make[2]: Entering directory
`<http://river.suse.de/job/yast-nis-server-HEAD/ws/checkout/testsuite'>
make[2]: Nothing to be done for `all'.
make[2]: Leaving directory
`<http://river.suse.de/job/yast-nis-server-HEAD/ws/checkout/testsuite'>
make check-DEJAGNU check-local
make[2]: Entering directory
`<http://river.suse.de/job/yast-nis-server-HEAD/ws/checkout/testsuite'>
Making a new site.exp file ...
srcdir='.'; export srcdir; \
EXPECT=expect; export EXPECT; \
runtest=runtest; \
if /bin/sh -c "$runtest --version" > /dev/null 2>&1; then \
exit_status=0; l='yast2-nis-server'; for tool in $l; do \
if $runtest --tool $tool --srcdir $srcdir ; \
then :; else exit_status=1; fi; \
done; \
else echo "WARNING: could not find 'runtest'" 1>&2; :;\
fi; \
exit $exit_status
WARNING: Couldn't find tool init file
Test Run By root on Tue Jul 30 14:20:38 2013
Native configuration is x86_64-suse-linux-gnu

=== yast2-nis-server tests ===

Schedule of variations:
unix

Running target unix
Using /usr/share/dejagnu/baseboards/unix.exp as board description file for
target.
Using /usr/share/dejagnu/config/unix.exp as generic interface file for target.
Using ./config/unix.exp as tool-and-target-specific interface file.
Running ./yast2-nis-server.test/testsuite.exp ...

Checking started

Running SaveVariables ...
FAIL: Wrong stdout for SaveVariables

The diff follows...

--- tests/SaveVariables.out 2013-01-22 11:36:39.000000000 +0100
+++ tmp.out.SaveVariables 2013-07-30 14:20:38.000000000 +0200
@@ -1,16 +0,0 @@
-Dump slave
-Write .etc.defaultdomain "thedomain" true
-Return nil
-Dump master
-Write .etc.defaultdomain "thedomain" true
-Write .sysconfig.ypserv.YPPWD_CHFN "no" true
-Write .sysconfig.ypserv.YPPWD_CHSH "no" true
-Write .sysconfig.ypserv.YPPWD_SRCDIR "/etc" true
-Write .var.yp.makefile.MERGE_PASSWD "true" true
-Write .var.yp.makefile.MINGID "0" true
-Write .var.yp.makefile.MINUID "0" true
-Write .var.yp.makefile.NOPUSH "false" true
-Write .var.yp.makefile.maps [] true
-Write .sysconfig.ypserv nil true
-Write .var.yp.makefile nil true
-Return nil

FAIL: Wrong stdout for SaveVariables
See the diff above.
Running routines ...
FAIL: Wrong stdout for routines

The diff follows...

--- tests/routines.out 2013-01-22 11:36:39.000000000 +0100
+++ tmp.out.routines 2013-07-30 14:20:38.000000000 +0200
@@ -1,41 +0,0 @@
-Return true
-Return false
-Return true
-Return false
-Return true
-Return false
-Return false
-Return false
-Return false
-Return false
-Dump getMaster
-Return nil
-Read .target.size "/var/yp/testdomain" -1
-Return nil
-Read .target.size "/var/yp/testdomain" 42
-Read .target.dir "/var/yp/testdomain" []
-Return nil
-Read .target.size "/var/yp/testdomain" 42
-Read .target.dir "/var/yp/testdomain" ["map1", "map2"]
-Execute .target.bash_output "/usr/lib/yp/makedbm -u
/var/yp/testdomain/map1 | grep ^YP_MASTER_NAME" $["exit":1, "stderr":"",
"stdout":""]
-Return nil
-Read .target.size "/var/yp/testdomain" 42
-Read .target.dir "/var/yp/testdomain" ["map1", "map2"]
-Execute .target.bash_output "/usr/lib/yp/makedbm -u
/var/yp/testdomain/map1 | grep ^YP_MASTER_NAME" $["exit":0, "stderr":"",
"stdout":"YP_MASTER_NAME nismaster.foo.com\n"]
-Return nismaster.foo.com
-Dump isYPMaster
-Read .target.size "/var/yp/testdomain" 42
-Read .target.dir "/var/yp/testdomain" ["map1", "map2"]
-Execute .target.bash_output "/usr/lib/yp/makedbm -u
/var/yp/testdomain/map1 | grep ^YP_MASTER_NAME" $["exit":0, "stderr":"",
"stdout":"YP_MASTER_NAME nismaster.foo.com\n"]
-Execute .target.bash_output "/usr/lib/yp/yphelper --hostname"
$["exit":1, "stderr":"", "stdout":""]
-Return false
-Read .target.size "/var/yp/testdomain" 42
-Read .target.dir "/var/yp/testdomain" ["map1", "map2"]
-Execute .target.bash_output "/usr/lib/yp/makedbm -u
/var/yp/testdomain/map1 | grep ^YP_MASTER_NAME" $["exit":0, "stderr":"",
"stdout":"YP_MASTER_NAME nismaster.foo.com\n"]
-Execute .target.bash_output "/usr/lib/yp/yphelper --hostname"
$["exit":0, "stderr":"", "stdout":"nisslave.foo.com\n"]
-Return false
-Read .target.size "/var/yp/testdomain" 42
-Read .target.dir "/var/yp/testdomain" ["map1", "map2"]
-Execute .target.bash_output "/usr/lib/yp/makedbm -u
/var/yp/testdomain/map1 | grep ^YP_MASTER_NAME" $["exit":0, "stderr":"",
"stdout":"YP_MASTER_NAME nismaster.foo.com\n"]
-Execute .target.bash_output "/usr/lib/yp/yphelper --hostname"
$["exit":0, "stderr":"", "stdout":"nismaster.foo.com\n"]
-Return true

FAIL: Wrong stdout for routines
See the diff above.

Checking finished


=== yast2-nis-server Summary ===

# of unexpected failures 4
make[2]: *** [check-DEJAGNU] Error 1
make[2]: Leaving directory
`<http://river.suse.de/job/yast-nis-server-HEAD/ws/checkout/testsuite'>
make[1]: *** [check-am] Error 2
make[1]: Leaving directory
`<http://river.suse.de/job/yast-nis-server-HEAD/ws/checkout/testsuite'>
make: *** [check-recursive] Error 1
++ error_exit 2
++ echo 'ERROR: detected exitcode 2'
ERROR: detected exitcode 2
++ cleanup
++ echo '==> Running cleanup'
==> Running cleanup
++ rm -f
<http://river.suse.de/job/yast-nis-server-HEAD/ws/ICECC/40c0ab7e54f59a1e4e493c1ea90a882a.tar.gz>
++ footer_and_exit 1
++ '[' -z 1 ']'
++ MYEXIT=1
++ '[' 1 == 0 ']'
++ ascii_failed
++ cat

( )
( ) (
) _ )
( \_
_(_\ \)__
(____\___))

build failed

++ exit 1
Build step 'Execute shell' marked build as failure
--
To unsubscribe, e-mail: yast-devel+unsubscribe@xxxxxxxxxxxx
To contact the owner, e-mail: yast-devel+owner@xxxxxxxxxxxx

< Previous Next >
This Thread
Follow Ups
References