Mailinglist Archive: yast-devel (251 mails)

< Previous Next >
[yast-devel] Build failed in Jenkins: yast-yast2-HEAD #146
  • From: hudson@xxxxxxx
  • Date: Tue, 30 Jul 2013 14:11:04 +0200 (CEST)
  • Message-id: <1991950473.113.1375186264301.JavaMail.jenkins@river>
See <http://river.suse.de/job/yast-yast2-HEAD/146/changes>

Changes:

[yast-devel] YCP Killer: Unify YaST module structure

[yast-devel] YCP Killer: Apply changes needed for Ruby translation

[yast-devel] YCP Killer: Translate YCP files into Ruby

[yast-devel] YCP Killer: Regenerate Makefile.am files in all source directories

[yast-devel] version 3.0.0

------------------------------------------
[...truncated 1272 lines...]
[warn]: Invalid tag format for @example in file
`../../src/modules/SuSEFirewall.rb` near line 913
[warn]: @param tag has unknown parameter name: string
in file `../../src/modules/SuSEFirewall.rb' near line 913
[warn]: Invalid tag format for @example in file
`../../src/modules/SuSEFirewall.rb` near line 951
[warn]: @param tag has unknown parameter name: string
in file `../../src/modules/SuSEFirewall.rb' near line 951
[warn]: @param tag has unknown parameter name: new_status,
in file `../../src/modules/SuSEFirewall.rb' near line 1081
[warn]: @param tag has unknown parameter name: string
in file `../../src/modules/SuSEFirewall.rb' near line 1155
[warn]: @param tag has unknown parameter name: boolean
in file `../../src/modules/SuSEFirewall.rb' near line 1163
[warn]: @param tag has unknown parameter name: boolean
in file `../../src/modules/SuSEFirewall.rb' near line 1185
[warn]: @param tag has unknown parameter name: boolean
in file `../../src/modules/SuSEFirewall.rb' near line 1317
[warn]: @param tag has unknown parameter name: map
in file `../../src/modules/SuSEFirewall.rb' near line 1453
[warn]: @param tag has unknown parameter name: string
in file `../../src/modules/SuSEFirewall.rb' near line 1469
[warn]: Invalid tag format for @example in file
`../../src/modules/SuSEFirewall.rb` near line 1528
[warn]: Invalid tag format for @example in file
`../../src/modules/SuSEFirewall.rb` near line 1549
[warn]: Invalid tag format for @example in file
`../../src/modules/SuSEFirewall.rb` near line 1882
[warn]: Invalid tag format for @example in file
`../../src/modules/SuSEFirewall.rb` near line 1939
[warn]: @param tag has unknown parameter name: service/port
in file `../../src/modules/SuSEFirewall.rb' near line 1939
[warn]: @param tag has unknown parameter name: string
in file `../../src/modules/SuSEFirewall.rb' near line 1939
[warn]: Invalid tag format for @example in file
`../../src/modules/SuSEFirewall.rb` near line 2017
[warn]: @param tag has unknown parameter name: service/port
in file `../../src/modules/SuSEFirewall.rb' near line 2017
[warn]: @param tag has unknown parameter name: string
in file `../../src/modules/SuSEFirewall.rb' near line 2017
[warn]: Invalid tag format for @example in file
`../../src/modules/SuSEFirewall.rb` near line 2132
[warn]: @param tag has unknown parameter name: service,
in file `../../src/modules/SuSEFirewall.rb' near line 2132
[warn]: @param tag has unknown parameter name: zone,
in file `../../src/modules/SuSEFirewall.rb' near line 2132
[warn]: Invalid tag format for @example in file
`../../src/modules/SuSEFirewall.rb` near line 2167
[warn]: Invalid tag format for @example in file
`../../src/modules/SuSEFirewall.rb` near line 2255
[warn]: @param tag has unknown parameter name: list
in file `../../src/modules/SuSEFirewall.rb' near line 2255
[warn]: @param tag has unknown parameter name: list
in file `../../src/modules/SuSEFirewall.rb' near line 2308
[warn]: Invalid tag format for @example in file
`../../src/modules/SuSEFirewall.rb` near line 2342
[warn]: @param tag has unknown parameter name: list
in file `../../src/modules/SuSEFirewall.rb' near line 2342
[warn]: @param tag has unknown parameter name: list
in file `../../src/modules/SuSEFirewall.rb' near line 2342
[warn]: @param tag has unknown parameter name: boolean
in file `../../src/modules/SuSEFirewall.rb' near line 2342
[warn]: @param tag has unknown parameter name: list
in file `../../src/modules/SuSEFirewall.rb' near line 2397
[warn]: @param tag has unknown parameter name: list
in file `../../src/modules/SuSEFirewall.rb' near line 2397
[warn]: @param tag has unknown parameter name: boolean
in file `../../src/modules/SuSEFirewall.rb' near line 2397
[warn]: Invalid tag format for @example in file
`../../src/modules/SuSEFirewall.rb` near line 2797
[warn]: Invalid tag format for @example in file
`../../src/modules/SuSEFirewall.rb` near line 2869
[warn]: @param tag has unknown parameter name: list
in file `../../src/modules/SuSEFirewall.rb' near line 2869
[warn]: Invalid tag format for @example in file
`../../src/modules/SuSEFirewall.rb` near line 2982
[warn]: Invalid tag format for @example in file
`../../src/modules/SuSEFirewall.rb` near line 3010
[warn]: @param tag has unknown parameter name: boolean
in file `../../src/modules/SuSEFirewall.rb' near line 3094
[warn]: Invalid tag format for @example in file
`../../src/modules/SuSEFirewall.rb` near line 3126
[warn]: Unknown tag @params in file `../../src/modules/SuSEFirewall.rb` near
line 3173
[warn]: Invalid tag format for @example in file
`../../src/modules/SuSEFirewall.rb` near line 3215
[warn]: Invalid tag format for @example in file
`../../src/modules/SuSEFirewall.rb` near line 3274
[warn]: Invalid tag format for @example in file
`../../src/modules/SuSEFirewall.rb` near line 3308
[warn]: @param tag has unknown parameter name: string
in file `../../src/modules/SuSEFirewall.rb' near line 3308
[warn]: Invalid tag format for @example in file
`../../src/modules/SuSEFirewall.rb` near line 3348
[warn]: Invalid tag format for @example in file
`../../src/modules/SuSEFirewall.rb` near line 3365
[warn]: @param tag has unknown parameter name: string
in file `../../src/modules/SuSEFirewall.rb' near line 3365
[warn]: @param tag has unknown parameter name: string
in file `../../src/modules/SuSEFirewall.rb' near line 3416
[warn]: @param tag has unknown parameter name: list
in file `../../src/modules/SuSEFirewall.rb' near line 3455
[warn]: @param tag has unknown parameter name: string
in file `../../src/modules/SuSEFirewall.rb' near line 3496
[warn]: Invalid tag format for @example in file
`../../src/modules/SuSEFirewall.rb` near line 3521
[warn]: Invalid tag format for @example in file
`../../src/modules/SuSEFirewall.rb` near line 3548
[warn]: @param tag has unknown parameter name: list
in file `../../src/modules/SuSEFirewall.rb' near line 3548
[warn]: @param tag has unknown parameter name: list
in file `../../src/modules/SuSEFirewallProposal.rb' near line 101
[warn]: @param tag has unknown parameter name: list
in file `../../src/modules/SuSEFirewallProposal.rb' near line 137
[warn]: @param tag has unknown parameter name: list
in file `../../src/modules/SuSEFirewallProposal.rb' near line 234
[warn]: @param tag has unknown parameter name: service,
in file `../../src/modules/SuSEFirewallProposal.rb' near line 258
[warn]: @param tag has unknown parameter name: fallback_ports,
in file `../../src/modules/SuSEFirewallProposal.rb' near line 258
[warn]: @param tag has unknown parameter name: interfaces,
in file `../../src/modules/SuSEFirewallProposal.rb' near line 258
[warn]: @param tag has unknown parameter name: service,
in file `../../src/modules/SuSEFirewallProposal.rb' near line 286
[warn]: @param tag has unknown parameter name: fallback_ports,
in file `../../src/modules/SuSEFirewallProposal.rb' near line 286
[warn]: @param tag has unknown parameter name: list
in file `../../src/modules/SuSEFirewallProposal.rb' near line 321
[warn]: @param tag has unknown parameter name: boolean
in file `../../src/modules/SuSEFirewallProposal.rb' near line 480
[warn]: @param tag has unknown parameter name: boolean
in file `../../src/modules/SuSEFirewallProposal.rb' near line 497
[warn]: @param tag has unknown parameter name: event_id
in file `../../src/modules/CWMFirewallInterfaces.rb' near line 872
[warn]: @param tag has unknown parameter name: event_id
in file `../../src/modules/CWMFirewallInterfaces.rb' near line 949
[warn]: Invalid tag format for @example in file
`../../src/modules/SuSEFirewallExpertRules.rb` near line 142
[warn]: Invalid tag format for @example in file
`../../src/modules/SuSEFirewallExpertRules.rb` near line 257
[warn]: Invalid tag format for @example in file
`../../src/modules/SuSEFirewallExpertRules.rb` near line 304
[warn]: Invalid tag format for @example in file
`../../src/modules/PortRanges.rb` near line 65
[warn]: @param tag has unknown parameter name: string
in file `../../src/modules/PortRanges.rb' near line 65
[warn]: @param tag has unknown parameter name: string
in file `../../src/modules/PortRanges.rb' near line 92
[warn]: @param tag has unknown parameter name: string
in file `../../src/modules/PortRanges.rb' near line 181
[warn]: @param tag has unknown parameter name: boolean
in file `../../src/modules/PortRanges.rb' near line 228
[warn]: @param tag has unknown parameter name: integer
in file `../../src/modules/PortRanges.rb' near line 272
[warn]: @param tag has unknown parameter name: integer
in file `../../src/modules/PortRanges.rb' near line 272
[warn]: @param tag has unknown parameter name: list
in file `../../src/modules/PortRanges.rb' near line 317
[warn]: @param tag has unknown parameter name: list
in file `../../src/modules/PortRanges.rb' near line 387
[warn]: @param tag has unknown parameter name: port-number
in file `../../src/modules/PortAliases.rb' near line 236
[warn]: @param tag has unknown parameter name: string
in file `../../src/modules/PortAliases.rb' near line 305
[warn]: @param tag has unknown parameter name: port_name_or_number
in file `../../src/modules/PortAliases.rb' near line 317
[warn]: @param tag has unknown parameter name: port_number
in file `../../src/modules/PortAliases.rb' near line 317
[warn]: Invalid tag format for @example in file
`../../src/modules/SuSEFirewallServices.rb` near line 258
[warn]: Invalid tag format for @example in file
`../../src/modules/SuSEFirewallServices.rb` near line 274
[warn]: @param tag has unknown parameter name: string
in file `../../src/modules/SuSEFirewallServices.rb' near line 294
[warn]: Invalid tag format for @example in file
`../../src/modules/SuSEFirewallServices.rb` near line 567
[warn]: Invalid tag format for @example in file
`../../src/modules/SuSEFirewallServices.rb` near line 617
[warn]: @param tag has unknown parameter name: map
in file `../../src/modules/SuSEFirewallServices.rb' near line 617
Files: 12
Modules: 1 ( 1 undocumented)
Classes: 12 ( 12 undocumented)
Constants: 12 ( 12 undocumented)
Methods: 326 ( 26 undocumented)
85.47% documented
make[4]: Leaving directory
`<http://river.suse.de/job/yast-yast2-HEAD/ws/checkout/library/network/doc/autodocs'>
make[4]: Entering directory
`<http://river.suse.de/job/yast-yast2-HEAD/ws/checkout/library/network/doc'>
make[4]: Nothing to be done for `all-am'.
make[4]: Leaving directory
`<http://river.suse.de/job/yast-yast2-HEAD/ws/checkout/library/network/doc'>
make[3]: Leaving directory
`<http://river.suse.de/job/yast-yast2-HEAD/ws/checkout/library/network/doc'>
Making all in src
make[3]: Entering directory
`<http://river.suse.de/job/yast-yast2-HEAD/ws/checkout/library/network/src'>
make[3]: Nothing to be done for `all'.
make[3]: Leaving directory
`<http://river.suse.de/job/yast-yast2-HEAD/ws/checkout/library/network/src'>
Making all in testsuite
make[3]: Entering directory
`<http://river.suse.de/job/yast-yast2-HEAD/ws/checkout/library/network/testsuite'>
make -f /usr/share/YaST2/data/testsuite/Makefile.testsuite RPMNAME=yast2
srcdir=.
make[4]: Entering directory
`<http://river.suse.de/job/yast-yast2-HEAD/ws/checkout/library/network/testsuite'>
make[4]: Nothing to be done for `all'.
make[4]: Leaving directory
`<http://river.suse.de/job/yast-yast2-HEAD/ws/checkout/library/network/testsuite'>
make[3]: Leaving directory
`<http://river.suse.de/job/yast-yast2-HEAD/ws/checkout/library/network/testsuite'>
make[3]: Entering directory
`<http://river.suse.de/job/yast-yast2-HEAD/ws/checkout/library/network'>
make[3]: Nothing to be done for `all-am'.
make[3]: Leaving directory
`<http://river.suse.de/job/yast-yast2-HEAD/ws/checkout/library/network'>
make[2]: Leaving directory
`<http://river.suse.de/job/yast-yast2-HEAD/ws/checkout/library/network'>
Making all in gpg
make[2]: Entering directory
`<http://river.suse.de/job/yast-yast2-HEAD/ws/checkout/library/gpg'>
Making all in doc
make[3]: Entering directory
`<http://river.suse.de/job/yast-yast2-HEAD/ws/checkout/library/gpg/doc'>
Making all in autodocs
make[4]: Entering directory
`<http://river.suse.de/job/yast-yast2-HEAD/ws/checkout/library/gpg/doc/autodocs'>
if [ -n "" ]; then /usr/lib/YaST2/bin/ycpdoc -d. -s./../../src ; fi
for i in ; do \
b=${i##./../../src}; b=${b#/}; b=${b//\//__}; b=${b%.pm}; \
pod2html --title=$b --infile=$i --outfile=$b.html; \
echo "<a href='$b.html'>${b/__/::}</a>" > $b.mod.html; \
done
if [ -n "./../../src/modules/GPG.rb ./../../src/modules/GPGWidgets.rb" ]; then
yard doc --title "yast2 -- Development Documentation" -o . -m markdown
./../../src/modules/GPG.rb ./../../src/modules/GPGWidgets.rb; fi
Files: 2
Modules: 1 ( 1 undocumented)
Classes: 2 ( 2 undocumented)
Constants: 2 ( 2 undocumented)
Methods: 34 ( 2 undocumented)
82.05% documented
make[4]: Leaving directory
`<http://river.suse.de/job/yast-yast2-HEAD/ws/checkout/library/gpg/doc/autodocs'>
make[4]: Entering directory
`<http://river.suse.de/job/yast-yast2-HEAD/ws/checkout/library/gpg/doc'>
make[4]: Nothing to be done for `all-am'.
make[4]: Leaving directory
`<http://river.suse.de/job/yast-yast2-HEAD/ws/checkout/library/gpg/doc'>
make[3]: Leaving directory
`<http://river.suse.de/job/yast-yast2-HEAD/ws/checkout/library/gpg/doc'>
Making all in src
make[3]: Entering directory
`<http://river.suse.de/job/yast-yast2-HEAD/ws/checkout/library/gpg/src'>
make[3]: Nothing to be done for `all'.
make[3]: Leaving directory
`<http://river.suse.de/job/yast-yast2-HEAD/ws/checkout/library/gpg/src'>
Making all in testsuite
make[3]: Entering directory
`<http://river.suse.de/job/yast-yast2-HEAD/ws/checkout/library/gpg/testsuite'>
make -f /usr/share/YaST2/data/testsuite/Makefile.testsuite RPMNAME=yast2
srcdir=.
make[4]: Entering directory
`<http://river.suse.de/job/yast-yast2-HEAD/ws/checkout/library/gpg/testsuite'>
make[4]: Nothing to be done for `all'.
make[4]: Leaving directory
`<http://river.suse.de/job/yast-yast2-HEAD/ws/checkout/library/gpg/testsuite'>
make[3]: Leaving directory
`<http://river.suse.de/job/yast-yast2-HEAD/ws/checkout/library/gpg/testsuite'>
make[3]: Entering directory
`<http://river.suse.de/job/yast-yast2-HEAD/ws/checkout/library/gpg'>
make[3]: Nothing to be done for `all-am'.
make[3]: Leaving directory
`<http://river.suse.de/job/yast-yast2-HEAD/ws/checkout/library/gpg'>
make[2]: Leaving directory
`<http://river.suse.de/job/yast-yast2-HEAD/ws/checkout/library/gpg'>
Making all in general
make[2]: Entering directory
`<http://river.suse.de/job/yast-yast2-HEAD/ws/checkout/library/general'>
Making all in src
make[3]: Entering directory
`<http://river.suse.de/job/yast-yast2-HEAD/ws/checkout/library/general/src'>
make[3]: *** No rule to make target `all'. Stop.
make[3]: Leaving directory
`<http://river.suse.de/job/yast-yast2-HEAD/ws/checkout/library/general/src'>
make[2]: *** [all-recursive] Error 1
make[2]: Leaving directory
`<http://river.suse.de/job/yast-yast2-HEAD/ws/checkout/library/general'>
make[1]: *** [all-recursive] Error 1
make[1]: Leaving directory
`<http://river.suse.de/job/yast-yast2-HEAD/ws/checkout/library'>
make: *** [all-recursive] Error 1
++ error_exit 2
++ echo 'ERROR: detected exitcode 2'
ERROR: detected exitcode 2
++ cleanup
++ echo '==> Running cleanup'
==> Running cleanup
++ rm -f
<http://river.suse.de/job/yast-yast2-HEAD/ws/ICECC/40c0ab7e54f59a1e4e493c1ea90a882a.tar.gz>
++ footer_and_exit 1
++ '[' -z 1 ']'
++ MYEXIT=1
++ '[' 1 == 0 ']'
++ ascii_failed
++ cat

( )
( ) (
) _ )
( \_
_(_\ \)__
(____\___))

build failed

++ exit 1
Build step 'Execute shell' marked build as failure
--
To unsubscribe, e-mail: yast-devel+unsubscribe@xxxxxxxxxxxx
To contact the owner, e-mail: yast-devel+owner@xxxxxxxxxxxx

< Previous Next >
This Thread
Follow Ups