Mailinglist Archive: yast-devel (251 mails)

< Previous Next >
[yast-devel] Build failed in Jenkins: yast-sound-HEAD #125
  • From: hudson@xxxxxxx
  • Date: Tue, 30 Jul 2013 13:44:28 +0200 (CEST)
  • Message-id: <1759496787.104.1375184668500.JavaMail.jenkins@river>
See <http://river.suse.de/job/yast-sound-HEAD/125/changes>

Changes:

[yast-devel] YCP Killer: Unify YaST module structure

[yast-devel] YCP Killer: Apply changes needed for Ruby translation

[yast-devel] YCP Killer: Translate YCP files into Ruby

[yast-devel] YCP Killer: Regenerate Makefile.am files in all source directories

[yast-devel] version 3.0.0

------------------------------------------
[...truncated 418 lines...]
make[2]: Entering directory
`<http://river.suse.de/job/yast-sound-HEAD/ws/checkout/agent-audio/testsuite'>
make check-DEJAGNU
make[3]: Entering directory
`<http://river.suse.de/job/yast-sound-HEAD/ws/checkout/agent-audio/testsuite'>
Making a new site.exp file ...
srcdir='.'; export srcdir; \
EXPECT=expect; export EXPECT; \
runtest=runtest; \
if /bin/sh -c "$runtest --version" > /dev/null 2>&1; then \
exit_status=0; l='yast2-sound'; for tool in $l; do \
if $runtest --tool $tool --srcdir $srcdir ; \
then :; else exit_status=1; fi; \
done; \
else echo "WARNING: could not find 'runtest'" 1>&2; :;\
fi; \
exit $exit_status
WARNING: Couldn't find tool init file
Test Run By root on Tue Jul 30 13:44:26 2013
Native configuration is x86_64-suse-linux-gnu

=== yast2-sound tests ===

Schedule of variations:
unix

Running target unix
Using /usr/share/dejagnu/baseboards/unix.exp as board description file for
target.
Using /usr/share/dejagnu/config/unix.exp as generic interface file for target.
WARNING: Couldn't find tool config file for unix, using default.

=== yast2-sound Summary ===

make[3]: Leaving directory
`<http://river.suse.de/job/yast-sound-HEAD/ws/checkout/agent-audio/testsuite'>
make[2]: Leaving directory
`<http://river.suse.de/job/yast-sound-HEAD/ws/checkout/agent-audio/testsuite'>
make[2]: Entering directory
`<http://river.suse.de/job/yast-sound-HEAD/ws/checkout/agent-audio'>
make[2]: Nothing to be done for `check-am'.
make[2]: Leaving directory
`<http://river.suse.de/job/yast-sound-HEAD/ws/checkout/agent-audio'>
make[1]: Leaving directory
`<http://river.suse.de/job/yast-sound-HEAD/ws/checkout/agent-audio'>
Making check in data
make[1]: Entering directory
`<http://river.suse.de/job/yast-sound-HEAD/ws/checkout/data'>
Making check in doc
make[2]: Entering directory
`<http://river.suse.de/job/yast-sound-HEAD/ws/checkout/data/doc'>
make[2]: Nothing to be done for `check'.
make[2]: Leaving directory
`<http://river.suse.de/job/yast-sound-HEAD/ws/checkout/data/doc'>
make[2]: Entering directory
`<http://river.suse.de/job/yast-sound-HEAD/ws/checkout/data'>
make[2]: Nothing to be done for `check-am'.
make[2]: Leaving directory
`<http://river.suse.de/job/yast-sound-HEAD/ws/checkout/data'>
make[1]: Leaving directory
`<http://river.suse.de/job/yast-sound-HEAD/ws/checkout/data'>
Making check in doc
make[1]: Entering directory
`<http://river.suse.de/job/yast-sound-HEAD/ws/checkout/doc'>
Making check in autodocs
make[2]: Entering directory
`<http://river.suse.de/job/yast-sound-HEAD/ws/checkout/doc/autodocs'>
make[2]: Nothing to be done for `check'.
make[2]: Leaving directory
`<http://river.suse.de/job/yast-sound-HEAD/ws/checkout/doc/autodocs'>
make[2]: Entering directory
`<http://river.suse.de/job/yast-sound-HEAD/ws/checkout/doc'>
make[2]: Nothing to be done for `check-am'.
make[2]: Leaving directory
`<http://river.suse.de/job/yast-sound-HEAD/ws/checkout/doc'>
make[1]: Leaving directory
`<http://river.suse.de/job/yast-sound-HEAD/ws/checkout/doc'>
Making check in sound
make[1]: Entering directory
`<http://river.suse.de/job/yast-sound-HEAD/ws/checkout/sound'>
make[2]: Entering directory
`<http://river.suse.de/job/yast-sound-HEAD/ws/checkout/sound'>
make[2]: Nothing to be done for `check-am'.
make[2]: Leaving directory
`<http://river.suse.de/job/yast-sound-HEAD/ws/checkout/sound'>
make[1]: Leaving directory
`<http://river.suse.de/job/yast-sound-HEAD/ws/checkout/sound'>
Making check in src
make[1]: Entering directory
`<http://river.suse.de/job/yast-sound-HEAD/ws/checkout/src'>
make[1]: Nothing to be done for `check'.
make[1]: Leaving directory
`<http://river.suse.de/job/yast-sound-HEAD/ws/checkout/src'>
Making check in testsuite
make[1]: Entering directory
`<http://river.suse.de/job/yast-sound-HEAD/ws/checkout/testsuite'>
make -f /usr/share/YaST2/data/testsuite/Makefile.testsuite RPMNAME=yast2-sound
srcdir=.
make[2]: Entering directory
`<http://river.suse.de/job/yast-sound-HEAD/ws/checkout/testsuite'>
make[2]: Nothing to be done for `all'.
make[2]: Leaving directory
`<http://river.suse.de/job/yast-sound-HEAD/ws/checkout/testsuite'>
make check-DEJAGNU check-local
make[2]: Entering directory
`<http://river.suse.de/job/yast-sound-HEAD/ws/checkout/testsuite'>
Making a new site.exp file ...
srcdir='.'; export srcdir; \
EXPECT=expect; export EXPECT; \
runtest=runtest; \
if /bin/sh -c "$runtest --version" > /dev/null 2>&1; then \
exit_status=0; l='yast2-sound'; for tool in $l; do \
if $runtest --tool $tool --srcdir $srcdir ; \
then :; else exit_status=1; fi; \
done; \
else echo "WARNING: could not find 'runtest'" 1>&2; :;\
fi; \
exit $exit_status
WARNING: Couldn't find tool init file
Test Run By root on Tue Jul 30 13:44:27 2013
Native configuration is x86_64-suse-linux-gnu

=== yast2-sound tests ===

Schedule of variations:
unix

Running target unix
Using /usr/share/dejagnu/baseboards/unix.exp as board description file for
target.
Using /usr/share/dejagnu/config/unix.exp as generic interface file for target.
Using ./config/unix.exp as tool-and-target-specific interface file.
Running ./yast2-sound.test/testsuite.exp ...

Checking started

Running export_volume ...
FAIL: Wrong stdout for export_volume

The diff follows...

--- tests/export_volume.out 2013-07-30 13:43:49.000000000 +0200
+++ tmp.out.export_volume 2013-07-30 13:44:27.000000000 +0200
@@ -1,3 +0,0 @@
-Return []
-Return []
-Return [[$["mute":false, "name":"Master", "volume":80], $["mute":false,
"name":"CD", "volume":90]]]

FAIL: Wrong stdout for export_volume
See the diff above.
Running filter_configured ...
FAIL: Wrong stdout for filter_configured

The diff follows...

--- tests/filter_configured.out 2013-07-30 13:43:49.000000000 +0200
+++ tmp.out.filter_configured 2013-07-30 13:44:27.000000000 +0200
@@ -1,7 +0,0 @@
-Return []
-Return [$["device":"SB Live! EMU10000", "unique_key":"CvwD.k1dGGUobcK9",
"vendor":"Creative Labs", "vendor_id":69890]]
-Return []
-Return [$["device":"SB Live! EMU10000", "unique_key":"CvwD.k1dGGUobcK9",
"vendor":"Creative Labs", "vendor_id":69890]]
-Return []
-Return [$["bus":"PCI", "class_id":4, "device":"SB Live! EMU10000",
"device_id":65538, "drivers":[$["active":false, "modprobe":true,
"modules":[["emu10k1", ""]]]], "resource":$["io":[$["active":true, "length":0,
"mode":"rw", "start":49152]], "irq":[$["count":1146364, "enabled":true,
"irq":10]]], "rev":"7", "sub_class_id":1, "sub_device":"CT4830 SBLive! Value",
"sub_device_id":98342, "sub_vendor":"Creative Labs", "sub_vendor_id":69890,
"unique_key":"CvwD.k1dGGUobcK9", "vendor":"Creative Labs", "vendor_id":69890]]
-Return [$["bus":"PCI", "class_id":4, "device":"SB Live! EMU10000",
"device_id":65538, "drivers":[$["active":false, "modprobe":true,
"modules":[["emu10k1", ""]]]], "resource":$["io":[$["active":true, "length":0,
"mode":"rw", "start":49152]], "irq":[$["count":1146364, "enabled":true,
"irq":10]]], "rev":"7", "sub_class_id":1, "sub_device":"CT4830 SBLive! Value",
"sub_device_id":98342, "sub_vendor":"Creative Labs", "sub_vendor_id":69890,
"unique_key":"CvwD.k1dGGUobcK9", "vendor":"Creative Labs", "vendor_id":69890],
$["bus":"PCI", "class_id":4, "device":"AC97 Audio Controller",
"device_id":77912, "drivers":[$["active":false, "modprobe":true,
"modules":[["via82cxxx_audio", ""]]]], "resource":$["io":[$["active":true,
"length":0, "mode":"rw", "start":55296], $["active":true, "length":0,
"mode":"rw", "start":56320], $["active":true, "length":0, "mode":"rw",
"start":57344]], "irq":[$["count":1146364, "enabled":true, "irq":10]]],
"rev":"32", "sub_class_id":1, "sub_device_id":100613, "sub_vendor":"FIRST
INTERNATIONAL Computer Inc", "sub_vendor_id":70921,
"unique_key":"hB6S.CxYdteFTb8D", "vendor":"VIA Technologies, Inc.",
"vendor_id":69894]]

FAIL: Wrong stdout for filter_configured
See the diff above.
Running get_card_label ...
FAIL: Wrong stdout for get_card_label

The diff follows...

--- tests/get_card_label.out 2013-07-30 13:43:49.000000000 +0200
+++ tmp.out.get_card_label 2013-07-30 13:44:27.000000000 +0200
@@ -1,5 +0,0 @@
-Return
-Return CT4830 SBLive! Value
-Return CT4830 SBLive! Value
-Return Creative Labs
-Return CT4830 SBLive! Value

FAIL: Wrong stdout for get_card_label
See the diff above.
Running import_volume ...
FAIL: Wrong stdout for import_volume

The diff follows...

--- tests/import_volume.out 2013-07-30 13:43:49.000000000 +0200
+++ tmp.out.import_volume 2013-07-30 13:44:27.000000000 +0200
@@ -1,4 +0,0 @@
-Return []
-Return []
-Return [[["Master", 80, false], ["CD", 90, false]]]
-Return [[["Master", 80, false], ["CD", 90, false]]]

FAIL: Wrong stdout for import_volume
See the diff above.
Running is_snd_alias ...
FAIL: Wrong stdout for is_snd_alias

The diff follows...

--- tests/is_snd_alias.out 2013-07-30 13:43:49.000000000 +0200
+++ tmp.out.is_snd_alias 2013-07-30 13:44:28.000000000 +0200
@@ -1,22 +0,0 @@
-Return false
-Return true
-Return true
-Return false
-Return false
-Return false
-Return false
-Return false
-Return false
-Return false
-Return false
-Return false
-Return false
-Return false
-Return false
-Return false
-Return false
-Return true
-Return true
-Return false
-Return false
-Return false

FAIL: Wrong stdout for is_snd_alias
See the diff above.
Running isa_uniq ...
FAIL: Wrong stdout for isa_uniq

The diff follows...

--- tests/isa_uniq.out 2013-07-30 13:43:49.000000000 +0200
+++ tmp.out.isa_uniq 2013-07-30 13:44:28.000000000 +0200
@@ -1 +0,0 @@
-Return uniq.unknown_key

FAIL: Wrong stdout for isa_uniq
See the diff above.

Checking finished


=== yast2-sound Summary ===

# of unexpected failures 12
make[2]: *** [check-DEJAGNU] Error 1
make[2]: Leaving directory
`<http://river.suse.de/job/yast-sound-HEAD/ws/checkout/testsuite'>
make[1]: *** [check-am] Error 2
make[1]: Leaving directory
`<http://river.suse.de/job/yast-sound-HEAD/ws/checkout/testsuite'>
make: *** [check-recursive] Error 1
++ error_exit 2
++ echo 'ERROR: detected exitcode 2'
ERROR: detected exitcode 2
++ cleanup
++ echo '==> Running cleanup'
==> Running cleanup
++ rm -f
<http://river.suse.de/job/yast-sound-HEAD/ws/ICECC/40c0ab7e54f59a1e4e493c1ea90a882a.tar.gz>
++ footer_and_exit 1
++ '[' -z 1 ']'
++ MYEXIT=1
++ '[' 1 == 0 ']'
++ ascii_failed
++ cat

( )
( ) (
) _ )
( \_
_(_\ \)__
(____\___))

build failed

++ exit 1
Build step 'Execute shell' marked build as failure
--
To unsubscribe, e-mail: yast-devel+unsubscribe@xxxxxxxxxxxx
To contact the owner, e-mail: yast-devel+owner@xxxxxxxxxxxx

< Previous Next >
This Thread
Follow Ups