Mailinglist Archive: yast-devel (251 mails)

< Previous Next >
[yast-devel] Build failed in Jenkins: yast-snapper-HEAD #237
  • From: hudson@xxxxxxx
  • Date: Tue, 30 Jul 2013 13:43:47 +0200 (CEST)
  • Message-id: <1360295994.103.1375184627747.JavaMail.jenkins@river>
See <http://river.suse.de/job/yast-snapper-HEAD/237/changes>

Changes:

[yast-devel] YCP Killer: Unify YaST module structure

[yast-devel] YCP Killer: Apply changes needed for Ruby translation

[yast-devel] YCP Killer: Translate YCP files into Ruby

[yast-devel] YCP Killer: Regenerate Makefile.am files in all source directories

[yast-devel] version 3.0.0

------------------------------------------
[...truncated 295 lines...]
make[3]: Nothing to be done for `all-am'.
make[3]: Leaving directory
`<http://river.suse.de/job/yast-snapper-HEAD/ws/checkout/agent-snapper'>
make[2]: Leaving directory
`<http://river.suse.de/job/yast-snapper-HEAD/ws/checkout/agent-snapper'>
Making all in doc
make[2]: Entering directory
`<http://river.suse.de/job/yast-snapper-HEAD/ws/checkout/doc'>
Making all in autodocs
make[3]: Entering directory
`<http://river.suse.de/job/yast-snapper-HEAD/ws/checkout/doc/autodocs'>
if [ -n "" ]; then /usr/lib/YaST2/bin/ycpdoc -d. -s./../../src ; fi
for i in ; do \
b=${i##./../../src}; b=${b#/}; b=${b//\//__}; b=${b%.pm}; \
pod2html --title=$b --infile=$i --outfile=$b.html; \
echo "<a href='$b.html'>${b/__/::}</a>" > $b.mod.html; \
done
if [ -n "./../../src/modules/Snapper.rb ./../../src/include/snapper/dialogs.rb
./../../src/include/snapper/helps.rb ./../../src/include/snapper/wizards.rb" ];
then yard doc --title "yast2-snapper -- Development Documentation" -o . -m
markdown ./../../src/modules/Snapper.rb ./../../src/include/snapper/dialogs.rb
./../../src/include/snapper/helps.rb ./../../src/include/snapper/wizards.rb; fi
Files: 4
Modules: 4 ( 3 undocumented)
Classes: 1 ( 1 undocumented)
Constants: 1 ( 1 undocumented)
Methods: 32 ( 7 undocumented)
68.42% documented
make[3]: Leaving directory
`<http://river.suse.de/job/yast-snapper-HEAD/ws/checkout/doc/autodocs'>
make[3]: Entering directory
`<http://river.suse.de/job/yast-snapper-HEAD/ws/checkout/doc'>
make[3]: Nothing to be done for `all-am'.
make[3]: Leaving directory
`<http://river.suse.de/job/yast-snapper-HEAD/ws/checkout/doc'>
make[2]: Leaving directory
`<http://river.suse.de/job/yast-snapper-HEAD/ws/checkout/doc'>
Making all in src
make[2]: Entering directory
`<http://river.suse.de/job/yast-snapper-HEAD/ws/checkout/src'>
make[2]: Nothing to be done for `all'.
make[2]: Leaving directory
`<http://river.suse.de/job/yast-snapper-HEAD/ws/checkout/src'>
Making all in testsuite
make[2]: Entering directory
`<http://river.suse.de/job/yast-snapper-HEAD/ws/checkout/testsuite'>
make -f /usr/share/YaST2/data/testsuite/Makefile.testsuite
RPMNAME=yast2-snapper srcdir=.
make[3]: Entering directory
`<http://river.suse.de/job/yast-snapper-HEAD/ws/checkout/testsuite'>
make[3]: Nothing to be done for `all'.
make[3]: Leaving directory
`<http://river.suse.de/job/yast-snapper-HEAD/ws/checkout/testsuite'>
make[2]: Leaving directory
`<http://river.suse.de/job/yast-snapper-HEAD/ws/checkout/testsuite'>
make[2]: Entering directory
`<http://river.suse.de/job/yast-snapper-HEAD/ws/checkout'>
make[2]: Nothing to be done for `all-am'.
make[2]: Leaving directory
`<http://river.suse.de/job/yast-snapper-HEAD/ws/checkout'>
make[1]: Leaving directory
`<http://river.suse.de/job/yast-snapper-HEAD/ws/checkout'>
+ make check
Making check in agent-snapper
make[1]: Entering directory
`<http://river.suse.de/job/yast-snapper-HEAD/ws/checkout/agent-snapper'>
Making check in conf
make[2]: Entering directory
`<http://river.suse.de/job/yast-snapper-HEAD/ws/checkout/agent-snapper/conf'>
make[2]: Nothing to be done for `check'.
make[2]: Leaving directory
`<http://river.suse.de/job/yast-snapper-HEAD/ws/checkout/agent-snapper/conf'>
Making check in doc
make[2]: Entering directory
`<http://river.suse.de/job/yast-snapper-HEAD/ws/checkout/agent-snapper/doc'>
Making check in autodocs
make[3]: Entering directory
`<http://river.suse.de/job/yast-snapper-HEAD/ws/checkout/agent-snapper/doc/autodocs'>
make[3]: Nothing to be done for `check'.
make[3]: Leaving directory
`<http://river.suse.de/job/yast-snapper-HEAD/ws/checkout/agent-snapper/doc/autodocs'>
make[3]: Entering directory
`<http://river.suse.de/job/yast-snapper-HEAD/ws/checkout/agent-snapper/doc'>
make[3]: Nothing to be done for `check-am'.
make[3]: Leaving directory
`<http://river.suse.de/job/yast-snapper-HEAD/ws/checkout/agent-snapper/doc'>
make[2]: Leaving directory
`<http://river.suse.de/job/yast-snapper-HEAD/ws/checkout/agent-snapper/doc'>
Making check in src
make[2]: Entering directory
`<http://river.suse.de/job/yast-snapper-HEAD/ws/checkout/agent-snapper/src'>
make[2]: Nothing to be done for `check'.
make[2]: Leaving directory
`<http://river.suse.de/job/yast-snapper-HEAD/ws/checkout/agent-snapper/src'>
make[2]: Entering directory
`<http://river.suse.de/job/yast-snapper-HEAD/ws/checkout/agent-snapper'>
make[2]: Nothing to be done for `check-am'.
make[2]: Leaving directory
`<http://river.suse.de/job/yast-snapper-HEAD/ws/checkout/agent-snapper'>
make[1]: Leaving directory
`<http://river.suse.de/job/yast-snapper-HEAD/ws/checkout/agent-snapper'>
Making check in doc
make[1]: Entering directory
`<http://river.suse.de/job/yast-snapper-HEAD/ws/checkout/doc'>
Making check in autodocs
make[2]: Entering directory
`<http://river.suse.de/job/yast-snapper-HEAD/ws/checkout/doc/autodocs'>
make[2]: Nothing to be done for `check'.
make[2]: Leaving directory
`<http://river.suse.de/job/yast-snapper-HEAD/ws/checkout/doc/autodocs'>
make[2]: Entering directory
`<http://river.suse.de/job/yast-snapper-HEAD/ws/checkout/doc'>
make[2]: Nothing to be done for `check-am'.
make[2]: Leaving directory
`<http://river.suse.de/job/yast-snapper-HEAD/ws/checkout/doc'>
make[1]: Leaving directory
`<http://river.suse.de/job/yast-snapper-HEAD/ws/checkout/doc'>
Making check in src
make[1]: Entering directory
`<http://river.suse.de/job/yast-snapper-HEAD/ws/checkout/src'>
make[1]: Nothing to be done for `check'.
make[1]: Leaving directory
`<http://river.suse.de/job/yast-snapper-HEAD/ws/checkout/src'>
Making check in testsuite
make[1]: Entering directory
`<http://river.suse.de/job/yast-snapper-HEAD/ws/checkout/testsuite'>
make -f /usr/share/YaST2/data/testsuite/Makefile.testsuite
RPMNAME=yast2-snapper srcdir=.
make[2]: Entering directory
`<http://river.suse.de/job/yast-snapper-HEAD/ws/checkout/testsuite'>
make[2]: Nothing to be done for `all'.
make[2]: Leaving directory
`<http://river.suse.de/job/yast-snapper-HEAD/ws/checkout/testsuite'>
make check-DEJAGNU check-local
make[2]: Entering directory
`<http://river.suse.de/job/yast-snapper-HEAD/ws/checkout/testsuite'>
Making a new site.exp file ...
srcdir='.'; export srcdir; \
EXPECT=expect; export EXPECT; \
runtest=runtest; \
if /bin/sh -c "$runtest --version" > /dev/null 2>&1; then \
exit_status=0; l='yast2-snapper'; for tool in $l; do \
if $runtest --tool $tool --srcdir $srcdir ; \
then :; else exit_status=1; fi; \
done; \
else echo "WARNING: could not find 'runtest'" 1>&2; :;\
fi; \
exit $exit_status
WARNING: Couldn't find tool init file
Test Run By root on Tue Jul 30 13:43:45 2013
Native configuration is x86_64-suse-linux-gnu

=== yast2-snapper tests ===

Schedule of variations:
unix

Running target unix
Using /usr/share/dejagnu/baseboards/unix.exp as board description file for
target.
Using /usr/share/dejagnu/config/unix.exp as generic interface file for target.
Using ./config/unix.exp as tool-and-target-specific interface file.
Running ./yast2-snapper.test/testsuite.exp ...

Checking started

Running GetFileMode ...
FAIL: Wrong stdout for GetFileMode

The diff follows...

--- tests/GetFileMode.out 2013-01-22 12:09:18.000000000 +0100
+++ tmp.out.GetFileMode 2013-07-30 13:43:46.000000000 +0200
@@ -1,4 +1,2 @@
Execute .target.bash_output "/bin/stat --printf=%a '/tmp/1'"
$["stdout":"755"]
-Return 755
Execute .target.bash_output "/bin/stat --printf=%a '/tmp/2'"
$["stderr":"/bin/stat: cannot stat `/tmp/2': No such file or directory\n",
"stdout":""]
-Return 644

FAIL: Wrong stdout for GetFileMode
See the diff above.
Running GetFileModification ...
FAIL: Wrong stdout for GetFileModification

The diff follows...

--- tests/GetFileModification.out 2013-01-22 12:09:18.000000000 +0100
+++ tmp.out.GetFileModification 2013-07-30 13:43:46.000000000 +0200
@@ -3,12 +3,9 @@
Execute .target.bash_output "/usr/bin/diff -u
'/snapshots/1/snapshot/etc/passwd' '/etc/passwd'" $["stderr":"error while
diffing"]
Log out: $["stderr":"error while diffing"]
Execute .target.bash_output "ls -ld --
'/snapshots/1/snapshot/etc/passwd' '/etc/passwd' | cut -f 1,3,4 -d ' '"
$["stderr":"error while diffing"]
-Return $["diff":"error while diffing", "status":["no_change"]]
Read .snapper.path $["num":1] "/snapshots/1/snapshot"
Read .snapper.path $["num":2] "/snapshots/1/snapshot"
Execute .target.bash_output "/usr/bin/diff -u
'/snapshots/1/snapshot/etc/passwd' '/snapshots/1/snapshot/etc/passwd'"
$["stdout":"+new user line"]
Execute .target.bash_output "ls -ld --
'/snapshots/1/snapshot/etc/passwd' '/snapshots/1/snapshot/etc/passwd' | cut -f
1,3,4 -d ' '" $["stdout":"+new user line"]
-Return $["diff":"+new user line", "group1":"line", "group2":"",
"mode1":"+new", "mode2":"", "status":["diff", "mode", "user", "group"],
"user1":"user", "user2":""]
Read .snapper.path $["num":1] "/snapshots/1/snapshot"
Read .snapper.path $["num":2] "/snapshots/1/snapshot"
-Return $["status":["none"]]

FAIL: Wrong stdout for GetFileModification
See the diff above.
Running GetSnapshotPath ...
FAIL: Wrong stdout for GetSnapshotPath

The diff follows...

--- tests/GetSnapshotPath.out 2013-07-30 13:43:12.000000000 +0200
+++ tmp.out.GetSnapshotPath 2013-07-30 13:43:46.000000000 +0200
@@ -1,5 +1,2 @@
Read .snapper.path $["num":0] nil
-Log Snapshot '0' was not found.
-Return
Read .snapper.path $["num":0] "/snapshots/0/snapshot"
-Return /snapshots/0/snapshot

FAIL: Wrong stdout for GetSnapshotPath
See the diff above.
Running ReadConfigs ...
FAIL: Wrong stdout for ReadConfigs

The diff follows...

--- tests/ReadConfigs.out 2013-07-30 13:43:12.000000000 +0200
+++ tmp.out.ReadConfigs 2013-07-30 13:43:47.000000000 +0200
@@ -1,13 +1,8 @@
Read .snapper.configs []
-Return []
Return root
Read .snapper.configs nil
-Log File /etc/sysconfig/snapper is not available.
-Return ["root"]
Return root
Read .snapper.configs ["opt", "var", "root"]
-Return ["opt", "var", "root"]
Return root
Read .snapper.configs ["opt", "var"]
-Return ["opt", "var"]
Return opt

FAIL: Wrong stdout for ReadConfigs
See the diff above.
Running ReadSnapshots ...
FAIL: Wrong stdout for ReadSnapshots

The diff follows...

--- tests/ReadSnapshots.out 2013-01-22 12:09:18.000000000 +0100
+++ tmp.out.ReadSnapshots 2013-07-30 13:43:47.000000000 +0200
@@ -1,7 +1,5 @@
Read .snapper.snapshots nil
-Return true
Return []
Read .snapper.snapshots [$["date":1297364138, "description":"current
system", "num":0, "type":`SINGLE], $["date":1297364138, "description":"before
yast2-users", "num":1, "post_num":2, "type":`PRE]]
-Return true
Return [$["date":1297364138, "description":"before yast2-users", "name":"1",
"num":1, "post_num":2, "type":`PRE]]
Return $[1:0]

FAIL: Wrong stdout for ReadSnapshots
See the diff above.

Checking finished


=== yast2-snapper Summary ===

# of unexpected failures 10
make[2]: *** [check-DEJAGNU] Error 1
make[2]: Leaving directory
`<http://river.suse.de/job/yast-snapper-HEAD/ws/checkout/testsuite'>
make[1]: *** [check-am] Error 2
make[1]: Leaving directory
`<http://river.suse.de/job/yast-snapper-HEAD/ws/checkout/testsuite'>
make: *** [check-recursive] Error 1
++ error_exit 2
++ echo 'ERROR: detected exitcode 2'
ERROR: detected exitcode 2
++ cleanup
++ echo '==> Running cleanup'
==> Running cleanup
++ rm -f
<http://river.suse.de/job/yast-snapper-HEAD/ws/ICECC/40c0ab7e54f59a1e4e493c1ea90a882a.tar.gz>
++ footer_and_exit 1
++ '[' -z 1 ']'
++ MYEXIT=1
++ '[' 1 == 0 ']'
++ ascii_failed
++ cat

( )
( ) (
) _ )
( \_
_(_\ \)__
(____\___))

build failed

++ exit 1
Build step 'Execute shell' marked build as failure
--
To unsubscribe, e-mail: yast-devel+unsubscribe@xxxxxxxxxxxx
To contact the owner, e-mail: yast-devel+owner@xxxxxxxxxxxx

< Previous Next >
This Thread
Follow Ups