Mailinglist Archive: yast-devel (251 mails)

< Previous Next >
[yast-devel] Build failed in Jenkins: yast-printer-HEAD #129
  • From: hudson@xxxxxxx
  • Date: Tue, 30 Jul 2013 13:39:54 +0200 (CEST)
  • Message-id: <1162958111.99.1375184394683.JavaMail.jenkins@river>
See <http://river.suse.de/job/yast-printer-HEAD/129/changes>

Changes:

[yast-devel] YCP Killer: Unify YaST module structure

[yast-devel] YCP Killer: Apply changes needed for Ruby translation

[yast-devel] YCP Killer: Translate YCP files into Ruby

[yast-devel] YCP Killer: Regenerate Makefile.am files in all source directories

[yast-devel] version 3.0.0

------------------------------------------
[...truncated 116 lines...]
Using autotools for building
++ export BUILDDIR=<http://river.suse.de/job/yast-printer-HEAD/ws/checkout>
++ BUILDDIR=<http://river.suse.de/job/yast-printer-HEAD/ws/checkout>
++ export
PACKAGEDIR=<http://river.suse.de/job/yast-printer-HEAD/ws/checkout/package>
++ PACKAGEDIR=<http://river.suse.de/job/yast-printer-HEAD/ws/checkout/package>
++ mkdir -p <http://river.suse.de/job/yast-printer-HEAD/ws/rpm>
++ mkdir -p <http://river.suse.de/job/yast-printer-HEAD/ws/rpm/rpms>
++ mkdir -p <http://river.suse.de/job/yast-printer-HEAD/ws/rpm/rpmbuild>
++ mkdir -p <http://river.suse.de/job/yast-printer-HEAD/ws/rpm/rpmbuildroot>
++ mkdir -p <http://river.suse.de/job/yast-printer-HEAD/ws/.artifacts>
++ mkdir -p <http://river.suse.de/job/yast-printer-HEAD/ws/OBS>
++ cat
+ PACKAGENAME=yast-printer
+ PACKAGENAME=yast2-printer
+ cd <http://river.suse.de/job/yast-printer-HEAD/ws/checkout>
+ make -f Makefile.cvs
y2tool y2autoconf
y2autoconf: Generating toplevel configure.ac
y2tool y2automake
y2automake: Copying automakefiles for inclusion
y2automake: Generating toplevel Makefile.am
autoreconf --force --install
./configure --prefix=/usr --libdir=/usr/lib64
checking build system type... x86_64-suse-linux-gnu
checking host system type... x86_64-suse-linux-gnu
checking target system type... x86_64-suse-linux-gnu
checking for a BSD-compatible install... /usr/bin/install -c
checking whether build environment is sane... yes
checking for a thread-safe mkdir -p... /usr/bin/mkdir -p
checking for gawk... gawk
checking whether make sets $(MAKE)... yes
checking how to create a ustar tar archive... gnutar
checking for style of include used by make... GNU
checking for gcc... gcc
checking whether the C compiler works... yes
checking for C compiler default output file name... a.out
checking for suffix of executables...
checking whether we are cross compiling... no
checking for suffix of object files... o
checking whether we are using the GNU C compiler... yes
checking whether gcc accepts -g... yes
checking for gcc option to accept ISO C89... none needed
checking dependency style of gcc... gcc3
checking how to run the C preprocessor... gcc -E
checking for grep that handles long lines and -e... /usr/bin/grep
checking for egrep... /usr/bin/grep -E
checking for ANSI C header files... yes
checking for sys/types.h... yes
checking for sys/stat.h... yes
checking for stdlib.h... yes
checking for string.h... yes
checking for memory.h... yes
checking for strings.h... yes
checking for inttypes.h... yes
checking for stdint.h... yes
checking for unistd.h... yes
checking X11/Xlib.h usability... yes
checking X11/Xlib.h presence... yes
checking for X11/Xlib.h... yes
checking whether ln -s works... yes
checking whether make sets $(MAKE)... (cached) yes
checking for xgettext... /usr/bin/xgettext
checking for ycpdoc... /usr/lib/YaST2/bin/ycpdoc
checking for ycpmakedep... /usr/lib/YaST2/bin/ycpmakedep
checking for ycpc... /usr/bin/ycpc
checking for /usr/share/YaST2/data/testsuite/Makefile.testsuite... yes
checking that generated files are newer than configure... done
configure: creating ./config.status
config.status: creating Makefile
config.status: creating data/Makefile
config.status: creating doc/autodocs/Makefile
config.status: creating doc/Makefile
config.status: creating src/Makefile
config.status: creating testsuite/Makefile
config.status: creating tools/Makefile
config.status: executing depfiles commands
+ make
Making all in data
make[1]: Entering directory
`<http://river.suse.de/job/yast-printer-HEAD/ws/checkout/data'>
make[1]: Nothing to be done for `all'.
make[1]: Leaving directory
`<http://river.suse.de/job/yast-printer-HEAD/ws/checkout/data'>
Making all in doc
make[1]: Entering directory
`<http://river.suse.de/job/yast-printer-HEAD/ws/checkout/doc'>
Making all in autodocs
make[2]: Entering directory
`<http://river.suse.de/job/yast-printer-HEAD/ws/checkout/doc/autodocs'>
if [ -n "" ]; then /usr/lib/YaST2/bin/ycpdoc -d. -s./../../src ; fi
for i in ; do \
b=${i##./../../src}; b=${b#/}; b=${b//\//__}; b=${b%.pm}; \
pod2html --title=$b --infile=$i --outfile=$b.html; \
echo "<a href='$b.html'>${b/__/::}</a>" > $b.mod.html; \
done
if [ -n "./../../src/modules/Printerlib.rb ./../../src/modules/Printer.rb
./../../src/include/printer/policies.rb ./../../src/include/printer/dialogs.rb
./../../src/include/printer/readwrite.rb
./../../src/include/printer/driveroptions.rb
./../../src/include/printer/printingvianetwork.rb
./../../src/include/printer/helps.rb ./../../src/include/printer/autoconfig.rb
./../../src/include/printer/driveradd.rb ./../../src/include/printer/sharing.rb
./../../src/include/printer/basicmodify.rb
./../../src/include/printer/wizards.rb ./../../src/include/printer/overview.rb
./../../src/include/printer/connectionwizard.rb
./../../src/include/printer/basicadd.rb" ]; then yard doc --title
"yast2-printer -- Development Documentation" -o . -m markdown
./../../src/modules/Printerlib.rb ./../../src/modules/Printer.rb
./../../src/include/printer/policies.rb ./../../src/include/printer/dialogs.rb
./../../src/include/printer/readwrite.rb
./../../src/include/printer/driveroptions.rb
./../../src/include/printer/printingvianetwork.rb
./../../src/include/printer/helps.rb ./../../src/include/printer/autoconfig.rb
./../../src/include/printer/driveradd.rb ./../../src/include/printer/sharing.rb
./../../src/include/printer/basicmodify.rb
./../../src/include/printer/wizards.rb ./../../src/include/printer/overview.rb
./../../src/include/printer/connectionwizard.rb
./../../src/include/printer/basicadd.rb; fi
[warn]: @param tag has unknown parameter name: string
in file `../../src/modules/Printer.rb' near line 811
[warn]: @param tag has unknown parameter name: integer
in file `../../src/modules/Printer.rb' near line 811
[warn]: @param tag has unknown parameter name: string
in file `../../src/modules/Printer.rb' near line 914
[warn]: In file `../../src/modules/Printer.rb':5: Cannot resolve link to
#autodetected_printer_map from text:
[warn]: ...{#autodetected_printer_map}...
[warn]: In file `../../src/modules/Printer.rb':5: Cannot resolve link to
#autodetected_queue_map from text:
[warn]: ...{#autodetected_queue_map}...
[warn]: In file `../../src/modules/Printer.rb':5: Cannot resolve link to
#printer_ppd_map from text:
[warn]: ...{#printer_ppd_map}...
[warn]: In file `../../src/modules/Printer.rb':5: Cannot resolve link to
#autodetected_queue_map from text:
[warn]: ...{#autodetected_queue_map}...
[warn]: In file `../../src/modules/Printer.rb':474: Cannot resolve link to
#autodetected_printer_map from text:
[warn]: ...{#autodetected_printer_map}...
[warn]: In file `../../src/modules/Printer.rb':597: Cannot resolve link to
#autodetected_queue_map from text:
[warn]: ...{#autodetected_queue_map}...
[warn]: In file `../../src/modules/Printer.rb':350: Cannot resolve link to
#printer_ppd_map from text:
[warn]: ...{#printer_ppd_map}...
[warn]: In file `../../src/modules/Printer.rb':656: Cannot resolve link to
#autodetected_queue_map from text:
[warn]: ...{#autodetected_queue_map}...
Files: 16
Modules: 15 ( 14 undocumented)
Classes: 2 ( 2 undocumented)
Constants: 2 ( 2 undocumented)
Methods: 86 ( 49 undocumented)
36.19% documented
make[2]: Leaving directory
`<http://river.suse.de/job/yast-printer-HEAD/ws/checkout/doc/autodocs'>
make[2]: Entering directory
`<http://river.suse.de/job/yast-printer-HEAD/ws/checkout/doc'>
make[2]: Nothing to be done for `all-am'.
make[2]: Leaving directory
`<http://river.suse.de/job/yast-printer-HEAD/ws/checkout/doc'>
make[1]: Leaving directory
`<http://river.suse.de/job/yast-printer-HEAD/ws/checkout/doc'>
Making all in src
make[1]: Entering directory
`<http://river.suse.de/job/yast-printer-HEAD/ws/checkout/src'>
make[1]: Nothing to be done for `all'.
make[1]: Leaving directory
`<http://river.suse.de/job/yast-printer-HEAD/ws/checkout/src'>
Making all in testsuite
make[1]: Entering directory
`<http://river.suse.de/job/yast-printer-HEAD/ws/checkout/testsuite'>
make -f /usr/share/YaST2/data/testsuite/Makefile.testsuite
RPMNAME=yast2-printer srcdir=.
make[2]: Entering directory
`<http://river.suse.de/job/yast-printer-HEAD/ws/checkout/testsuite'>
make[2]: Nothing to be done for `all'.
make[2]: Leaving directory
`<http://river.suse.de/job/yast-printer-HEAD/ws/checkout/testsuite'>
make[1]: Leaving directory
`<http://river.suse.de/job/yast-printer-HEAD/ws/checkout/testsuite'>
Making all in tools
make[1]: Entering directory
`<http://river.suse.de/job/yast-printer-HEAD/ws/checkout/tools'>
make[1]: Nothing to be done for `all'.
make[1]: Leaving directory
`<http://river.suse.de/job/yast-printer-HEAD/ws/checkout/tools'>
make[1]: Entering directory
`<http://river.suse.de/job/yast-printer-HEAD/ws/checkout'>
make[1]: Nothing to be done for `all-am'.
make[1]: Leaving directory
`<http://river.suse.de/job/yast-printer-HEAD/ws/checkout'>
+ make check
Making check in data
make[1]: Entering directory
`<http://river.suse.de/job/yast-printer-HEAD/ws/checkout/data'>
make[1]: Nothing to be done for `check'.
make[1]: Leaving directory
`<http://river.suse.de/job/yast-printer-HEAD/ws/checkout/data'>
Making check in doc
make[1]: Entering directory
`<http://river.suse.de/job/yast-printer-HEAD/ws/checkout/doc'>
Making check in autodocs
make[2]: Entering directory
`<http://river.suse.de/job/yast-printer-HEAD/ws/checkout/doc/autodocs'>
make[2]: Nothing to be done for `check'.
make[2]: Leaving directory
`<http://river.suse.de/job/yast-printer-HEAD/ws/checkout/doc/autodocs'>
make[2]: Entering directory
`<http://river.suse.de/job/yast-printer-HEAD/ws/checkout/doc'>
make[2]: Nothing to be done for `check-am'.
make[2]: Leaving directory
`<http://river.suse.de/job/yast-printer-HEAD/ws/checkout/doc'>
make[1]: Leaving directory
`<http://river.suse.de/job/yast-printer-HEAD/ws/checkout/doc'>
Making check in src
make[1]: Entering directory
`<http://river.suse.de/job/yast-printer-HEAD/ws/checkout/src'>
make[1]: Nothing to be done for `check'.
make[1]: Leaving directory
`<http://river.suse.de/job/yast-printer-HEAD/ws/checkout/src'>
Making check in testsuite
make[1]: Entering directory
`<http://river.suse.de/job/yast-printer-HEAD/ws/checkout/testsuite'>
make -f /usr/share/YaST2/data/testsuite/Makefile.testsuite
RPMNAME=yast2-printer srcdir=.
make[2]: Entering directory
`<http://river.suse.de/job/yast-printer-HEAD/ws/checkout/testsuite'>
make[2]: Nothing to be done for `all'.
make[2]: Leaving directory
`<http://river.suse.de/job/yast-printer-HEAD/ws/checkout/testsuite'>
make check-DEJAGNU check-local
make[2]: Entering directory
`<http://river.suse.de/job/yast-printer-HEAD/ws/checkout/testsuite'>
Making a new site.exp file ...
srcdir='.'; export srcdir; \
EXPECT=expect; export EXPECT; \
runtest=runtest; \
if /bin/sh -c "$runtest --version" > /dev/null 2>&1; then \
exit_status=0; l='yast2-printer'; for tool in $l; do \
if $runtest --tool $tool --srcdir $srcdir ; \
then :; else exit_status=1; fi; \
done; \
else echo "WARNING: could not find 'runtest'" 1>&2; :;\
fi; \
exit $exit_status
WARNING: Couldn't find tool init file
Test Run By root on Tue Jul 30 13:39:54 2013
Native configuration is x86_64-suse-linux-gnu

=== yast2-printer tests ===

Schedule of variations:
unix

Running target unix
Using /usr/share/dejagnu/baseboards/unix.exp as board description file for
target.
Using /usr/share/dejagnu/config/unix.exp as generic interface file for target.
Using ./config/unix.exp as tool-and-target-specific interface file.
Running ./yast2-printer.test/testsuite.exp ...

Checking started

Running Printer ...
FAIL: Wrong stdout for Printer

The diff follows...

--- tests/Printer.out 2013-07-23 14:58:19.000000000 +0200
+++ tmp.out.Printer 2013-07-30 13:39:54.000000000 +0200
@@ -1,2 +0,0 @@
-Dump Printer::Modified
-Return false

FAIL: Wrong stdout for Printer
See the diff above.

Checking finished


=== yast2-printer Summary ===

# of unexpected failures 2
make[2]: *** [check-DEJAGNU] Error 1
make[2]: Leaving directory
`<http://river.suse.de/job/yast-printer-HEAD/ws/checkout/testsuite'>
make[1]: *** [check-am] Error 2
make[1]: Leaving directory
`<http://river.suse.de/job/yast-printer-HEAD/ws/checkout/testsuite'>
make: *** [check-recursive] Error 1
++ error_exit 2
++ echo 'ERROR: detected exitcode 2'
ERROR: detected exitcode 2
++ cleanup
++ echo '==> Running cleanup'
==> Running cleanup
++ rm -f
<http://river.suse.de/job/yast-printer-HEAD/ws/ICECC/40c0ab7e54f59a1e4e493c1ea90a882a.tar.gz>
++ footer_and_exit 1
++ '[' -z 1 ']'
++ MYEXIT=1
++ '[' 1 == 0 ']'
++ ascii_failed
++ cat

( )
( ) (
) _ )
( \_
_(_\ \)__
(____\___))

build failed

++ exit 1
Build step 'Execute shell' marked build as failure
--
To unsubscribe, e-mail: yast-devel+unsubscribe@xxxxxxxxxxxx
To contact the owner, e-mail: yast-devel+owner@xxxxxxxxxxxx

< Previous Next >
This Thread
Follow Ups