Mailinglist Archive: yast-devel (251 mails)

< Previous Next >
[yast-devel] Build failed in Jenkins: yast-installation-HEAD #331
  • From: hudson@xxxxxxx
  • Date: Tue, 30 Jul 2013 13:08:55 +0200 (CEST)
  • Message-id: <802875209.69.1375182535440.JavaMail.jenkins@river>
See <http://river.suse.de/job/yast-installation-HEAD/331/changes>

Changes:

[yast-devel] YCP Killer: Unify YaST module structure

[yast-devel] YCP Killer: Apply changes needed for Ruby translation

[yast-devel] YCP Killer: Translate YCP files into Ruby

[yast-devel] YCP Killer: Regenerate Makefile.am files in all source directories

------------------------------------------
[...truncated 475 lines...]
make[3]: Entering directory
`<http://river.suse.de/job/yast-installation-HEAD/ws/checkout/startup/arch'>
make[3]: Nothing to be done for `check-am'.
make[3]: Leaving directory
`<http://river.suse.de/job/yast-installation-HEAD/ws/checkout/startup/arch'>
make[2]: Leaving directory
`<http://river.suse.de/job/yast-installation-HEAD/ws/checkout/startup/arch'>
Making check in common
make[2]: Entering directory
`<http://river.suse.de/job/yast-installation-HEAD/ws/checkout/startup/common'>
make[2]: Nothing to be done for `check'.
make[2]: Leaving directory
`<http://river.suse.de/job/yast-installation-HEAD/ws/checkout/startup/common'>
Making check in hooks
make[2]: Entering directory
`<http://river.suse.de/job/yast-installation-HEAD/ws/checkout/startup/hooks'>
Making check in postFirstCall
make[3]: Entering directory
`<http://river.suse.de/job/yast-installation-HEAD/ws/checkout/startup/hooks/postFirstCall'>
make[3]: Nothing to be done for `check'.
make[3]: Leaving directory
`<http://river.suse.de/job/yast-installation-HEAD/ws/checkout/startup/hooks/postFirstCall'>
Making check in postFirstStage
make[3]: Entering directory
`<http://river.suse.de/job/yast-installation-HEAD/ws/checkout/startup/hooks/postFirstStage'>
make[3]: Nothing to be done for `check'.
make[3]: Leaving directory
`<http://river.suse.de/job/yast-installation-HEAD/ws/checkout/startup/hooks/postFirstStage'>
Making check in postSecondCall
make[3]: Entering directory
`<http://river.suse.de/job/yast-installation-HEAD/ws/checkout/startup/hooks/postSecondCall'>
make[3]: Nothing to be done for `check'.
make[3]: Leaving directory
`<http://river.suse.de/job/yast-installation-HEAD/ws/checkout/startup/hooks/postSecondCall'>
Making check in postSecondStage
make[3]: Entering directory
`<http://river.suse.de/job/yast-installation-HEAD/ws/checkout/startup/hooks/postSecondStage'>
make[3]: Nothing to be done for `check'.
make[3]: Leaving directory
`<http://river.suse.de/job/yast-installation-HEAD/ws/checkout/startup/hooks/postSecondStage'>
Making check in preFirstCall
make[3]: Entering directory
`<http://river.suse.de/job/yast-installation-HEAD/ws/checkout/startup/hooks/preFirstCall'>
make[3]: Nothing to be done for `check'.
make[3]: Leaving directory
`<http://river.suse.de/job/yast-installation-HEAD/ws/checkout/startup/hooks/preFirstCall'>
Making check in preFirstStage
make[3]: Entering directory
`<http://river.suse.de/job/yast-installation-HEAD/ws/checkout/startup/hooks/preFirstStage'>
make[3]: Nothing to be done for `check'.
make[3]: Leaving directory
`<http://river.suse.de/job/yast-installation-HEAD/ws/checkout/startup/hooks/preFirstStage'>
Making check in preSecondCall
make[3]: Entering directory
`<http://river.suse.de/job/yast-installation-HEAD/ws/checkout/startup/hooks/preSecondCall'>
make[3]: Nothing to be done for `check'.
make[3]: Leaving directory
`<http://river.suse.de/job/yast-installation-HEAD/ws/checkout/startup/hooks/preSecondCall'>
Making check in preSecondStage
make[3]: Entering directory
`<http://river.suse.de/job/yast-installation-HEAD/ws/checkout/startup/hooks/preSecondStage'>
make[3]: Nothing to be done for `check'.
make[3]: Leaving directory
`<http://river.suse.de/job/yast-installation-HEAD/ws/checkout/startup/hooks/preSecondStage'>
make[3]: Entering directory
`<http://river.suse.de/job/yast-installation-HEAD/ws/checkout/startup/hooks'>
make[3]: Nothing to be done for `check-am'.
make[3]: Leaving directory
`<http://river.suse.de/job/yast-installation-HEAD/ws/checkout/startup/hooks'>
make[2]: Leaving directory
`<http://river.suse.de/job/yast-installation-HEAD/ws/checkout/startup/hooks'>
make[2]: Entering directory
`<http://river.suse.de/job/yast-installation-HEAD/ws/checkout/startup'>
make[2]: Nothing to be done for `check-am'.
make[2]: Leaving directory
`<http://river.suse.de/job/yast-installation-HEAD/ws/checkout/startup'>
make[1]: Leaving directory
`<http://river.suse.de/job/yast-installation-HEAD/ws/checkout/startup'>
Making check in control
make[1]: Entering directory
`<http://river.suse.de/job/yast-installation-HEAD/ws/checkout/control'>
Making check in docs
make[2]: Entering directory
`<http://river.suse.de/job/yast-installation-HEAD/ws/checkout/control/docs'>
Making check in examples
make[3]: Entering directory
`<http://river.suse.de/job/yast-installation-HEAD/ws/checkout/control/docs/examples'>
make[3]: Nothing to be done for `check'.
make[3]: Leaving directory
`<http://river.suse.de/job/yast-installation-HEAD/ws/checkout/control/docs/examples'>
make[3]: Entering directory
`<http://river.suse.de/job/yast-installation-HEAD/ws/checkout/control/docs'>
make[3]: Nothing to be done for `check-am'.
make[3]: Leaving directory
`<http://river.suse.de/job/yast-installation-HEAD/ws/checkout/control/docs'>
make[2]: Leaving directory
`<http://river.suse.de/job/yast-installation-HEAD/ws/checkout/control/docs'>
Making check in tests
make[2]: Entering directory
`<http://river.suse.de/job/yast-installation-HEAD/ws/checkout/control/tests'>
make[2]: Nothing to be done for `check'.
make[2]: Leaving directory
`<http://river.suse.de/job/yast-installation-HEAD/ws/checkout/control/tests'>
Making check in examples
make[2]: Entering directory
`<http://river.suse.de/job/yast-installation-HEAD/ws/checkout/control/examples'>
make check-local
make[3]: Entering directory
`<http://river.suse.de/job/yast-installation-HEAD/ws/checkout/control/examples'>
xmllint --relaxng ../control.rng --noout control_default.xml add-on-2.xml
control_flex_part.xml custom.xml add-on-1.xml
control_default.xml validates
add-on-2.xml validates
control_flex_part.xml validates
custom.xml validates
add-on-1.xml validates
make[3]: Leaving directory
`<http://river.suse.de/job/yast-installation-HEAD/ws/checkout/control/examples'>
make[2]: Leaving directory
`<http://river.suse.de/job/yast-installation-HEAD/ws/checkout/control/examples'>
make[2]: Entering directory
`<http://river.suse.de/job/yast-installation-HEAD/ws/checkout/control'>
make check-local
make[3]: Entering directory
`<http://river.suse.de/job/yast-installation-HEAD/ws/checkout/control'>
trang -I rnc -O rng control.rnc control.rng
xmllint --relaxng control.rng --noout control.xml
control.xml validates
xmllint --relaxng control.rng --noout control.SLED.xml control.SLES.xml
control.openSUSE.xml add-on-template_installation.xml
control.SLED.xml validates
control.SLES.xml validates
control.openSUSE.xml validates
add-on-template_installation.xml validates
make[3]: Leaving directory
`<http://river.suse.de/job/yast-installation-HEAD/ws/checkout/control'>
make[2]: Leaving directory
`<http://river.suse.de/job/yast-installation-HEAD/ws/checkout/control'>
make[1]: Leaving directory
`<http://river.suse.de/job/yast-installation-HEAD/ws/checkout/control'>
Making check in testsuite
make[1]: Entering directory
`<http://river.suse.de/job/yast-installation-HEAD/ws/checkout/testsuite'>
make -f /usr/share/YaST2/data/testsuite/Makefile.testsuite
RPMNAME=yast2-installation srcdir=.
make[2]: Entering directory
`<http://river.suse.de/job/yast-installation-HEAD/ws/checkout/testsuite'>
make[2]: Nothing to be done for `all'.
make[2]: Leaving directory
`<http://river.suse.de/job/yast-installation-HEAD/ws/checkout/testsuite'>
make check-DEJAGNU check-local
make[2]: Entering directory
`<http://river.suse.de/job/yast-installation-HEAD/ws/checkout/testsuite'>
Making a new site.exp file ...
srcdir='.'; export srcdir; \
EXPECT=expect; export EXPECT; \
runtest=runtest; \
if /bin/sh -c "$runtest --version" > /dev/null 2>&1; then \
exit_status=0; l='yast2-installation'; for tool in $l; do \
if $runtest --tool $tool --srcdir $srcdir ; \
then :; else exit_status=1; fi; \
done; \
else echo "WARNING: could not find 'runtest'" 1>&2; :;\
fi; \
exit $exit_status
WARNING: Couldn't find tool init file
Test Run By root on Tue Jul 30 13:08:54 2013
Native configuration is x86_64-suse-linux-gnu

=== yast2-installation tests ===

Schedule of variations:
unix

Running target unix
Using /usr/share/dejagnu/baseboards/unix.exp as board description file for
target.
Using /usr/share/dejagnu/config/unix.exp as generic interface file for target.
Using ./config/unix.exp as tool-and-target-specific interface file.
Running ./yast2-installation.test/testsuite.exp ...
ERROR: tcl error sourcing ./yast2-installation.test/testsuite.exp.
ERROR: no files matched glob pattern "./tests/*.{ycp,rb}"
while executing
"glob "$srcdir/tests/$pattern.{ycp,rb}""
invoked from within
"lsort [glob "$srcdir/tests/$pattern.{ycp,rb}"]"
invoked from within
"set filenames [lsort [glob "$srcdir/tests/$pattern.{ycp,rb}"]]"
(file "./yast2-installation.test/testsuite.exp" line 18)
invoked from within
"source ./yast2-installation.test/testsuite.exp"
("uplevel" body line 1)
invoked from within
"uplevel #0 source ./yast2-installation.test/testsuite.exp"
invoked from within
"catch "uplevel #0 source $test_file_name""

=== yast2-installation Summary ===

make -f /usr/share/YaST2/data/testsuite/Makefile.testsuite
RPMNAME=yast2-installation srcdir=. check
make[3]: Entering directory
`<http://river.suse.de/job/yast-installation-HEAD/ws/checkout/testsuite'>

Parse YCP
NOT RUNNING

make[3]: Leaving directory
`<http://river.suse.de/job/yast-installation-HEAD/ws/checkout/testsuite'>
make[2]: Leaving directory
`<http://river.suse.de/job/yast-installation-HEAD/ws/checkout/testsuite'>
make[1]: Leaving directory
`<http://river.suse.de/job/yast-installation-HEAD/ws/checkout/testsuite'>
Making check in autoyast_desktop
make[1]: Entering directory
`<http://river.suse.de/job/yast-installation-HEAD/ws/checkout/autoyast_desktop'>
make[1]: Nothing to be done for `check'.
make[1]: Leaving directory
`<http://river.suse.de/job/yast-installation-HEAD/ws/checkout/autoyast_desktop'>
make[1]: Entering directory
`<http://river.suse.de/job/yast-installation-HEAD/ws/checkout'>
make[1]: Nothing to be done for `check-am'.
make[1]: Leaving directory
`<http://river.suse.de/job/yast-installation-HEAD/ws/checkout'>
+ make install
Making install in src
make[1]: Entering directory
`<http://river.suse.de/job/yast-installation-HEAD/ws/checkout/src'>
make[2]: Entering directory
`<http://river.suse.de/job/yast-installation-HEAD/ws/checkout/src'>
make[2]: Nothing to be done for `install-exec-am'.
/usr/bin/mkdir -p '/usr/share/YaST2/clients'
/usr/bin/install -c -p -m 644 clients/x11_finish.rb clients/inst_info.rb
clients/deploy_image_auto.rb clients/test_proposal.rb
clients/inst_worker_initial.rb clients/network_finish.rb
clients/inst_features.rb clients/inst_fallback_controlfile.rb
clients/disintegrate_all_extensions.rb clients/inst_prepare_image.rb
clients/installation_settings_finish.rb clients/deploying_proposal.rb
clients/driver_update2_finish.rb clients/inst_scenarios.rb
clients/kernel_finish.rb clients/inst_restore_settings.rb
clients/proxy_finish.rb clients/inst_system_analysis.rb
clients/pre_umount_finish.rb clients/ssh_service_finish.rb
clients/inst_license.rb clients/driver_update1_finish.rb
clients/copy_systemfiles_finish.rb clients/inst_welcome.rb
clients/inst_finish.rb clients/inst_network_check.rb
clients/inst_pre_install.rb clients/inst_automatic_configuration.rb
clients/inst_ask_online_update.rb clients/inst_new_desktop.rb
clients/inst_initialization.rb clients/inst_extrasources.rb
clients/switch_scr_finish.rb clients/inst_check_autoinst_mode.rb
clients/save_hw_status_finish.rb clients/umount_finish.rb
clients/inst_prepareprogress.rb clients/save_config_finish.rb
clients/stroj-casu.rb clients/test_inst_client.rb '/usr/share/YaST2/clients'
/usr/bin/install -c -p -m 644 clients/inst_worker_continue.rb
clients/inst_congratulate.rb clients/inst_doit.rb
clients/ssh_settings_finish.rb clients/inst_upgrade_urls.rb
clients/inst_network_setup.rb clients/copy_logs_finish.rb
clients/random_finish.rb clients/yast_inf_finish.rb
clients/inst_addon_update_sources.rb clients/desktop_finish.rb
clients/inst_proposal.rb clients/copy_files_finish.rb
clients/release_notes_popup.rb clients/inst_disks_activate.rb
clients/installation.rb clients/update_wizard_steps.rb
clients/inst_release_notes.rb clients/inst_rpmcopy_secondstage.rb
clients/inst_save_hardware_status.rb clients/inst_deploy_image.rb
clients/ldconfig_finish.rb clients/inst_complex_welcome.rb clients/inst_mode.rb
clients/inst_x11.rb '/usr/share/YaST2/clients'
/usr/bin/mkdir -p '/usr/share/applications/YaST2'
/usr/bin/install -c -p -m 644 desktop/release_notes.desktop
'/usr/share/applications/YaST2'
/usr/bin/mkdir -p '/var/adm/fillup-templates'
/usr/bin/install -c -p -m 644 fillup/sysconfig.security-checksig
'/var/adm/fillup-templates'
/usr/bin/mkdir -p '/usr/share/YaST2/modules'
/usr/bin/install -c -p -m 644 modules/X11Version.rb
modules/ImageInstallation.rb modules/InstData.rb modules/Vendor.rb
modules/SystemFilesCopy.rb '/usr/share/YaST2/modules'
/usr/bin/mkdir -p '/usr/share/YaST2/modules'
/usr/bin/install -c -p -m 644 modules/X11Version.rb
modules/ImageInstallation.rb modules/InstData.rb modules/Vendor.rb
modules/SystemFilesCopy.rb '/usr/share/YaST2/modules'
/usr/bin/mkdir -p '/usr/share/YaST2/schema/autoyast/rnc'
/usr/bin/install -c -p -m 644 autoyast-rnc/deploy_image.rnc
'/usr/share/YaST2/schema/autoyast/rnc'
/usr/bin/mkdir -p '/usr/share/YaST2/scrconf'
/usr/bin/install -c -p -m 644 scrconf/cfg_boot.scr
scrconf/cfg_windowmanager.scr scrconf/proc_modules.scr scrconf/cfg_fam.scr
scrconf/etc_install_inf_options.scr scrconf/etc_passwd.scr
scrconf/etc_install_inf_alias.scr scrconf/etc_install_inf.scr
scrconf/run_df.scr '/usr/share/YaST2/scrconf'
/usr/bin/mkdir -p '/usr/share/YaST2/include/installation'
/usr/bin/install -c -p -m 644 include/installation/inst_inc_second.rb
include/installation/scr_switch_debugger.rb
include/installation/inst_inc_first.rb include/installation/misc.rb
include/installation/inst_inc_all.rb '/usr/share/YaST2/include/installation'
make[2]: Leaving directory
`<http://river.suse.de/job/yast-installation-HEAD/ws/checkout/src'>
make[1]: Leaving directory
`<http://river.suse.de/job/yast-installation-HEAD/ws/checkout/src'>
Making install in agents
make[1]: Entering directory
`<http://river.suse.de/job/yast-installation-HEAD/ws/checkout/agents'>
make[2]: Entering directory
`<http://river.suse.de/job/yast-installation-HEAD/ws/checkout/agents'>
make[2]: Nothing to be done for `install-exec-am'.
make[2]: Nothing to be done for `install-data-am'.
make[2]: Leaving directory
`<http://river.suse.de/job/yast-installation-HEAD/ws/checkout/agents'>
make[1]: Leaving directory
`<http://river.suse.de/job/yast-installation-HEAD/ws/checkout/agents'>
Making install in doc
make[1]: Entering directory
`<http://river.suse.de/job/yast-installation-HEAD/ws/checkout/doc'>
Making install in autodocs
make[2]: Entering directory
`<http://river.suse.de/job/yast-installation-HEAD/ws/checkout/doc/autodocs'>
if [ -n "" ]; then /usr/lib/YaST2/bin/ycpdoc -d. -s./../../src ; fi
for i in ; do \
b=${i##./../../src}; b=${b#/}; b=${b//\//__}; b=${b%.pm}; \
pod2html --title=$b --infile=$i --outfile=$b.html; \
echo "<a href='$b.html'>${b/__/::}</a>" > $b.mod.html; \
done
if [ -n "./../../src/modules/SystemFilesCopy.rb ./../../src/modules/InstData.rb
./../../src/modules/Vendor.rb ./../../src/modules/X11Version.rb
./../../src/modules/ImageInstallation.rb
./../../src/include/installation/scr_switch_debugger.rb
./../../src/include/installation/inst_inc_second.rb
./../../src/include/installation/misc.rb
./../../src/include/installation/inst_inc_all.rb
./../../src/include/installation/inst_inc_first.rb" ]; then yard doc --title
"yast2-installation -- Development Documentation" -o . -m markdown
./../../src/modules/SystemFilesCopy.rb ./../../src/modules/InstData.rb
./../../src/modules/Vendor.rb ./../../src/modules/X11Version.rb
./../../src/modules/ImageInstallation.rb
./../../src/include/installation/scr_switch_debugger.rb
./../../src/include/installation/inst_inc_second.rb
./../../src/include/installation/misc.rb
./../../src/include/installation/inst_inc_all.rb
./../../src/include/installation/inst_inc_first.rb; fi
[error]: Missing 'redcarpet' gem for Markdown formatting. Install it with `gem
install redcarpet`
make[3]: Entering directory
`<http://river.suse.de/job/yast-installation-HEAD/ws/checkout/doc/autodocs'>
make[3]: Nothing to be done for `install-exec-am'.
if [ -n "" ]; then /usr/lib/YaST2/bin/ycpdoc -d. -s./../../src ; fi
for i in ; do \
b=${i##./../../src}; b=${b#/}; b=${b//\//__}; b=${b%.pm}; \
pod2html --title=$b --infile=$i --outfile=$b.html; \
echo "<a href='$b.html'>${b/__/::}</a>" > $b.mod.html; \
done
if [ -n "./../../src/modules/SystemFilesCopy.rb ./../../src/modules/InstData.rb
./../../src/modules/Vendor.rb ./../../src/modules/X11Version.rb
./../../src/modules/ImageInstallation.rb
./../../src/include/installation/scr_switch_debugger.rb
./../../src/include/installation/inst_inc_second.rb
./../../src/include/installation/misc.rb
./../../src/include/installation/inst_inc_all.rb
./../../src/include/installation/inst_inc_first.rb" ]; then yard doc --title
"yast2-installation -- Development Documentation" -o . -m markdown
./../../src/modules/SystemFilesCopy.rb ./../../src/modules/InstData.rb
./../../src/modules/Vendor.rb ./../../src/modules/X11Version.rb
./../../src/modules/ImageInstallation.rb
./../../src/include/installation/scr_switch_debugger.rb
./../../src/include/installation/inst_inc_second.rb
./../../src/include/installation/misc.rb
./../../src/include/installation/inst_inc_all.rb
./../../src/include/installation/inst_inc_first.rb; fi
[error]: Missing 'redcarpet' gem for Markdown formatting. Install it with `gem
install redcarpet`
/usr/bin/mkdir -p '/usr/share/doc/packages/yast2-installation//autodocs'
/usr/bin/install -c -p -m 644 ./index.html
'/usr/share/doc/packages/yast2-installation//autodocs/.'
/usr/bin/install: cannot stat ‘./index.html’: No such file or directory
make[3]: *** [install-nobase_htmlDATA] Error 1
make[3]: Leaving directory
`<http://river.suse.de/job/yast-installation-HEAD/ws/checkout/doc/autodocs'>
make[2]: *** [install-am] Error 2
make[2]: Leaving directory
`<http://river.suse.de/job/yast-installation-HEAD/ws/checkout/doc/autodocs'>
make[1]: *** [install-recursive] Error 1
make[1]: Leaving directory
`<http://river.suse.de/job/yast-installation-HEAD/ws/checkout/doc'>
make: *** [install-recursive] Error 1
++ error_exit 2
++ echo 'ERROR: detected exitcode 2'
ERROR: detected exitcode 2
++ cleanup
++ echo '==> Running cleanup'
==> Running cleanup
++ rm -f
<http://river.suse.de/job/yast-installation-HEAD/ws/ICECC/40c0ab7e54f59a1e4e493c1ea90a882a.tar.gz>
++ footer_and_exit 1
++ '[' -z 1 ']'
++ MYEXIT=1
++ '[' 1 == 0 ']'
++ ascii_failed
++ cat

( )
( ) (
) _ )
( \_
_(_\ \)__
(____\___))

build failed

++ exit 1
Build step 'Execute shell' marked build as failure
--
To unsubscribe, e-mail: yast-devel+unsubscribe@xxxxxxxxxxxx
To contact the owner, e-mail: yast-devel+owner@xxxxxxxxxxxx

< Previous Next >
This Thread
Follow Ups