Mailinglist Archive: yast-devel (251 mails)

< Previous Next >
[yast-devel] Build failed in Jenkins: yast-country-HEAD #132
  • From: hudson@xxxxxxx
  • Date: Tue, 30 Jul 2013 13:08:30 +0200 (CEST)
  • Message-id: <1891091031.68.1375182510475.JavaMail.jenkins@river>
See <http://river.suse.de/job/yast-country-HEAD/132/changes>

Changes:

[yast-devel] YCP Killer: Unify YaST module structure

[yast-devel] YCP Killer: Apply changes needed for Ruby translation

[yast-devel] YCP Killer: Translate YCP files into Ruby

[yast-devel] YCP Killer: Regenerate Makefile.am files in all source directories

------------------------------------------
[...truncated 286 lines...]
make[3]: Entering directory
`<http://river.suse.de/job/yast-country-HEAD/ws/checkout/timezone/testsuite'>
mkdir -p ./run ./config ./yast2-country.test ./tests
cp -f /usr/share/YaST2/data/testsuite/skel/default.exp config/default.exp
cp -f /usr/share/YaST2/data/testsuite/skel/unix.exp config/unix.exp
cp -f /usr/share/YaST2/data/testsuite/skel/unknown.exp config/unknown.exp
cp -f /usr/share/YaST2/data/testsuite/skel/testsuite.exp
yast2-country.test/testsuite.exp
cp -f /usr/share/YaST2/data/testsuite/skel/runtest.sh run/runtest.sh
chmod +x run/runtest.sh
make[3]: Leaving directory
`<http://river.suse.de/job/yast-country-HEAD/ws/checkout/timezone/testsuite'>
make[2]: Leaving directory
`<http://river.suse.de/job/yast-country-HEAD/ws/checkout/timezone/testsuite'>
make[2]: Entering directory
`<http://river.suse.de/job/yast-country-HEAD/ws/checkout/timezone'>
make[2]: Nothing to be done for `all-am'.
make[2]: Leaving directory
`<http://river.suse.de/job/yast-country-HEAD/ws/checkout/timezone'>
make[1]: Leaving directory
`<http://river.suse.de/job/yast-country-HEAD/ws/checkout/timezone'>
make[1]: Entering directory
`<http://river.suse.de/job/yast-country-HEAD/ws/checkout'>
make[1]: Nothing to be done for `all-am'.
make[1]: Leaving directory
`<http://river.suse.de/job/yast-country-HEAD/ws/checkout'>
+ make check
Making check in language
make[1]: Entering directory
`<http://river.suse.de/job/yast-country-HEAD/ws/checkout/language'>
Making check in doc
make[2]: Entering directory
`<http://river.suse.de/job/yast-country-HEAD/ws/checkout/language/doc'>
Making check in autodocs
make[3]: Entering directory
`<http://river.suse.de/job/yast-country-HEAD/ws/checkout/language/doc/autodocs'>
if [ -n "" ]; then /usr/lib/YaST2/bin/ycpdoc -d. -s./../../src ; fi
for i in ; do \
b=${i##./../../src}; b=${b#/}; b=${b//\//__}; b=${b%.pm}; \
pod2html --title=$b --infile=$i --outfile=$b.html; \
echo "<a href='$b.html'>${b/__/::}</a>" > $b.mod.html; \
done
if [ -n "./../../src/modules/Language.rb" ]; then yard doc --title
"yast2-country -- Development Documentation" -o . -m markdown
./../../src/modules/Language.rb; fi
[error]: Missing 'redcarpet' gem for Markdown formatting. Install it with `gem
install redcarpet`
make[3]: Leaving directory
`<http://river.suse.de/job/yast-country-HEAD/ws/checkout/language/doc/autodocs'>
make[3]: Entering directory
`<http://river.suse.de/job/yast-country-HEAD/ws/checkout/language/doc'>
make[3]: Nothing to be done for `check-am'.
make[3]: Leaving directory
`<http://river.suse.de/job/yast-country-HEAD/ws/checkout/language/doc'>
make[2]: Leaving directory
`<http://river.suse.de/job/yast-country-HEAD/ws/checkout/language/doc'>
Making check in src
make[2]: Entering directory
`<http://river.suse.de/job/yast-country-HEAD/ws/checkout/language/src'>
make[2]: Nothing to be done for `check'.
make[2]: Leaving directory
`<http://river.suse.de/job/yast-country-HEAD/ws/checkout/language/src'>
Making check in testsuite
make[2]: Entering directory
`<http://river.suse.de/job/yast-country-HEAD/ws/checkout/language/testsuite'>
make -f /usr/share/YaST2/data/testsuite/Makefile.testsuite
RPMNAME=yast2-country srcdir=.
make[3]: Entering directory
`<http://river.suse.de/job/yast-country-HEAD/ws/checkout/language/testsuite'>
make[3]: Nothing to be done for `all'.
make[3]: Leaving directory
`<http://river.suse.de/job/yast-country-HEAD/ws/checkout/language/testsuite'>
make check-DEJAGNU check-local
make[3]: Entering directory
`<http://river.suse.de/job/yast-country-HEAD/ws/checkout/language/testsuite'>
Making a new site.exp file ...
srcdir='.'; export srcdir; \
EXPECT=expect; export EXPECT; \
runtest=runtest; \
if /bin/sh -c "$runtest --version" > /dev/null 2>&1; then \
exit_status=0; l='yast2-country'; for tool in $l; do \
if $runtest --tool $tool --srcdir $srcdir ; \
then :; else exit_status=1; fi; \
done; \
else echo "WARNING: could not find 'runtest'" 1>&2; :;\
fi; \
exit $exit_status
WARNING: Couldn't find tool init file
Test Run By root on Tue Jul 30 13:08:28 2013
Native configuration is x86_64-suse-linux-gnu

=== yast2-country tests ===

Schedule of variations:
unix

Running target unix
Using /usr/share/dejagnu/baseboards/unix.exp as board description file for
target.
Using /usr/share/dejagnu/config/unix.exp as generic interface file for target.
Using ./config/unix.exp as tool-and-target-specific interface file.
Running ./yast2-country.test/testsuite.exp ...

Checking started

Running ImportExport ...
FAIL: Wrong stdout for ImportExport

The diff follows...

--- tests/ImportExport.out 2013-01-22 11:12:43.000000000 +0100
+++ tmp.out.ImportExport 2013-07-30 13:08:28.000000000 +0200
@@ -1,12 +1,3 @@
Read .target.dir "/usr/share/YaST2/data/languages" ["language_de_DE.ycp"]
Read .target.yast2 "languages/language_de_DE.ycp" $["de_DE":["Deutsch",
"Deutsch", ".UTF-8", "@euro", "German"]]
-Return $["language":"en_US", "languages":""]
-Return false
Execute .target.bash_output "/usr/bin/locale -a" $[]
-Return true
-Return true
-Return $["language":"de_DE", "languages":"de_DE"]
-Return <ul><li>Primary Language: German</li></ul>
-Return true
-Return $["language":"de_DE", "languages":"cs_CZ,de_DE"]
-Return <ul><li>Primary Language: German</li></ul>

FAIL: Wrong stdout for ImportExport
See the diff above.
Running IncompleteTranslation ...
FAIL: Wrong stdout for IncompleteTranslation

The diff follows...

--- tests/IncompleteTranslation.out 2013-01-22 11:12:43.000000000 +0100
+++ tmp.out.IncompleteTranslation 2013-07-30 13:08:29.000000000 +0200
@@ -1,8 +0,0 @@
-Read .target.size "/etc/sysconfig/language" 1
-Read .target.string "/usr/lib/YaST2/trans/en.status" ""
-Return false
-Read .target.string "/usr/lib/YaST2/trans/en_GB.status" "50"
-Return true
-Return true
-Read .target.string "/usr/lib/YaST2/trans/de_DE.status" "99"
-Return false

FAIL: Wrong stdout for IncompleteTranslation
See the diff above.
Running Language ...
FAIL: Wrong stdout for Language

The diff follows...

--- tests/Language.out 2013-01-22 11:12:43.000000000 +0100
+++ tmp.out.Language 2013-07-30 13:08:29.000000000 +0200
@@ -1,6 +0,0 @@
-Read .target.size "/etc/sysconfig/language" 1
-Dump GetLanguageCountry
-Return AT
-Return AT
-Return DE
-Return US

FAIL: Wrong stdout for Language
See the diff above.
Running MakeProposal ...
FAIL: Wrong stdout for MakeProposal

The diff follows...

--- tests/MakeProposal.out 2013-01-22 11:12:43.000000000 +0100
+++ tmp.out.MakeProposal 2013-07-30 13:08:29.000000000 +0200
@@ -1,5 +0,0 @@
-Read .target.size "/etc/sysconfig/language" 1
-Read .target.dir "/usr/share/YaST2/data/languages" ["language_de_DE.ycp"]
-Read .target.yast2 "languages/language_de_DE.ycp" $["de_DE":["Deutsch",
"Deutsch", ".UTF-8", "@euro", "German"]]
-Return ["Primary Language: English (US)", "Additional Languages: German"]
-Return ["Primary Language: English (US)"]

FAIL: Wrong stdout for MakeProposal
See the diff above.
Running ReadExport ...
FAIL: Wrong stdout for ReadExport

The diff follows...

--- tests/ReadExport.out 2013-01-22 11:12:43.000000000 +0100
+++ tmp.out.ReadExport 2013-07-30 13:08:29.000000000 +0200
@@ -1,7 +1,3 @@
Read .target.dir "/usr/share/YaST2/data/languages" ["language_de_DE.ycp"]
Read .target.yast2 "languages/language_de_DE.ycp" $["de_DE":["Deutsch",
"Deutsch", ".UTF-8", "@euro", "German"]]
Execute .target.bash_output "/usr/bin/locale -a" $[]
-Return true
-Return $["language":"de_DE", "languages":"en_US,de_DE"]
-Return <ul><li>Primary Language: German</li></ul>
-Return false

FAIL: Wrong stdout for ReadExport
See the diff above.
Running Save ...
FAIL: Wrong stdout for Save

The diff follows...

--- tests/Save.out 2013-01-22 11:12:43.000000000 +0100
+++ tmp.out.Save 2013-07-30 13:08:30.000000000 +0200
@@ -1,8 +0,0 @@
-Read .target.size "/etc/sysconfig/language" 1
-Read .target.dir "/usr/share/YaST2/data/languages" []
-Write .sysconfig.language.RC_LANG "en_US.UTF-8" true
-Read .sysconfig.language.RC_LC_MESSAGES ""
-Write .sysconfig.language.ROOT_USES_LANG "ctype" true
-Write .sysconfig.language.INSTALLED_LANGUAGES "en_US" true
-Write .sysconfig.language nil true
-Return nil

FAIL: Wrong stdout for Save
See the diff above.
Running Set ...
FAIL: Wrong stdout for Set

The diff follows...

--- tests/Set.out 2013-01-22 11:12:43.000000000 +0100
+++ tmp.out.Set 2013-07-30 13:08:30.000000000 +0200
@@ -1,9 +0,0 @@
-Read .target.size "/etc/sysconfig/language" 1
-Read .target.dir "/usr/share/YaST2/data/languages" ["language_de_DE.ycp"]
-Read .target.yast2 "languages/language_de_DE.ycp" $["de_DE":["Deutsch",
"Deutsch", ".UTF-8", "@euro", "German"]]
-Return en_US.UTF-8
-Execute .target.bash_output "/usr/bin/locale -a" $[]
-Return nil
-Return de_DE.UTF-8
-Return nil
-Return de_DE@euro

FAIL: Wrong stdout for Set
See the diff above.

Checking finished


=== yast2-country Summary ===

# of unexpected failures 14
make[3]: *** [check-DEJAGNU] Error 1
make[3]: Leaving directory
`<http://river.suse.de/job/yast-country-HEAD/ws/checkout/language/testsuite'>
make[2]: *** [check-am] Error 2
make[2]: Leaving directory
`<http://river.suse.de/job/yast-country-HEAD/ws/checkout/language/testsuite'>
make[1]: *** [check-recursive] Error 1
make[1]: Leaving directory
`<http://river.suse.de/job/yast-country-HEAD/ws/checkout/language'>
make: *** [check-recursive] Error 1
++ error_exit 2
++ echo 'ERROR: detected exitcode 2'
ERROR: detected exitcode 2
++ cleanup
++ echo '==> Running cleanup'
==> Running cleanup
++ rm -f
<http://river.suse.de/job/yast-country-HEAD/ws/ICECC/40c0ab7e54f59a1e4e493c1ea90a882a.tar.gz>
++ footer_and_exit 1
++ '[' -z 1 ']'
++ MYEXIT=1
++ '[' 1 == 0 ']'
++ ascii_failed
++ cat

( )
( ) (
) _ )
( \_
_(_\ \)__
(____\___))

build failed

++ exit 1
Build step 'Execute shell' marked build as failure
--
To unsubscribe, e-mail: yast-devel+unsubscribe@xxxxxxxxxxxx
To contact the owner, e-mail: yast-devel+owner@xxxxxxxxxxxx

< Previous Next >
This Thread
Follow Ups