Mailinglist Archive: yast-devel (251 mails)

< Previous Next >
[yast-devel] Build failed in Jenkins: yast-live-installer-HEAD #334
  • From: hudson@xxxxxxx
  • Date: Tue, 30 Jul 2013 13:04:23 +0200 (CEST)
  • Message-id: <50097278.56.1375182263706.JavaMail.jenkins@river>
See <http://river.suse.de/job/yast-live-installer-HEAD/334/changes>

Changes:

[yast-devel] YCP Killer: Unify YaST module structure

[yast-devel] YCP Killer: Apply changes needed for Ruby translation

[yast-devel] YCP Killer: Translate YCP files into Ruby

[yast-devel] YCP Killer: Regenerate Makefile.am files in all source directories

------------------------------------------
[...truncated 100 lines...]
++ export
RPMBUILDROOT=<http://river.suse.de/job/yast-live-installer-HEAD/ws/rpm/rpmbuildroot>
++
RPMBUILDROOT=<http://river.suse.de/job/yast-live-installer-HEAD/ws/rpm/rpmbuildroot>
++ rm -rf <http://river.suse.de/job/yast-live-installer-HEAD/ws/rpm/rpms>
++ rm -rf <http://river.suse.de/job/yast-live-installer-HEAD/ws/rpm/rpmbuild>
++ rm -rf
<http://river.suse.de/job/yast-live-installer-HEAD/ws/rpm/rpmbuildroot>
++ rm -rf <http://river.suse.de/job/yast-live-installer-HEAD/ws/.artifacts>
++ rm -rf <http://river.suse.de/job/yast-live-installer-HEAD/ws/OBS>
++ rm -rf
'<http://river.suse.de/job/yast-live-installer-HEAD/ws/copy-to-slave*.dir'>
++ [[ 1 == 1 ]]
++ echo 'Using autotools for building'
Using autotools for building
++ export
BUILDDIR=<http://river.suse.de/job/yast-live-installer-HEAD/ws/checkout>
++ BUILDDIR=<http://river.suse.de/job/yast-live-installer-HEAD/ws/checkout>
++ export
PACKAGEDIR=<http://river.suse.de/job/yast-live-installer-HEAD/ws/checkout/package>
++
PACKAGEDIR=<http://river.suse.de/job/yast-live-installer-HEAD/ws/checkout/package>
++ mkdir -p <http://river.suse.de/job/yast-live-installer-HEAD/ws/rpm>
++ mkdir -p <http://river.suse.de/job/yast-live-installer-HEAD/ws/rpm/rpms>
++ mkdir -p <http://river.suse.de/job/yast-live-installer-HEAD/ws/rpm/rpmbuild>
++ mkdir -p
<http://river.suse.de/job/yast-live-installer-HEAD/ws/rpm/rpmbuildroot>
++ mkdir -p <http://river.suse.de/job/yast-live-installer-HEAD/ws/.artifacts>
++ mkdir -p <http://river.suse.de/job/yast-live-installer-HEAD/ws/OBS>
++ cat
+ PACKAGENAME=yast-live-installer
+ PACKAGENAME=yast2-live-installer
+ cd <http://river.suse.de/job/yast-live-installer-HEAD/ws/checkout>
+ make -f Makefile.cvs
y2tool y2autoconf
y2autoconf: Generating toplevel configure.ac
y2tool y2automake
y2automake: Copying automakefiles for inclusion
y2automake: Generating toplevel Makefile.am
autoreconf --force --install
./configure --prefix=/usr --libdir=/usr/lib64
checking build system type... x86_64-suse-linux-gnu
checking host system type... x86_64-suse-linux-gnu
checking target system type... x86_64-suse-linux-gnu
checking for a BSD-compatible install... /usr/bin/install -c
checking whether build environment is sane... yes
checking for a thread-safe mkdir -p... /usr/bin/mkdir -p
checking for gawk... gawk
checking whether make sets $(MAKE)... yes
checking how to create a ustar tar archive... gnutar
checking whether ln -s works... yes
checking whether make sets $(MAKE)... (cached) yes
checking for xgettext... /usr/bin/xgettext
checking for ycpdoc... /usr/lib/YaST2/bin/ycpdoc
checking for ycpmakedep... /usr/lib/YaST2/bin/ycpmakedep
checking for ycpc... /usr/bin/ycpc
checking for /usr/share/YaST2/data/testsuite/Makefile.testsuite... yes
checking for expect... /usr/bin/expect
checking for runtest... /usr/bin/runtest
checking that generated files are newer than configure... done
configure: creating ./config.status
config.status: creating Makefile
config.status: creating agents/Makefile
config.status: creating doc/autodocs/Makefile
config.status: creating doc/Makefile
config.status: creating src/Makefile
config.status: creating testsuite/Makefile
+ make
Making all in agents
make[1]: Entering directory
`<http://river.suse.de/job/yast-live-installer-HEAD/ws/checkout/agents'>
make[1]: Nothing to be done for `all'.
make[1]: Leaving directory
`<http://river.suse.de/job/yast-live-installer-HEAD/ws/checkout/agents'>
Making all in doc
make[1]: Entering directory
`<http://river.suse.de/job/yast-live-installer-HEAD/ws/checkout/doc'>
Making all in autodocs
make[2]: Entering directory
`<http://river.suse.de/job/yast-live-installer-HEAD/ws/checkout/doc/autodocs'>
if [ -n "" ]; then /usr/lib/YaST2/bin/ycpdoc -d. -s./../../src ; fi
for i in ; do \
b=${i##./../../src}; b=${b#/}; b=${b//\//__}; b=${b%.pm}; \
pod2html --title=$b --infile=$i --outfile=$b.html; \
echo "<a href='$b.html'>${b/__/::}</a>" > $b.mod.html; \
done
if [ -n "./../../src/modules/LiveInstaller.rb" ]; then yard doc --title
"yast2-live-installer -- Development Documentation" -o . -m markdown
./../../src/modules/LiveInstaller.rb; fi
[error]: Missing 'redcarpet' gem for Markdown formatting. Install it with `gem
install redcarpet`
make[2]: Leaving directory
`<http://river.suse.de/job/yast-live-installer-HEAD/ws/checkout/doc/autodocs'>
make[2]: Entering directory
`<http://river.suse.de/job/yast-live-installer-HEAD/ws/checkout/doc'>
make[2]: Nothing to be done for `all-am'.
make[2]: Leaving directory
`<http://river.suse.de/job/yast-live-installer-HEAD/ws/checkout/doc'>
make[1]: Leaving directory
`<http://river.suse.de/job/yast-live-installer-HEAD/ws/checkout/doc'>
Making all in src
make[1]: Entering directory
`<http://river.suse.de/job/yast-live-installer-HEAD/ws/checkout/src'>
make[1]: Nothing to be done for `all'.
make[1]: Leaving directory
`<http://river.suse.de/job/yast-live-installer-HEAD/ws/checkout/src'>
Making all in testsuite
make[1]: Entering directory
`<http://river.suse.de/job/yast-live-installer-HEAD/ws/checkout/testsuite'>
make -f /usr/share/YaST2/data/testsuite/Makefile.testsuite
RPMNAME=yast2-live-installer srcdir=.
make[2]: Entering directory
`<http://river.suse.de/job/yast-live-installer-HEAD/ws/checkout/testsuite'>
mkdir -p ./run ./config ./yast2-live-installer.test ./tests
cp -f /usr/share/YaST2/data/testsuite/skel/default.exp config/default.exp
cp -f /usr/share/YaST2/data/testsuite/skel/unix.exp config/unix.exp
cp -f /usr/share/YaST2/data/testsuite/skel/unknown.exp config/unknown.exp
cp -f /usr/share/YaST2/data/testsuite/skel/testsuite.exp
yast2-live-installer.test/testsuite.exp
cp -f /usr/share/YaST2/data/testsuite/skel/runtest.sh run/runtest.sh
chmod +x run/runtest.sh
make[2]: Leaving directory
`<http://river.suse.de/job/yast-live-installer-HEAD/ws/checkout/testsuite'>
make[1]: Leaving directory
`<http://river.suse.de/job/yast-live-installer-HEAD/ws/checkout/testsuite'>
make[1]: Entering directory
`<http://river.suse.de/job/yast-live-installer-HEAD/ws/checkout'>
make[1]: Nothing to be done for `all-am'.
make[1]: Leaving directory
`<http://river.suse.de/job/yast-live-installer-HEAD/ws/checkout'>
+ make check
Making check in agents
make[1]: Entering directory
`<http://river.suse.de/job/yast-live-installer-HEAD/ws/checkout/agents'>
make[1]: Nothing to be done for `check'.
make[1]: Leaving directory
`<http://river.suse.de/job/yast-live-installer-HEAD/ws/checkout/agents'>
Making check in doc
make[1]: Entering directory
`<http://river.suse.de/job/yast-live-installer-HEAD/ws/checkout/doc'>
Making check in autodocs
make[2]: Entering directory
`<http://river.suse.de/job/yast-live-installer-HEAD/ws/checkout/doc/autodocs'>
if [ -n "" ]; then /usr/lib/YaST2/bin/ycpdoc -d. -s./../../src ; fi
for i in ; do \
b=${i##./../../src}; b=${b#/}; b=${b//\//__}; b=${b%.pm}; \
pod2html --title=$b --infile=$i --outfile=$b.html; \
echo "<a href='$b.html'>${b/__/::}</a>" > $b.mod.html; \
done
if [ -n "./../../src/modules/LiveInstaller.rb" ]; then yard doc --title
"yast2-live-installer -- Development Documentation" -o . -m markdown
./../../src/modules/LiveInstaller.rb; fi
[error]: Missing 'redcarpet' gem for Markdown formatting. Install it with `gem
install redcarpet`
make[2]: Leaving directory
`<http://river.suse.de/job/yast-live-installer-HEAD/ws/checkout/doc/autodocs'>
make[2]: Entering directory
`<http://river.suse.de/job/yast-live-installer-HEAD/ws/checkout/doc'>
make[2]: Nothing to be done for `check-am'.
make[2]: Leaving directory
`<http://river.suse.de/job/yast-live-installer-HEAD/ws/checkout/doc'>
make[1]: Leaving directory
`<http://river.suse.de/job/yast-live-installer-HEAD/ws/checkout/doc'>
Making check in src
make[1]: Entering directory
`<http://river.suse.de/job/yast-live-installer-HEAD/ws/checkout/src'>
make[1]: Nothing to be done for `check'.
make[1]: Leaving directory
`<http://river.suse.de/job/yast-live-installer-HEAD/ws/checkout/src'>
Making check in testsuite
make[1]: Entering directory
`<http://river.suse.de/job/yast-live-installer-HEAD/ws/checkout/testsuite'>
make -f /usr/share/YaST2/data/testsuite/Makefile.testsuite
RPMNAME=yast2-live-installer srcdir=.
make[2]: Entering directory
`<http://river.suse.de/job/yast-live-installer-HEAD/ws/checkout/testsuite'>
make[2]: Nothing to be done for `all'.
make[2]: Leaving directory
`<http://river.suse.de/job/yast-live-installer-HEAD/ws/checkout/testsuite'>
make check-DEJAGNU check-local
make[2]: Entering directory
`<http://river.suse.de/job/yast-live-installer-HEAD/ws/checkout/testsuite'>
Making a new site.exp file ...
srcdir='.'; export srcdir; \
EXPECT=expect; export EXPECT; \
runtest=runtest; \
if /bin/sh -c "$runtest --version" > /dev/null 2>&1; then \
exit_status=0; l='yast2-live-installer'; for tool in $l; do \
if $runtest --tool $tool --srcdir $srcdir ; \
then :; else exit_status=1; fi; \
done; \
else echo "WARNING: could not find 'runtest'" 1>&2; :;\
fi; \
exit $exit_status
WARNING: Couldn't find tool init file
Test Run By root on Tue Jul 30 13:04:22 2013
Native configuration is x86_64-suse-linux-gnu

=== yast2-live-installer tests ===

Schedule of variations:
unix

Running target unix
Using /usr/share/dejagnu/baseboards/unix.exp as board description file for
target.
Using /usr/share/dejagnu/config/unix.exp as generic interface file for target.
Using ./config/unix.exp as tool-and-target-specific interface file.
Running ./yast2-live-installer.test/testsuite.exp ...

Checking started

Running LiveInstaller ...

Checking finished


=== yast2-live-installer Summary ===

# of expected passes 1
make -f /usr/share/YaST2/data/testsuite/Makefile.testsuite
RPMNAME=yast2-live-installer srcdir=. check
make[3]: Entering directory
`<http://river.suse.de/job/yast-live-installer-HEAD/ws/checkout/testsuite'>

Parse YCP
NOT RUNNING

make[3]: Leaving directory
`<http://river.suse.de/job/yast-live-installer-HEAD/ws/checkout/testsuite'>
make[2]: Leaving directory
`<http://river.suse.de/job/yast-live-installer-HEAD/ws/checkout/testsuite'>
make[1]: Leaving directory
`<http://river.suse.de/job/yast-live-installer-HEAD/ws/checkout/testsuite'>
make[1]: Entering directory
`<http://river.suse.de/job/yast-live-installer-HEAD/ws/checkout'>
make[1]: Nothing to be done for `check-am'.
make[1]: Leaving directory
`<http://river.suse.de/job/yast-live-installer-HEAD/ws/checkout'>
+ make install
Making install in agents
make[1]: Entering directory
`<http://river.suse.de/job/yast-live-installer-HEAD/ws/checkout/agents'>
make[2]: Entering directory
`<http://river.suse.de/job/yast-live-installer-HEAD/ws/checkout/agents'>
make[2]: Nothing to be done for `install-exec-am'.
make[2]: Nothing to be done for `install-data-am'.
make[2]: Leaving directory
`<http://river.suse.de/job/yast-live-installer-HEAD/ws/checkout/agents'>
make[1]: Leaving directory
`<http://river.suse.de/job/yast-live-installer-HEAD/ws/checkout/agents'>
Making install in doc
make[1]: Entering directory
`<http://river.suse.de/job/yast-live-installer-HEAD/ws/checkout/doc'>
Making install in autodocs
make[2]: Entering directory
`<http://river.suse.de/job/yast-live-installer-HEAD/ws/checkout/doc/autodocs'>
if [ -n "" ]; then /usr/lib/YaST2/bin/ycpdoc -d. -s./../../src ; fi
for i in ; do \
b=${i##./../../src}; b=${b#/}; b=${b//\//__}; b=${b%.pm}; \
pod2html --title=$b --infile=$i --outfile=$b.html; \
echo "<a href='$b.html'>${b/__/::}</a>" > $b.mod.html; \
done
if [ -n "./../../src/modules/LiveInstaller.rb" ]; then yard doc --title
"yast2-live-installer -- Development Documentation" -o . -m markdown
./../../src/modules/LiveInstaller.rb; fi
[error]: Missing 'redcarpet' gem for Markdown formatting. Install it with `gem
install redcarpet`
make[3]: Entering directory
`<http://river.suse.de/job/yast-live-installer-HEAD/ws/checkout/doc/autodocs'>
make[3]: Nothing to be done for `install-exec-am'.
if [ -n "" ]; then /usr/lib/YaST2/bin/ycpdoc -d. -s./../../src ; fi
for i in ; do \
b=${i##./../../src}; b=${b#/}; b=${b//\//__}; b=${b%.pm}; \
pod2html --title=$b --infile=$i --outfile=$b.html; \
echo "<a href='$b.html'>${b/__/::}</a>" > $b.mod.html; \
done
if [ -n "./../../src/modules/LiveInstaller.rb" ]; then yard doc --title
"yast2-live-installer -- Development Documentation" -o . -m markdown
./../../src/modules/LiveInstaller.rb; fi
[error]: Missing 'redcarpet' gem for Markdown formatting. Install it with `gem
install redcarpet`
/usr/bin/mkdir -p '/usr/share/doc/packages/yast2-live-installer//autodocs'
/usr/bin/install -c -p -m 644 ./index.html
'/usr/share/doc/packages/yast2-live-installer//autodocs/.'
/usr/bin/install: cannot stat ‘./index.html’: No such file or directory
make[3]: *** [install-nobase_htmlDATA] Error 1
make[3]: Leaving directory
`<http://river.suse.de/job/yast-live-installer-HEAD/ws/checkout/doc/autodocs'>
make[2]: *** [install-am] Error 2
make[2]: Leaving directory
`<http://river.suse.de/job/yast-live-installer-HEAD/ws/checkout/doc/autodocs'>
make[1]: *** [install-recursive] Error 1
make[1]: Leaving directory
`<http://river.suse.de/job/yast-live-installer-HEAD/ws/checkout/doc'>
make: *** [install-recursive] Error 1
++ error_exit 2
++ echo 'ERROR: detected exitcode 2'
ERROR: detected exitcode 2
++ cleanup
++ echo '==> Running cleanup'
==> Running cleanup
++ rm -f
<http://river.suse.de/job/yast-live-installer-HEAD/ws/ICECC/40c0ab7e54f59a1e4e493c1ea90a882a.tar.gz>
++ footer_and_exit 1
++ '[' -z 1 ']'
++ MYEXIT=1
++ '[' 1 == 0 ']'
++ ascii_failed
++ cat

( )
( ) (
) _ )
( \_
_(_\ \)__
(____\___))

build failed

++ exit 1
Build step 'Execute shell' marked build as failure
--
To unsubscribe, e-mail: yast-devel+unsubscribe@xxxxxxxxxxxx
To contact the owner, e-mail: yast-devel+owner@xxxxxxxxxxxx

< Previous Next >
This Thread
Follow Ups