Mailinglist Archive: yast-devel (251 mails)

< Previous Next >
[yast-devel] Build failed in Jenkins: yast-kdump-HEAD #226
  • From: hudson@xxxxxxx
  • Date: Tue, 30 Jul 2013 13:04:05 +0200 (CEST)
  • Message-id: <1843971098.55.1375182245480.JavaMail.jenkins@river>
See <http://river.suse.de/job/yast-kdump-HEAD/226/changes>

Changes:

[yast-devel] YCP Killer: Unify YaST module structure

[yast-devel] YCP Killer: Apply changes needed for Ruby translation

[yast-devel] YCP Killer: Translate YCP files into Ruby

[yast-devel] YCP Killer: Regenerate Makefile.am files in all source directories

------------------------------------------
[...truncated 209 lines...]
make[2]: Entering directory
`<http://river.suse.de/job/yast-kdump-HEAD/ws/checkout/doc/autodocs'>
if [ -n "" ]; then /usr/lib/YaST2/bin/ycpdoc -d. -s./../../src ; fi
for i in ; do \
b=${i##./../../src}; b=${b#/}; b=${b//\//__}; b=${b%.pm}; \
pod2html --title=$b --infile=$i --outfile=$b.html; \
echo "<a href='$b.html'>${b/__/::}</a>" > $b.mod.html; \
done
if [ -n "./../../src/modules/Kdump.rb ./../../src/include/kdump/uifunctions.rb
./../../src/include/kdump/dialogs.rb ./../../src/include/kdump/complex.rb
./../../src/include/kdump/helps.rb ./../../src/include/kdump/wizards.rb" ];
then yard doc --title "yast2-kdump -- Development Documentation" -o . -m
markdown ./../../src/modules/Kdump.rb ./../../src/include/kdump/uifunctions.rb
./../../src/include/kdump/dialogs.rb ./../../src/include/kdump/complex.rb
./../../src/include/kdump/helps.rb ./../../src/include/kdump/wizards.rb; fi
[error]: Missing 'redcarpet' gem for Markdown formatting. Install it with `gem
install redcarpet`
make[2]: Leaving directory
`<http://river.suse.de/job/yast-kdump-HEAD/ws/checkout/doc/autodocs'>
make[2]: Entering directory
`<http://river.suse.de/job/yast-kdump-HEAD/ws/checkout/doc'>
make[2]: Nothing to be done for `check-am'.
make[2]: Leaving directory
`<http://river.suse.de/job/yast-kdump-HEAD/ws/checkout/doc'>
make[1]: Leaving directory
`<http://river.suse.de/job/yast-kdump-HEAD/ws/checkout/doc'>
Making check in src
make[1]: Entering directory
`<http://river.suse.de/job/yast-kdump-HEAD/ws/checkout/src'>
make[1]: Nothing to be done for `check'.
make[1]: Leaving directory
`<http://river.suse.de/job/yast-kdump-HEAD/ws/checkout/src'>
Making check in testsuite
make[1]: Entering directory
`<http://river.suse.de/job/yast-kdump-HEAD/ws/checkout/testsuite'>
make -f /usr/share/YaST2/data/testsuite/Makefile.testsuite RPMNAME=yast2-kdump
srcdir=.
make[2]: Entering directory
`<http://river.suse.de/job/yast-kdump-HEAD/ws/checkout/testsuite'>
make[2]: Nothing to be done for `all'.
make[2]: Leaving directory
`<http://river.suse.de/job/yast-kdump-HEAD/ws/checkout/testsuite'>
make check-DEJAGNU check-local
make[2]: Entering directory
`<http://river.suse.de/job/yast-kdump-HEAD/ws/checkout/testsuite'>
Making a new site.exp file ...
srcdir='.'; export srcdir; \
EXPECT=expect; export EXPECT; \
runtest=runtest; \
if /bin/sh -c "$runtest --version" > /dev/null 2>&1; then \
exit_status=0; l='yast2-kdump'; for tool in $l; do \
if $runtest --tool $tool --srcdir $srcdir ; \
then :; else exit_status=1; fi; \
done; \
else echo "WARNING: could not find 'runtest'" 1>&2; :;\
fi; \
exit $exit_status
WARNING: Couldn't find tool init file
Test Run By root on Tue Jul 30 13:04:02 2013
Native configuration is x86_64-suse-linux-gnu

=== yast2-kdump tests ===

Schedule of variations:
unix

Running target unix
Using /usr/share/dejagnu/baseboards/unix.exp as board description file for
target.
Using /usr/share/dejagnu/config/unix.exp as generic interface file for target.
Using ./config/unix.exp as tool-and-target-specific interface file.
Running ./yast2-kdump.test/testsuite.exp ...

Checking started

Running Kdump ...

Checking finished


=== yast2-kdump Summary ===

# of expected passes 1
make -f /usr/share/YaST2/data/testsuite/Makefile.testsuite RPMNAME=yast2-kdump
srcdir=. check
make[3]: Entering directory
`<http://river.suse.de/job/yast-kdump-HEAD/ws/checkout/testsuite'>

Parse YCP
NOT RUNNING

make[3]: Leaving directory
`<http://river.suse.de/job/yast-kdump-HEAD/ws/checkout/testsuite'>
make[2]: Leaving directory
`<http://river.suse.de/job/yast-kdump-HEAD/ws/checkout/testsuite'>
make[1]: Leaving directory
`<http://river.suse.de/job/yast-kdump-HEAD/ws/checkout/testsuite'>
make[1]: Entering directory
`<http://river.suse.de/job/yast-kdump-HEAD/ws/checkout'>
make[1]: Nothing to be done for `check-am'.
make[1]: Leaving directory
`<http://river.suse.de/job/yast-kdump-HEAD/ws/checkout'>
+ make clean
Making clean in testsuite
make[1]: Entering directory
`<http://river.suse.de/job/yast-kdump-HEAD/ws/checkout/testsuite'>
make -f /usr/share/YaST2/data/testsuite/Makefile.testsuite RPMNAME=yast2-kdump
srcdir=. clean
make[2]: Entering directory
`<http://river.suse.de/job/yast-kdump-HEAD/ws/checkout/testsuite'>
rm -rf ./run ./config ./yast2-kdump.test
rm -f tmp.err.* tmp.out.* site.exp *.log *.sum site.bak
make[2]: Leaving directory
`<http://river.suse.de/job/yast-kdump-HEAD/ws/checkout/testsuite'>
make[1]: Leaving directory
`<http://river.suse.de/job/yast-kdump-HEAD/ws/checkout/testsuite'>
Making clean in src
make[1]: Entering directory
`<http://river.suse.de/job/yast-kdump-HEAD/ws/checkout/src'>
test -z "" || rm -f
make[1]: Leaving directory
`<http://river.suse.de/job/yast-kdump-HEAD/ws/checkout/src'>
Making clean in doc
make[1]: Entering directory
`<http://river.suse.de/job/yast-kdump-HEAD/ws/checkout/doc'>
Making clean in autodocs
make[2]: Entering directory
`<http://river.suse.de/job/yast-kdump-HEAD/ws/checkout/doc/autodocs'>
test -z "index.html uifunctions.html Kdump.mod.html dialogs.html
kdump_proposal.html complex.html helps.html kdump_auto.html kdump.html
wizards.html intro.html files.html kdump_finish.html Kdump.html
pod2htm*.tmp" || rm -f index.html uifunctions.html Kdump.mod.html dialogs.html
kdump_proposal.html complex.html helps.html kdump_auto.html kdump.html
wizards.html intro.html files.html kdump_finish.html Kdump.html pod2htm*.tmp
rm -rf js css Yast .yardoc
make[2]: Leaving directory
`<http://river.suse.de/job/yast-kdump-HEAD/ws/checkout/doc/autodocs'>
Making clean in .
make[2]: Entering directory
`<http://river.suse.de/job/yast-kdump-HEAD/ws/checkout/doc'>
make[2]: Nothing to be done for `clean-am'.
make[2]: Leaving directory
`<http://river.suse.de/job/yast-kdump-HEAD/ws/checkout/doc'>
make[1]: Leaving directory
`<http://river.suse.de/job/yast-kdump-HEAD/ws/checkout/doc'>
Making clean in config
make[1]: Entering directory
`<http://river.suse.de/job/yast-kdump-HEAD/ws/checkout/config'>
make[1]: Nothing to be done for `clean'.
make[1]: Leaving directory
`<http://river.suse.de/job/yast-kdump-HEAD/ws/checkout/config'>
Making clean in agents
make[1]: Entering directory
`<http://river.suse.de/job/yast-kdump-HEAD/ws/checkout/agents'>
make[1]: Nothing to be done for `clean'.
make[1]: Leaving directory
`<http://river.suse.de/job/yast-kdump-HEAD/ws/checkout/agents'>
Making clean in .
make[1]: Entering directory
`<http://river.suse.de/job/yast-kdump-HEAD/ws/checkout'>
test -z "" || rm -f
make[1]: Leaving directory
`<http://river.suse.de/job/yast-kdump-HEAD/ws/checkout'>
+ make package-local
Not running parseycp.
test ! -f ./po/Makefile || make -C po checkpo
if test -d "yast2-kdump-2.21.1"; then find "yast2-kdump-2.21.1" -type d ! -perm
-200 -exec chmod u+w {} ';' && rm -rf "yast2-kdump-2.21.1" || { sleep 5 && rm
-rf "yast2-kdump-2.21.1"; }; else :; fi
test -d "yast2-kdump-2.21.1" || mkdir "yast2-kdump-2.21.1"
(cd agents && make top_distdir=../yast2-kdump-2.21.1
distdir=../yast2-kdump-2.21.1/agents \
am__remove_distdir=: am__skip_length_check=: am__skip_mode_fix=: distdir)
make[1]: Entering directory
`<http://river.suse.de/job/yast-kdump-HEAD/ws/checkout/agents'>
make[1]: Leaving directory
`<http://river.suse.de/job/yast-kdump-HEAD/ws/checkout/agents'>
(cd config && make top_distdir=../yast2-kdump-2.21.1
distdir=../yast2-kdump-2.21.1/config \
am__remove_distdir=: am__skip_length_check=: am__skip_mode_fix=: distdir)
make[1]: Entering directory
`<http://river.suse.de/job/yast-kdump-HEAD/ws/checkout/config'>
make[1]: Leaving directory
`<http://river.suse.de/job/yast-kdump-HEAD/ws/checkout/config'>
(cd doc && make top_distdir=../yast2-kdump-2.21.1
distdir=../yast2-kdump-2.21.1/doc \
am__remove_distdir=: am__skip_length_check=: am__skip_mode_fix=: distdir)
make[1]: Entering directory
`<http://river.suse.de/job/yast-kdump-HEAD/ws/checkout/doc'>
(cd autodocs && make top_distdir=../../yast2-kdump-2.21.1
distdir=../../yast2-kdump-2.21.1/doc/autodocs \
am__remove_distdir=: am__skip_length_check=: am__skip_mode_fix=: distdir)
make[2]: Entering directory
`<http://river.suse.de/job/yast-kdump-HEAD/ws/checkout/doc/autodocs'>
make[2]: Leaving directory
`<http://river.suse.de/job/yast-kdump-HEAD/ws/checkout/doc/autodocs'>
make[1]: Leaving directory
`<http://river.suse.de/job/yast-kdump-HEAD/ws/checkout/doc'>
(cd src && make top_distdir=../yast2-kdump-2.21.1
distdir=../yast2-kdump-2.21.1/src \
am__remove_distdir=: am__skip_length_check=: am__skip_mode_fix=: distdir)
make[1]: Entering directory
`<http://river.suse.de/job/yast-kdump-HEAD/ws/checkout/src'>
make \
top_distdir="../yast2-kdump-2.21.1" distdir="../yast2-kdump-2.21.1/src" \
dist-hook
make[2]: Entering directory
`<http://river.suse.de/job/yast-kdump-HEAD/ws/checkout/src'>
make[2]: Leaving directory
`<http://river.suse.de/job/yast-kdump-HEAD/ws/checkout/src'>
make[1]: Leaving directory
`<http://river.suse.de/job/yast-kdump-HEAD/ws/checkout/src'>
(cd testsuite && make top_distdir=../yast2-kdump-2.21.1
distdir=../yast2-kdump-2.21.1/testsuite \
am__remove_distdir=: am__skip_length_check=: am__skip_mode_fix=: distdir)
make[1]: Entering directory
`<http://river.suse.de/job/yast-kdump-HEAD/ws/checkout/testsuite'>
make[1]: Leaving directory
`<http://river.suse.de/job/yast-kdump-HEAD/ws/checkout/testsuite'>
make \
top_distdir="yast2-kdump-2.21.1" distdir="yast2-kdump-2.21.1" \
dist-hook
make[1]: Entering directory
`<http://river.suse.de/job/yast-kdump-HEAD/ws/checkout'>
cp /usr/share/YaST2/data/devtools/admin/copyright/gpl/README yast2-kdump-2.21.1
cp /usr/share/YaST2/data/devtools/admin/copyright/gpl/COPYING yast2-kdump-2.21.1
make[1]: Leaving directory
`<http://river.suse.de/job/yast-kdump-HEAD/ws/checkout'>
test -n "" \
|| find "yast2-kdump-2.21.1" -type d ! -perm -755 \
-exec chmod u+rwx,go+rx {} \; -o \
! -type d ! -perm -444 -links 1 -exec chmod a+r {} \; -o \
! -type d ! -perm -400 -exec chmod a+r {} \; -o \
! -type d ! -perm -444 -exec /bin/sh
<http://river.suse.de/job/yast-kdump-HEAD/ws/checkout/install-sh> -c -m a+r {}
{} \; \
|| chmod -R a+r "yast2-kdump-2.21.1"
tardir=yast2-kdump-2.21.1 && tar --format=ustar -chf - "$tardir" |
BZIP2=${BZIP2--9} bzip2 -c >yast2-kdump-2.21.1.tar.bz2
if test -d "yast2-kdump-2.21.1"; then find "yast2-kdump-2.21.1" -type d ! -perm
-200 -exec chmod u+w {} ';' && rm -rf "yast2-kdump-2.21.1" || { sleep 5 && rm
-rf "yast2-kdump-2.21.1"; }; else :; fi
rm -f package/yast2-kdump-*.tar.bz2
rm -f package/*~
rm -f package/*.bak
rm -f package/*.auto
mv yast2-kdump-2.21.1.tar.bz2 package/
if ! test -x /usr/bin/y2tool; then \
echo "/usr/bin/y2tool: not found."; \
echo "You have to install yast2-devtools to making a package"; \
false; \
fi
here=`pwd`; \
cd . && for i in yast2-kdump*.spec.in; do \
newname="`echo "$i" | sed "s/\.in$//g"`"; \
/usr/bin/y2tool create-spec < $i > $here/package/${newname} ; \
done
+ make install
Making install in agents
make[1]: Entering directory
`<http://river.suse.de/job/yast-kdump-HEAD/ws/checkout/agents'>
make[2]: Entering directory
`<http://river.suse.de/job/yast-kdump-HEAD/ws/checkout/agents'>
make[2]: Nothing to be done for `install-exec-am'.
make[2]: Nothing to be done for `install-data-am'.
make[2]: Leaving directory
`<http://river.suse.de/job/yast-kdump-HEAD/ws/checkout/agents'>
make[1]: Leaving directory
`<http://river.suse.de/job/yast-kdump-HEAD/ws/checkout/agents'>
Making install in config
make[1]: Entering directory
`<http://river.suse.de/job/yast-kdump-HEAD/ws/checkout/config'>
make[2]: Entering directory
`<http://river.suse.de/job/yast-kdump-HEAD/ws/checkout/config'>
make[2]: Nothing to be done for `install-exec-am'.
make[2]: Nothing to be done for `install-data-am'.
make[2]: Leaving directory
`<http://river.suse.de/job/yast-kdump-HEAD/ws/checkout/config'>
make[1]: Leaving directory
`<http://river.suse.de/job/yast-kdump-HEAD/ws/checkout/config'>
Making install in doc
make[1]: Entering directory
`<http://river.suse.de/job/yast-kdump-HEAD/ws/checkout/doc'>
Making install in autodocs
make[2]: Entering directory
`<http://river.suse.de/job/yast-kdump-HEAD/ws/checkout/doc/autodocs'>
if [ -n "" ]; then /usr/lib/YaST2/bin/ycpdoc -d. -s./../../src ; fi
for i in ; do \
b=${i##./../../src}; b=${b#/}; b=${b//\//__}; b=${b%.pm}; \
pod2html --title=$b --infile=$i --outfile=$b.html; \
echo "<a href='$b.html'>${b/__/::}</a>" > $b.mod.html; \
done
if [ -n "./../../src/modules/Kdump.rb ./../../src/include/kdump/uifunctions.rb
./../../src/include/kdump/dialogs.rb ./../../src/include/kdump/complex.rb
./../../src/include/kdump/helps.rb ./../../src/include/kdump/wizards.rb" ];
then yard doc --title "yast2-kdump -- Development Documentation" -o . -m
markdown ./../../src/modules/Kdump.rb ./../../src/include/kdump/uifunctions.rb
./../../src/include/kdump/dialogs.rb ./../../src/include/kdump/complex.rb
./../../src/include/kdump/helps.rb ./../../src/include/kdump/wizards.rb; fi
[error]: Missing 'redcarpet' gem for Markdown formatting. Install it with `gem
install redcarpet`
make[3]: Entering directory
`<http://river.suse.de/job/yast-kdump-HEAD/ws/checkout/doc/autodocs'>
make[3]: Nothing to be done for `install-exec-am'.
if [ -n "" ]; then /usr/lib/YaST2/bin/ycpdoc -d. -s./../../src ; fi
for i in ; do \
b=${i##./../../src}; b=${b#/}; b=${b//\//__}; b=${b%.pm}; \
pod2html --title=$b --infile=$i --outfile=$b.html; \
echo "<a href='$b.html'>${b/__/::}</a>" > $b.mod.html; \
done
if [ -n "./../../src/modules/Kdump.rb ./../../src/include/kdump/uifunctions.rb
./../../src/include/kdump/dialogs.rb ./../../src/include/kdump/complex.rb
./../../src/include/kdump/helps.rb ./../../src/include/kdump/wizards.rb" ];
then yard doc --title "yast2-kdump -- Development Documentation" -o . -m
markdown ./../../src/modules/Kdump.rb ./../../src/include/kdump/uifunctions.rb
./../../src/include/kdump/dialogs.rb ./../../src/include/kdump/complex.rb
./../../src/include/kdump/helps.rb ./../../src/include/kdump/wizards.rb; fi
[error]: Missing 'redcarpet' gem for Markdown formatting. Install it with `gem
install redcarpet`
/usr/bin/mkdir -p '/usr/share/doc/packages/yast2-kdump//autodocs'
/usr/bin/install -c -p -m 644 ./index.html
'/usr/share/doc/packages/yast2-kdump//autodocs/.'
/usr/bin/install: cannot stat ‘./index.html’: No such file or directory
make[3]: *** [install-nobase_htmlDATA] Error 1
make[3]: Leaving directory
`<http://river.suse.de/job/yast-kdump-HEAD/ws/checkout/doc/autodocs'>
make[2]: *** [install-am] Error 2
make[2]: Leaving directory
`<http://river.suse.de/job/yast-kdump-HEAD/ws/checkout/doc/autodocs'>
make[1]: *** [install-recursive] Error 1
make[1]: Leaving directory
`<http://river.suse.de/job/yast-kdump-HEAD/ws/checkout/doc'>
make: *** [install-recursive] Error 1
++ error_exit 2
++ echo 'ERROR: detected exitcode 2'
ERROR: detected exitcode 2
++ cleanup
++ echo '==> Running cleanup'
==> Running cleanup
++ rm -f
<http://river.suse.de/job/yast-kdump-HEAD/ws/ICECC/40c0ab7e54f59a1e4e493c1ea90a882a.tar.gz>
++ footer_and_exit 1
++ '[' -z 1 ']'
++ MYEXIT=1
++ '[' 1 == 0 ']'
++ ascii_failed
++ cat

( )
( ) (
) _ )
( \_
_(_\ \)__
(____\___))

build failed

++ exit 1
Build step 'Execute shell' marked build as failure
--
To unsubscribe, e-mail: yast-devel+unsubscribe@xxxxxxxxxxxx
To contact the owner, e-mail: yast-devel+owner@xxxxxxxxxxxx

< Previous Next >
This Thread
Follow Ups