Mailinglist Archive: yast-commit (1173 mails)

< Previous Next >
[yast-commit] Build failed in Jenkins: yast-core-werror-clang-master #22
  • From: admin@xxxxxxxxxxxx
  • Date: Wed, 22 Aug 2018 14:44:15 +0000 (UTC)
  • Message-id: <251041665.11.1534949055665.JavaMail.jenkins@ci-opensuse>
See
<http://ci.opensuse.org/job/yast-core-werror-clang-master/22/display/redirect?page=changes>

Changes:

[schubi] Switched license in spec file from SPDX2 to SPDX3 format.

------------------------------------------
[...truncated 1.17 MB...]
[ 66s] config.status: creating agent-system/doc/Makefile
[ 66s] config.status: creating agent-system/src/Makefile
[ 66s] config.status: creating agent-system/testsuite/config/Makefile
[ 66s] config.status: creating agent-system/testsuite/lib/Makefile
[ 66s] config.status: creating agent-system/testsuite/ag_system.test/Makefile
[ 66s] config.status: creating agent-system/testsuite/tests/Makefile
[ 66s] config.status: creating agent-system/testsuite/Makefile
[ 66s] config.status: creating agent-system/Makefile
[ 66s] config.status: creating agent-any/src/Makefile
[ 66s] config.status: creating agent-any/doc/Makefile
[ 66s] config.status: creating agent-any/testsuite/config/Makefile
[ 66s] config.status: creating agent-any/testsuite/lib/Makefile
[ 66s] config.status: creating agent-any/testsuite/ag_anyagent.test/Makefile
[ 66s] config.status: creating agent-any/testsuite/tests/Makefile
[ 67s] config.status: creating agent-any/testsuite/Makefile
[ 67s] config.status: creating agent-any/Makefile
[ 67s] config.status: creating agent-ini/conf/Makefile
[ 67s] config.status: creating agent-ini/src/Makefile
[ 67s] config.status: creating agent-ini/doc/Makefile
[ 67s] config.status: creating agent-ini/testsuite/config/Makefile
[ 67s] config.status: creating agent-ini/testsuite/lib/Makefile
[ 67s] config.status: creating agent-ini/testsuite/ag_ini.test/Makefile
[ 67s] config.status: creating agent-ini/testsuite/tests/Makefile
[ 67s] config.status: creating agent-ini/testsuite/ag_ini.debug/Makefile
[ 67s] config.status: creating agent-ini/testsuite/debug/Makefile
[ 67s] config.status: creating agent-ini/testsuite/ag_ini.multi/Makefile
[ 67s] config.status: creating agent-ini/testsuite/multi/Makefile
[ 67s] config.status: creating agent-ini/testsuite/Makefile
[ 67s] config.status: creating agent-ini/Makefile
[ 67s] config.status: creating agent-modules/conf/Makefile
[ 67s] config.status: creating agent-modules/doc/Makefile
[ 67s] config.status: creating agent-modules/src/Makefile
[ 67s] config.status: creating agent-modules/testsuite/config/Makefile
[ 67s] config.status: creating agent-modules/testsuite/lib/Makefile
[ 67s] config.status: creating
agent-modules/testsuite/ag_modules.test/Makefile
[ 67s] config.status: creating agent-modules/testsuite/tests/Makefile
[ 67s] config.status: creating agent-modules/testsuite/Makefile
[ 67s] config.status: creating agent-modules/Makefile
[ 67s] config.status: creating agent-resolver/conf/Makefile
[ 67s] config.status: creating agent-resolver/doc/Makefile
[ 67s] config.status: creating agent-resolver/src/Makefile
[ 67s] config.status: creating agent-resolver/testsuite/config/Makefile
[ 67s] config.status: creating agent-resolver/testsuite/lib/Makefile
[ 67s] config.status: creating
agent-resolver/testsuite/ag_resolver.test/Makefile
[ 67s] config.status: creating agent-resolver/testsuite/tests/Makefile
[ 67s] config.status: creating agent-resolver/testsuite/Makefile
[ 67s] config.status: creating agent-resolver/Makefile
[ 67s] config.status: creating agents-non-y2/conf/Makefile
[ 67s] config.status: creating agents-non-y2/Makefile
[ 68s] config.status: creating agents-perl/conf/Makefile
[ 68s] config.status: creating agents-perl/lib/Makefile
[ 68s] config.status: creating agents-perl/doc/Makefile
[ 68s] config.status: creating agents-perl/testsuite/Makefile
[ 68s] config.status: creating agents-perl/Makefile
[ 68s] config.status: creating wfm/src/Makefile
[ 68s] config.status: creating wfm/doc/Makefile
[ 68s] config.status: creating wfm/testsuite/config/Makefile
[ 68s] config.status: creating wfm/testsuite/lib/Makefile
[ 68s] config.status: creating wfm/testsuite/wfm.test/Makefile
[ 68s] config.status: creating wfm/testsuite/tests/Makefile
[ 68s] config.status: creating wfm/testsuite/Makefile
[ 68s] config.status: creating wfm/Makefile
[ 68s] config.status: creating agent-process/conf/Makefile
[ 68s] config.status: creating agent-process/doc/autodocs/Makefile
[ 68s] config.status: creating agent-process/doc/Makefile
[ 68s] config.status: creating agent-process/src/Makefile
[ 68s] config.status: creating agent-process/testsuite/config/Makefile
[ 68s] config.status: creating agent-process/testsuite/lib/Makefile
[ 68s] config.status: creating
agent-process/testsuite/ag_process.test/Makefile
[ 68s] config.status: creating agent-process/testsuite/tests/Makefile
[ 68s] config.status: creating agent-process/testsuite/Makefile
[ 68s] config.status: creating agent-process/Makefile
[ 68s] config.status: creating base/src/Makefile
[ 68s] config.status: creating base/tools/startshell/Makefile
[ 68s] config.status: creating base/tools/autorun/Makefile
[ 68s] config.status: creating base/tools/elf-arch/Makefile
[ 68s] config.status: creating base/tools/ycpc/Makefile
[ 68s] config.status: creating base/tools/devtools/Makefile
[ 68s] config.status: creating base/tools/tty_wrapper/Makefile
[ 68s] config.status: creating base/tools/Makefile
[ 68s] config.status: creating base/testsuite/Makefile
[ 68s] config.status: creating base/Makefile
[ 68s] config.status: creating config.h
[ 68s] config.status: executing depfiles commands
[ 68s] config.status: executing libtool commands
[ 68s] + /usr/bin/make -O -j2
[ 68s] /usr/bin/make all-recursive
[ 69s] Making all in liby2util-r
[ 69s] Making all in src
[ 69s] Making all in include
[ 69s] Making all in y2util
[ 69s] make[5]: Nothing to be done for 'all'.
[ 69s] make[5]: Nothing to be done for 'all-am'.
[ 70s] make[4]: Entering directory
'/home/abuild/rpmbuild/BUILD/yast2-core-4.0.3/liby2util-r/src'
[ 70s] /bin/sh ../../libtool --tag=CXX --mode=compile clang++
-DHAVE_CONFIG_H -I. -I../.. -I./include -DY2LOG=\"liby2util\" -D_GNU_SOURCE
-DLOCALEDIR=\"/usr/share/YaST2/locale\" -DNDEBUG -fmessage-length=0 -O2
-Wall -D_FORTIFY_SOURCE=2 -fstack-protector-strong -funwind-tables
-fasynchronous-unwind-tables -fstack-clash-protection -Werror -std=gnu++0x
-Wall -Wformat=2 -Wno-format-nonliteral -c -o ExternalDataSource.lo
ExternalDataSource.cc
[ 70s] libtool: compile: clang++ -DHAVE_CONFIG_H -I. -I../.. -I./include
-DY2LOG=\"liby2util\" -D_GNU_SOURCE -DLOCALEDIR=\"/usr/share/YaST2/locale\"
-DNDEBUG -fmessage-length=0 -O2 -Wall -D_FORTIFY_SOURCE=2
-fstack-protector-strong -funwind-tables -fasynchronous-unwind-tables
-fstack-clash-protection -Werror -std=gnu++0x -Wall -Wformat=2
-Wno-format-nonliteral -c ExternalDataSource.cc -fPIC -DPIC -o
.libs/ExternalDataSource.o
[ 70s] make[4]: Leaving directory
'/home/abuild/rpmbuild/BUILD/yast2-core-4.0.3/liby2util-r/src'
[ 70s] make[4]: Entering directory
'/home/abuild/rpmbuild/BUILD/yast2-core-4.0.3/liby2util-r/src'
[ 70s] /bin/sh ../../libtool --tag=CXX --mode=compile clang++
-DHAVE_CONFIG_H -I. -I../.. -I./include -DY2LOG=\"liby2util\" -D_GNU_SOURCE
-DLOCALEDIR=\"/usr/share/YaST2/locale\" -DNDEBUG -fmessage-length=0 -O2
-Wall -D_FORTIFY_SOURCE=2 -fstack-protector-strong -funwind-tables
-fasynchronous-unwind-tables -fstack-clash-protection -Werror -std=gnu++0x
-Wall -Wformat=2 -Wno-format-nonliteral -c -o ExternalProgram.lo
ExternalProgram.cc
[ 70s] libtool: compile: clang++ -DHAVE_CONFIG_H -I. -I../.. -I./include
-DY2LOG=\"liby2util\" -D_GNU_SOURCE -DLOCALEDIR=\"/usr/share/YaST2/locale\"
-DNDEBUG -fmessage-length=0 -O2 -Wall -D_FORTIFY_SOURCE=2
-fstack-protector-strong -funwind-tables -fasynchronous-unwind-tables
-fstack-clash-protection -Werror -std=gnu++0x -Wall -Wformat=2
-Wno-format-nonliteral -c ExternalProgram.cc -fPIC -DPIC -o
.libs/ExternalProgram.o
[ 70s] make[4]: Leaving directory
'/home/abuild/rpmbuild/BUILD/yast2-core-4.0.3/liby2util-r/src'
[ 71s] make[4]: Entering directory
'/home/abuild/rpmbuild/BUILD/yast2-core-4.0.3/liby2util-r/src'
[ 71s] /bin/sh ../../libtool --tag=CXX --mode=compile clang++
-DHAVE_CONFIG_H -I. -I../.. -I./include -DY2LOG=\"liby2util\" -D_GNU_SOURCE
-DLOCALEDIR=\"/usr/share/YaST2/locale\" -DNDEBUG -fmessage-length=0 -O2
-Wall -D_FORTIFY_SOURCE=2 -fstack-protector-strong -funwind-tables
-fasynchronous-unwind-tables -fstack-clash-protection -Werror -std=gnu++0x
-Wall -Wformat=2 -Wno-format-nonliteral -c -o MemUsage.lo MemUsage.cc
[ 71s] libtool: compile: clang++ -DHAVE_CONFIG_H -I. -I../.. -I./include
-DY2LOG=\"liby2util\" -D_GNU_SOURCE -DLOCALEDIR=\"/usr/share/YaST2/locale\"
-DNDEBUG -fmessage-length=0 -O2 -Wall -D_FORTIFY_SOURCE=2
-fstack-protector-strong -funwind-tables -fasynchronous-unwind-tables
-fstack-clash-protection -Werror -std=gnu++0x -Wall -Wformat=2
-Wno-format-nonliteral -c MemUsage.cc -fPIC -DPIC -o .libs/MemUsage.o
[ 71s] make[4]: Leaving directory
'/home/abuild/rpmbuild/BUILD/yast2-core-4.0.3/liby2util-r/src'
[ 72s] make[4]: Entering directory
'/home/abuild/rpmbuild/BUILD/yast2-core-4.0.3/liby2util-r/src'
[ 72s] /bin/sh ../../libtool --tag=CXX --mode=compile clang++
-DHAVE_CONFIG_H -I. -I../.. -I./include -DY2LOG=\"liby2util\" -D_GNU_SOURCE
-DLOCALEDIR=\"/usr/share/YaST2/locale\" -DNDEBUG -fmessage-length=0 -O2
-Wall -D_FORTIFY_SOURCE=2 -fstack-protector-strong -funwind-tables
-fasynchronous-unwind-tables -fstack-clash-protection -Werror -std=gnu++0x
-Wall -Wformat=2 -Wno-format-nonliteral -c -o Pathname.lo Pathname.cc
[ 72s] libtool: compile: clang++ -DHAVE_CONFIG_H -I. -I../.. -I./include
-DY2LOG=\"liby2util\" -D_GNU_SOURCE -DLOCALEDIR=\"/usr/share/YaST2/locale\"
-DNDEBUG -fmessage-length=0 -O2 -Wall -D_FORTIFY_SOURCE=2
-fstack-protector-strong -funwind-tables -fasynchronous-unwind-tables
-fstack-clash-protection -Werror -std=gnu++0x -Wall -Wformat=2
-Wno-format-nonliteral -c Pathname.cc -fPIC -DPIC -o .libs/Pathname.o
[ 72s] make[4]: Leaving directory
'/home/abuild/rpmbuild/BUILD/yast2-core-4.0.3/liby2util-r/src'
[ 72s] make[4]: Entering directory
'/home/abuild/rpmbuild/BUILD/yast2-core-4.0.3/liby2util-r/src'
[ 72s] /bin/sh ../../libtool --tag=CXX --mode=compile clang++
-DHAVE_CONFIG_H -I. -I../.. -I./include -DY2LOG=\"liby2util\" -D_GNU_SOURCE
-DLOCALEDIR=\"/usr/share/YaST2/locale\" -DNDEBUG -fmessage-length=0 -O2
-Wall -D_FORTIFY_SOURCE=2 -fstack-protector-strong -funwind-tables
-fasynchronous-unwind-tables -fstack-clash-protection -Werror -std=gnu++0x
-Wall -Wformat=2 -Wno-format-nonliteral -c -o PathInfo.lo PathInfo.cc
[ 72s] libtool: compile: clang++ -DHAVE_CONFIG_H -I. -I../.. -I./include
-DY2LOG=\"liby2util\" -D_GNU_SOURCE -DLOCALEDIR=\"/usr/share/YaST2/locale\"
-DNDEBUG -fmessage-length=0 -O2 -Wall -D_FORTIFY_SOURCE=2
-fstack-protector-strong -funwind-tables -fasynchronous-unwind-tables
-fstack-clash-protection -Werror -std=gnu++0x -Wall -Wformat=2
-Wno-format-nonliteral -c PathInfo.cc -fPIC -DPIC -o .libs/PathInfo.o
[ 72s] make[4]: Leaving directory
'/home/abuild/rpmbuild/BUILD/yast2-core-4.0.3/liby2util-r/src'
[ 73s] make[4]: Entering directory
'/home/abuild/rpmbuild/BUILD/yast2-core-4.0.3/liby2util-r/src'
[ 73s] /bin/sh ../../libtool --tag=CXX --mode=compile clang++
-DHAVE_CONFIG_H -I. -I../.. -I./include -DY2LOG=\"liby2util\" -D_GNU_SOURCE
-DLOCALEDIR=\"/usr/share/YaST2/locale\" -DNDEBUG -fmessage-length=0 -O2
-Wall -D_FORTIFY_SOURCE=2 -fstack-protector-strong -funwind-tables
-fasynchronous-unwind-tables -fstack-clash-protection -Werror -std=gnu++0x
-Wall -Wformat=2 -Wno-format-nonliteral -c -o Rep.lo Rep.cc
[ 73s] libtool: compile: clang++ -DHAVE_CONFIG_H -I. -I../.. -I./include
-DY2LOG=\"liby2util\" -D_GNU_SOURCE -DLOCALEDIR=\"/usr/share/YaST2/locale\"
-DNDEBUG -fmessage-length=0 -O2 -Wall -D_FORTIFY_SOURCE=2
-fstack-protector-strong -funwind-tables -fasynchronous-unwind-tables
-fstack-clash-protection -Werror -std=gnu++0x -Wall -Wformat=2
-Wno-format-nonliteral -c Rep.cc -fPIC -DPIC -o .libs/Rep.o
[ 73s] make[4]: Leaving directory
'/home/abuild/rpmbuild/BUILD/yast2-core-4.0.3/liby2util-r/src'
[ 73s] make[4]: Entering directory
'/home/abuild/rpmbuild/BUILD/yast2-core-4.0.3/liby2util-r/src'
[ 73s] /bin/sh ../../libtool --tag=CXX --mode=compile clang++
-DHAVE_CONFIG_H -I. -I../.. -I./include -DY2LOG=\"liby2util\" -D_GNU_SOURCE
-DLOCALEDIR=\"/usr/share/YaST2/locale\" -DNDEBUG -fmessage-length=0 -O2
-Wall -D_FORTIFY_SOURCE=2 -fstack-protector-strong -funwind-tables
-fasynchronous-unwind-tables -fstack-clash-protection -Werror -std=gnu++0x
-Wall -Wformat=2 -Wno-format-nonliteral -c -o Y2SLog.lo Y2SLog.cc
[ 73s] libtool: compile: clang++ -DHAVE_CONFIG_H -I. -I../.. -I./include
-DY2LOG=\"liby2util\" -D_GNU_SOURCE -DLOCALEDIR=\"/usr/share/YaST2/locale\"
-DNDEBUG -fmessage-length=0 -O2 -Wall -D_FORTIFY_SOURCE=2
-fstack-protector-strong -funwind-tables -fasynchronous-unwind-tables
-fstack-clash-protection -Werror -std=gnu++0x -Wall -Wformat=2
-Wno-format-nonliteral -c Y2SLog.cc -fPIC -DPIC -o .libs/Y2SLog.o
[ 73s] make[4]: Leaving directory
'/home/abuild/rpmbuild/BUILD/yast2-core-4.0.3/liby2util-r/src'
[ 74s] make[4]: Entering directory
'/home/abuild/rpmbuild/BUILD/yast2-core-4.0.3/liby2util-r/src'
[ 74s] /bin/sh ../../libtool --tag=CXX --mode=compile clang++
-DHAVE_CONFIG_H -I. -I../.. -I./include -DY2LOG=\"liby2util\" -D_GNU_SOURCE
-DLOCALEDIR=\"/usr/share/YaST2/locale\" -DNDEBUG -fmessage-length=0 -O2
-Wall -D_FORTIFY_SOURCE=2 -fstack-protector-strong -funwind-tables
-fasynchronous-unwind-tables -fstack-clash-protection -Werror -std=gnu++0x
-Wall -Wformat=2 -Wno-format-nonliteral -c -o miniini.lo miniini.cc
[ 74s] libtool: compile: clang++ -DHAVE_CONFIG_H -I. -I../.. -I./include
-DY2LOG=\"liby2util\" -D_GNU_SOURCE -DLOCALEDIR=\"/usr/share/YaST2/locale\"
-DNDEBUG -fmessage-length=0 -O2 -Wall -D_FORTIFY_SOURCE=2
-fstack-protector-strong -funwind-tables -fasynchronous-unwind-tables
-fstack-clash-protection -Werror -std=gnu++0x -Wall -Wformat=2
-Wno-format-nonliteral -c miniini.cc -fPIC -DPIC -o .libs/miniini.o
[ 74s] make[4]: Leaving directory
'/home/abuild/rpmbuild/BUILD/yast2-core-4.0.3/liby2util-r/src'
[ 75s] make[4]: Entering directory
'/home/abuild/rpmbuild/BUILD/yast2-core-4.0.3/liby2util-r/src'
[ 75s] /bin/sh ../../libtool --tag=CXX --mode=compile clang++
-DHAVE_CONFIG_H -I. -I../.. -I./include -DY2LOG=\"liby2util\" -D_GNU_SOURCE
-DLOCALEDIR=\"/usr/share/YaST2/locale\" -DNDEBUG -fmessage-length=0 -O2
-Wall -D_FORTIFY_SOURCE=2 -fstack-protector-strong -funwind-tables
-fasynchronous-unwind-tables -fstack-clash-protection -Werror -std=gnu++0x
-Wall -Wformat=2 -Wno-format-nonliteral -c -o stringutil.lo stringutil.cc
[ 75s] libtool: compile: clang++ -DHAVE_CONFIG_H -I. -I../.. -I./include
-DY2LOG=\"liby2util\" -D_GNU_SOURCE -DLOCALEDIR=\"/usr/share/YaST2/locale\"
-DNDEBUG -fmessage-length=0 -O2 -Wall -D_FORTIFY_SOURCE=2
-fstack-protector-strong -funwind-tables -fasynchronous-unwind-tables
-fstack-clash-protection -Werror -std=gnu++0x -Wall -Wformat=2
-Wno-format-nonliteral -c stringutil.cc -fPIC -DPIC -o .libs/stringutil.o
[ 75s] make[4]: Leaving directory
'/home/abuild/rpmbuild/BUILD/yast2-core-4.0.3/liby2util-r/src'
[ 76s] make[4]: Entering directory
'/home/abuild/rpmbuild/BUILD/yast2-core-4.0.3/liby2util-r/src'
[ 76s] /bin/sh ../../libtool --tag=CXX --mode=compile clang++
-DHAVE_CONFIG_H -I. -I../.. -I./include -DY2LOG=\"liby2util\" -D_GNU_SOURCE
-DLOCALEDIR=\"/usr/share/YaST2/locale\" -DNDEBUG -fmessage-length=0 -O2
-Wall -D_FORTIFY_SOURCE=2 -fstack-protector-strong -funwind-tables
-fasynchronous-unwind-tables -fstack-clash-protection -Werror -std=gnu++0x
-Wall -Wformat=2 -Wno-format-nonliteral -c -o y2changes.lo y2changes.cc
[ 76s] libtool: compile: clang++ -DHAVE_CONFIG_H -I. -I../.. -I./include
-DY2LOG=\"liby2util\" -D_GNU_SOURCE -DLOCALEDIR=\"/usr/share/YaST2/locale\"
-DNDEBUG -fmessage-length=0 -O2 -Wall -D_FORTIFY_SOURCE=2
-fstack-protector-strong -funwind-tables -fasynchronous-unwind-tables
-fstack-clash-protection -Werror -std=gnu++0x -Wall -Wformat=2
-Wno-format-nonliteral -c y2changes.cc -fPIC -DPIC -o .libs/y2changes.o
[ 76s] make[4]: Leaving directory
'/home/abuild/rpmbuild/BUILD/yast2-core-4.0.3/liby2util-r/src'
[ 76s] make[4]: Entering directory
'/home/abuild/rpmbuild/BUILD/yast2-core-4.0.3/liby2util-r/src'
[ 76s] /bin/sh ../../libtool --tag=CXX --mode=compile clang++
-DHAVE_CONFIG_H -I. -I../.. -I./include -DY2LOG=\"liby2util\" -D_GNU_SOURCE
-DLOCALEDIR=\"/usr/share/YaST2/locale\" -DNDEBUG -fmessage-length=0 -O2
-Wall -D_FORTIFY_SOURCE=2 -fstack-protector-strong -funwind-tables
-fasynchronous-unwind-tables -fstack-clash-protection -Werror -std=gnu++0x
-Wall -Wformat=2 -Wno-format-nonliteral -c -o y2log.lo y2log.cc
[ 76s] libtool: compile: clang++ -DHAVE_CONFIG_H -I. -I../.. -I./include
-DY2LOG=\"liby2util\" -D_GNU_SOURCE -DLOCALEDIR=\"/usr/share/YaST2/locale\"
-DNDEBUG -fmessage-length=0 -O2 -Wall -D_FORTIFY_SOURCE=2
-fstack-protector-strong -funwind-tables -fasynchronous-unwind-tables
-fstack-clash-protection -Werror -std=gnu++0x -Wall -Wformat=2
-Wno-format-nonliteral -c y2log.cc -fPIC -DPIC -o .libs/y2log.o
[ 76s] make[4]: Leaving directory
'/home/abuild/rpmbuild/BUILD/yast2-core-4.0.3/liby2util-r/src'
[ 77s] make[4]: Entering directory
'/home/abuild/rpmbuild/BUILD/yast2-core-4.0.3/liby2util-r/src'
[ 77s] /bin/sh ../../libtool --tag=CXX --mode=compile clang++
-DHAVE_CONFIG_H -I. -I../.. -I./include -DY2LOG=\"liby2util\" -D_GNU_SOURCE
-DLOCALEDIR=\"/usr/share/YaST2/locale\" -DNDEBUG -fmessage-length=0 -O2
-Wall -D_FORTIFY_SOURCE=2 -fstack-protector-strong -funwind-tables
-fasynchronous-unwind-tables -fstack-clash-protection -Werror -std=gnu++0x
-Wall -Wformat=2 -Wno-format-nonliteral -c -o Process.lo Process.cc
[ 77s] libtool: compile: clang++ -DHAVE_CONFIG_H -I. -I../.. -I./include
-DY2LOG=\"liby2util\" -D_GNU_SOURCE -DLOCALEDIR=\"/usr/share/YaST2/locale\"
-DNDEBUG -fmessage-length=0 -O2 -Wall -D_FORTIFY_SOURCE=2
-fstack-protector-strong -funwind-tables -fasynchronous-unwind-tables
-fstack-clash-protection -Werror -std=gnu++0x -Wall -Wformat=2
-Wno-format-nonliteral -c Process.cc -fPIC -DPIC -o .libs/Process.o
[ 77s] make[4]: Leaving directory
'/home/abuild/rpmbuild/BUILD/yast2-core-4.0.3/liby2util-r/src'
[ 77s] make[4]: Entering directory
'/home/abuild/rpmbuild/BUILD/yast2-core-4.0.3/liby2util-r/src'
[ 77s] /bin/sh ../../libtool --tag=CXX --mode=link clang++ -DNDEBUG
-fmessage-length=0 -O2 -Wall -D_FORTIFY_SOURCE=2 -fstack-protector-strong
-funwind-tables -fasynchronous-unwind-tables -fstack-clash-protection -Werror
-std=gnu++0x -Wall -Wformat=2 -Wno-format-nonliteral -version-info 5:0:0 -o
liby2util.la -rpath /usr/lib64 ExternalDataSource.lo ExternalProgram.lo
MemUsage.lo PathInfo.lo Pathname.lo Rep.lo Y2SLog.lo miniini.lo stringutil.lo
y2log.lo y2changes.lo Process.lo -lutil
[ 77s] libtool: link: clang++ -fPIC -DPIC -shared -nostdlib
/usr/bin/../lib64/gcc/x86_64-suse-linux/8/../../../../lib64/crti.o
/usr/bin/../lib64/gcc/x86_64-suse-linux/8/crtbeginS.o
.libs/ExternalDataSource.o .libs/ExternalProgram.o .libs/MemUsage.o
.libs/PathInfo.o .libs/Pathname.o .libs/Rep.o .libs/Y2SLog.o .libs/miniini.o
.libs/stringutil.o .libs/y2log.o .libs/y2changes.o .libs/Process.o -lutil
-L/usr/bin/../lib64/gcc/x86_64-suse-linux/8
-L/usr/bin/../lib64/gcc/x86_64-suse-linux/8/../../../../lib64
-L/usr/bin/../lib64 -L/lib/../lib64 -L/usr/lib/../lib64
-L/usr/bin/../lib64/gcc/x86_64-suse-linux/8/../../../../x86_64-suse-linux/lib
-L/usr/bin/../lib64/gcc/x86_64-suse-linux/8/../../.. -L/usr/bin/../lib -L/lib
-L/usr/lib -lstdc++ -lm -lc -lgcc_s
/usr/bin/../lib64/gcc/x86_64-suse-linux/8/crtendS.o
/usr/bin/../lib64/gcc/x86_64-suse-linux/8/../../../../lib64/crtn.o -O2
-fstack-protector-strong -Wl,-soname -Wl,liby2util.so.5 -o
.libs/liby2util.so.5.0.0
[ 77s] libtool: link: (cd ".libs" && rm -f "liby2util.so.5" && ln -s
"liby2util.so.5.0.0" "liby2util.so.5")
[ 77s] libtool: link: (cd ".libs" && rm -f "liby2util.so" && ln -s
"liby2util.so.5.0.0" "liby2util.so")
[ 77s] libtool: link: ( cd ".libs" && rm -f "liby2util.la" && ln -s
"../liby2util.la" "liby2util.la" )
[ 77s] make[4]: Leaving directory
'/home/abuild/rpmbuild/BUILD/yast2-core-4.0.3/liby2util-r/src'
[ 77s] Making all in testsuite
[ 77s] Making all in lib
[ 77s] make[4]: Nothing to be done for 'all'.
[ 77s] Making all in config
[ 77s] make[4]: Nothing to be done for 'all'.
[ 77s] Making all in liby2util.test
[ 77s] make[4]: Nothing to be done for 'all'.
[ 77s] Making all in tests
[ 77s] make[4]: Nothing to be done for 'all'.
[ 78s] make[4]: Entering directory
'/home/abuild/rpmbuild/BUILD/yast2-core-4.0.3/liby2util-r/testsuite'
[ 78s] clang++ -DHAVE_CONFIG_H -I. -I../.. -I./../src/include
-DY2LOG=\"liby2util-testsuite\" -DNDEBUG -fmessage-length=0 -O2 -Wall
-D_FORTIFY_SOURCE=2 -fstack-protector-strong -funwind-tables
-fasynchronous-unwind-tables -fstack-clash-protection -Werror -std=gnu++0x
-Wall -Wformat=2 -Wno-format-nonliteral -c -o test_thread_log.o
test_thread_log.cc
[ 78s] make[4]: Leaving directory
'/home/abuild/rpmbuild/BUILD/yast2-core-4.0.3/liby2util-r/testsuite'
[ 78s] make[4]: Entering directory
'/home/abuild/rpmbuild/BUILD/yast2-core-4.0.3/liby2util-r/testsuite'
[ 78s] clang++ -DHAVE_CONFIG_H -I. -I../.. -I./../src/include
-DY2LOG=\"liby2util-testsuite\" -DNDEBUG -fmessage-length=0 -O2 -Wall
-D_FORTIFY_SOURCE=2 -fstack-protector-strong -funwind-tables
-fasynchronous-unwind-tables -fstack-clash-protection -Werror -std=gnu++0x
-Wall -Wformat=2 -Wno-format-nonliteral -c -o test_Y2SLog.o test_Y2SLog.cc
[ 78s] make[4]: Leaving directory
'/home/abuild/rpmbuild/BUILD/yast2-core-4.0.3/liby2util-r/testsuite'
[ 79s] make[4]: Entering directory
'/home/abuild/rpmbuild/BUILD/yast2-core-4.0.3/liby2util-r/testsuite'
[ 79s] clang++ -DHAVE_CONFIG_H -I. -I../.. -I./../src/include
-DY2LOG=\"liby2util-testsuite\" -DNDEBUG -fmessage-length=0 -O2 -Wall
-D_FORTIFY_SOURCE=2 -fstack-protector-strong -funwind-tables
-fasynchronous-unwind-tables -fstack-clash-protection -Werror -std=gnu++0x
-Wall -Wformat=2 -Wno-format-nonliteral -c -o test_mkdir.o test_mkdir.cc
[ 79s] make[4]: Leaving directory
'/home/abuild/rpmbuild/BUILD/yast2-core-4.0.3/liby2util-r/testsuite'
[ 79s] make[4]: Entering directory
'/home/abuild/rpmbuild/BUILD/yast2-core-4.0.3/liby2util-r/testsuite'
[ 79s] clang++ -DHAVE_CONFIG_H -I. -I../.. -I./../src/include
-DY2LOG=\"liby2util-testsuite\" -DNDEBUG -fmessage-length=0 -O2 -Wall
-D_FORTIFY_SOURCE=2 -fstack-protector-strong -funwind-tables
-fasynchronous-unwind-tables -fstack-clash-protection -Werror -std=gnu++0x
-Wall -Wformat=2 -Wno-format-nonliteral -c -o test_strutil.o test_strutil.cc
[ 79s] make[4]: Leaving directory
'/home/abuild/rpmbuild/BUILD/yast2-core-4.0.3/liby2util-r/testsuite'
[ 79s] make[4]: Entering directory
'/home/abuild/rpmbuild/BUILD/yast2-core-4.0.3/liby2util-r/testsuite'
[ 79s] /bin/sh ../../libtool --tag=CXX --mode=link clang++ -DNDEBUG
-fmessage-length=0 -O2 -Wall -D_FORTIFY_SOURCE=2 -fstack-protector-strong
-funwind-tables -fasynchronous-unwind-tables -fstack-clash-protection -Werror
-std=gnu++0x -Wall -Wformat=2 -Wno-format-nonliteral -Xlinker --whole-archive
./../src/liby2util.la -Xlinker --no-whole-archive -o test_Y2SLog test_Y2SLog.o

[ 79s] libtool: link: clang++ -DNDEBUG -fmessage-length=0 -O2 -Wall
-D_FORTIFY_SOURCE=2 -fstack-protector-strong -funwind-tables
-fasynchronous-unwind-tables -fstack-clash-protection -Werror -std=gnu++0x
-Wall -Wformat=2 -Wno-format-nonliteral -Wl,--whole-archive
-Wl,--no-whole-archive -o .libs/test_Y2SLog test_Y2SLog.o
./../src/.libs/liby2util.so -lutil -Wl,-rpath -Wl,/usr/lib64
[ 79s] make[4]: Leaving directory
'/home/abuild/rpmbuild/BUILD/yast2-core-4.0.3/liby2util-r/testsuite'
[ 79s] make[4]: Entering directory
'/home/abuild/rpmbuild/BUILD/yast2-core-4.0.3/liby2util-r/testsuite'
[ 79s] clang++ -DHAVE_CONFIG_H -I. -I../.. -I./../src/include
-DY2LOG=\"liby2util-testsuite\" -DNDEBUG -fmessage-length=0 -O2 -Wall
-D_FORTIFY_SOURCE=2 -fstack-protector-strong -funwind-tables
-fasynchronous-unwind-tables -fstack-clash-protection -Werror -std=gnu++0x
-Wall -Wformat=2 -Wno-format-nonliteral -c -o test_chroot.o test_chroot.cc
[ 79s] make[4]: Leaving directory
'/home/abuild/rpmbuild/BUILD/yast2-core-4.0.3/liby2util-r/testsuite'
[ 80s] make[4]: Entering directory
'/home/abuild/rpmbuild/BUILD/yast2-core-4.0.3/liby2util-r/testsuite'
[ 80s] /bin/sh ../../libtool --tag=CXX --mode=link clang++ -DNDEBUG
-fmessage-length=0 -O2 -Wall -D_FORTIFY_SOURCE=2 -fstack-protector-strong
-funwind-tables -fasynchronous-unwind-tables -fstack-clash-protection -Werror
-std=gnu++0x -Wall -Wformat=2 -Wno-format-nonliteral -Xlinker --whole-archive
./../src/liby2util.la -Xlinker --no-whole-archive -pthread -o
test_thread_log.prg test_thread_log.o
[ 80s] libtool: link: clang++ -DNDEBUG -fmessage-length=0 -O2 -Wall
-D_FORTIFY_SOURCE=2 -fstack-protector-strong -funwind-tables
-fasynchronous-unwind-tables -fstack-clash-protection -Werror -std=gnu++0x
-Wall -Wformat=2 -Wno-format-nonliteral -Wl,--whole-archive
-Wl,--no-whole-archive -pthread -o .libs/test_thread_log.prg test_thread_log.o
./../src/.libs/liby2util.so -lutil -pthread -Wl,-rpath -Wl,/usr/lib64
[ 80s] make[4]: Leaving directory
'/home/abuild/rpmbuild/BUILD/yast2-core-4.0.3/liby2util-r/testsuite'
[ 80s] make[4]: Entering directory
'/home/abuild/rpmbuild/BUILD/yast2-core-4.0.3/liby2util-r/testsuite'
[ 80s] /bin/sh ../../libtool --tag=CXX --mode=link clang++ -DNDEBUG
-fmessage-length=0 -O2 -Wall -D_FORTIFY_SOURCE=2 -fstack-protector-strong
-funwind-tables -fasynchronous-unwind-tables -fstack-clash-protection -Werror
-std=gnu++0x -Wall -Wformat=2 -Wno-format-nonliteral -Xlinker --whole-archive
./../src/liby2util.la -Xlinker --no-whole-archive -o test_strutil
test_strutil.o
[ 80s] libtool: link: clang++ -DNDEBUG -fmessage-length=0 -O2 -Wall
-D_FORTIFY_SOURCE=2 -fstack-protector-strong -funwind-tables
-fasynchronous-unwind-tables -fstack-clash-protection -Werror -std=gnu++0x
-Wall -Wformat=2 -Wno-format-nonliteral -Wl,--whole-archive
-Wl,--no-whole-archive -o .libs/test_strutil test_strutil.o
./../src/.libs/liby2util.so -lutil -Wl,-rpath -Wl,/usr/lib64
[ 80s] make[4]: Leaving directory
'/home/abuild/rpmbuild/BUILD/yast2-core-4.0.3/liby2util-r/testsuite'
[ 80s] make[4]: Entering directory
'/home/abuild/rpmbuild/BUILD/yast2-core-4.0.3/liby2util-r/testsuite'
[ 80s] /bin/sh ../../libtool --tag=CXX --mode=link clang++ -DNDEBUG
-fmessage-length=0 -O2 -Wall -D_FORTIFY_SOURCE=2 -fstack-protector-strong
-funwind-tables -fasynchronous-unwind-tables -fstack-clash-protection -Werror
-std=gnu++0x -Wall -Wformat=2 -Wno-format-nonliteral -Xlinker --whole-archive
./../src/liby2util.la -Xlinker --no-whole-archive -o test_mkdir.prg
test_mkdir.o
[ 80s] libtool: link: clang++ -DNDEBUG -fmessage-length=0 -O2 -Wall
-D_FORTIFY_SOURCE=2 -fstack-protector-strong -funwind-tables
-fasynchronous-unwind-tables -fstack-clash-protection -Werror -std=gnu++0x
-Wall -Wformat=2 -Wno-format-nonliteral -Wl,--whole-archive
-Wl,--no-whole-archive -o .libs/test_mkdir.prg test_mkdir.o
./../src/.libs/liby2util.so -lutil -Wl,-rpath -Wl,/usr/lib64
[ 80s] make[4]: Leaving directory
'/home/abuild/rpmbuild/BUILD/yast2-core-4.0.3/liby2util-r/testsuite'
[ 80s] make[4]: Entering directory
'/home/abuild/rpmbuild/BUILD/yast2-core-4.0.3/liby2util-r/testsuite'
[ 80s] /bin/sh ../../libtool --tag=CXX --mode=link clang++ -DNDEBUG
-fmessage-length=0 -O2 -Wall -D_FORTIFY_SOURCE=2 -fstack-protector-strong
-funwind-tables -fasynchronous-unwind-tables -fstack-clash-protection -Werror
-std=gnu++0x -Wall -Wformat=2 -Wno-format-nonliteral -Xlinker --whole-archive
./../src/liby2util.la -Xlinker --no-whole-archive -static -o test_chroot.prg
test_chroot.o
[ 80s] libtool: link: clang++ -DNDEBUG -fmessage-length=0 -O2 -Wall
-D_FORTIFY_SOURCE=2 -fstack-protector-strong -funwind-tables
-fasynchronous-unwind-tables -fstack-clash-protection -Werror -std=gnu++0x
-Wall -Wformat=2 -Wno-format-nonliteral -Wl,--whole-archive
-Wl,--no-whole-archive -o test_chroot.prg test_chroot.o
./../src/.libs/liby2util.so -lutil -Wl,-rpath
-Wl,/home/abuild/rpmbuild/BUILD/yast2-core-4.0.3/liby2util-r/src/.libs
-Wl,-rpath -Wl,/usr/lib64
[ 80s] make[4]: Leaving directory
'/home/abuild/rpmbuild/BUILD/yast2-core-4.0.3/liby2util-r/testsuite'
[ 80s] make[3]: Nothing to be done for 'all-am'.
[ 80s] Making all in liby2
[ 80s] Making all in src
[ 80s] Making all in include
[ 80s] Making all in y2
[ 80s] make[5]: Nothing to be done for 'all'.
[ 80s] make[5]: Nothing to be done for 'all-am'.
[ 81s] make[4]: Entering directory
'/home/abuild/rpmbuild/BUILD/yast2-core-4.0.3/liby2/src'
[ 81s] /bin/sh ../../libtool --tag=CXX --mode=compile clang++
-DHAVE_CONFIG_H -I. -I../.. -I./../../libycp/src/include -I./include
-I./include/y2 -I../../liby2util-r/src/include -DY2LOG=\"liby2\"
-DYAST2DIR=\"/usr/share/YaST2\" -DPLUGINDIR=\"/usr/lib64/YaST2/plugin\"
-DEXECCOMPDIR=\"/usr/lib/YaST2\" -DNDEBUG -fmessage-length=0 -O2 -Wall
-D_FORTIFY_SOURCE=2 -fstack-protector-strong -funwind-tables
-fasynchronous-unwind-tables -fstack-clash-protection -Werror -std=gnu++0x
-Wall -Wformat=2 -Wno-format-nonliteral -c -o Y2Component.lo Y2Component.cc
[ 81s] libtool: compile: clang++ -DHAVE_CONFIG_H -I. -I../..
-I./../../libycp/src/include -I./include -I./include/y2
-I../../liby2util-r/src/include -DY2LOG=\"liby2\"
-DYAST2DIR=\"/usr/share/YaST2\" -DPLUGINDIR=\"/usr/lib64/YaST2/plugin\"
-DEXECCOMPDIR=\"/usr/lib/YaST2\" -DNDEBUG -fmessage-length=0 -O2 -Wall
-D_FORTIFY_SOURCE=2 -fstack-protector-strong -funwind-tables
-fasynchronous-unwind-tables -fstack-clash-protection -Werror -std=gnu++0x
-Wall -Wformat=2 -Wno-format-nonliteral -c Y2Component.cc -fPIC -DPIC -o
.libs/Y2Component.o
[ 81s] make[4]: Leaving directory
'/home/abuild/rpmbuild/BUILD/yast2-core-4.0.3/liby2/src'
[ 82s] make[4]: Entering directory
'/home/abuild/rpmbuild/BUILD/yast2-core-4.0.3/liby2/src'
[ 82s] /bin/sh ../../libtool --tag=CXX --mode=compile clang++
-DHAVE_CONFIG_H -I. -I../.. -I./../../libycp/src/include -I./include
-I./include/y2 -I../../liby2util-r/src/include -DY2LOG=\"liby2\"
-DYAST2DIR=\"/usr/share/YaST2\" -DPLUGINDIR=\"/usr/lib64/YaST2/plugin\"
-DEXECCOMPDIR=\"/usr/lib/YaST2\" -DNDEBUG -fmessage-length=0 -O2 -Wall
-D_FORTIFY_SOURCE=2 -fstack-protector-strong -funwind-tables
-fasynchronous-unwind-tables -fstack-clash-protection -Werror -std=gnu++0x
-Wall -Wformat=2 -Wno-format-nonliteral -c -o Y2ComponentBroker.lo
Y2ComponentBroker.cc
[ 82s] libtool: compile: clang++ -DHAVE_CONFIG_H -I. -I../..
-I./../../libycp/src/include -I./include -I./include/y2
-I../../liby2util-r/src/include -DY2LOG=\"liby2\"
-DYAST2DIR=\"/usr/share/YaST2\" -DPLUGINDIR=\"/usr/lib64/YaST2/plugin\"
-DEXECCOMPDIR=\"/usr/lib/YaST2\" -DNDEBUG -fmessage-length=0 -O2 -Wall
-D_FORTIFY_SOURCE=2 -fstack-protector-strong -funwind-tables
-fasynchronous-unwind-tables -fstack-clash-protection -Werror -std=gnu++0x
-Wall -Wformat=2 -Wno-format-nonliteral -c Y2ComponentBroker.cc -fPIC -DPIC -o
.libs/Y2ComponentBroker.o
[ 82s] make[4]: Leaving directory
'/home/abuild/rpmbuild/BUILD/yast2-core-4.0.3/liby2/src'
[ 82s] make[4]: Entering directory
'/home/abuild/rpmbuild/BUILD/yast2-core-4.0.3/liby2/src'
[ 82s] /bin/sh ../../libtool --tag=CXX --mode=compile clang++
-DHAVE_CONFIG_H -I. -I../.. -I./../../libycp/src/include -I./include
-I./include/y2 -I../../liby2util-r/src/include -DY2LOG=\"liby2\"
-DYAST2DIR=\"/usr/share/YaST2\" -DPLUGINDIR=\"/usr/lib64/YaST2/plugin\"
-DEXECCOMPDIR=\"/usr/lib/YaST2\" -DNDEBUG -fmessage-length=0 -O2 -Wall
-D_FORTIFY_SOURCE=2 -fstack-protector-strong -funwind-tables
-fasynchronous-unwind-tables -fstack-clash-protection -Werror -std=gnu++0x
-Wall -Wformat=2 -Wno-format-nonliteral -c -o Y2ComponentCreator.lo
Y2ComponentCreator.cc
[ 82s] libtool: compile: clang++ -DHAVE_CONFIG_H -I. -I../..
-I./../../libycp/src/include -I./include -I./include/y2
-I../../liby2util-r/src/include -DY2LOG=\"liby2\"
-DYAST2DIR=\"/usr/share/YaST2\" -DPLUGINDIR=\"/usr/lib64/YaST2/plugin\"
-DEXECCOMPDIR=\"/usr/lib/YaST2\" -DNDEBUG -fmessage-length=0 -O2 -Wall
-D_FORTIFY_SOURCE=2 -fstack-protector-strong -funwind-tables
-fasynchronous-unwind-tables -fstack-clash-protection -Werror -std=gnu++0x
-Wall -Wformat=2 -Wno-format-nonliteral -c Y2ComponentCreator.cc -fPIC -DPIC
-o .libs/Y2ComponentCreator.o
[ 82s] make[4]: Leaving directory
'/home/abuild/rpmbuild/BUILD/yast2-core-4.0.3/liby2/src'
[ 83s] make[4]: Entering directory
'/home/abuild/rpmbuild/BUILD/yast2-core-4.0.3/liby2/src'
[ 83s] /bin/sh ../../libtool --tag=CXX --mode=compile clang++
-DHAVE_CONFIG_H -I. -I../.. -I./../../libycp/src/include -I./include
-I./include/y2 -I../../liby2util-r/src/include -DY2LOG=\"liby2\"
-DYAST2DIR=\"/usr/share/YaST2\" -DPLUGINDIR=\"/usr/lib64/YaST2/plugin\"
-DEXECCOMPDIR=\"/usr/lib/YaST2\" -DNDEBUG -fmessage-length=0 -O2 -Wall
-D_FORTIFY_SOURCE=2 -fstack-protector-strong -funwind-tables
-fasynchronous-unwind-tables -fstack-clash-protection -Werror -std=gnu++0x
-Wall -Wformat=2 -Wno-format-nonliteral -c -o Y2Namespace.lo Y2Namespace.cc
[ 83s] libtool: compile: clang++ -DHAVE_CONFIG_H -I. -I../..
-I./../../libycp/src/include -I./include -I./include/y2
-I../../liby2util-r/src/include -DY2LOG=\"liby2\"
-DYAST2DIR=\"/usr/share/YaST2\" -DPLUGINDIR=\"/usr/lib64/YaST2/plugin\"
-DEXECCOMPDIR=\"/usr/lib/YaST2\" -DNDEBUG -fmessage-length=0 -O2 -Wall
-D_FORTIFY_SOURCE=2 -fstack-protector-strong -funwind-tables
-fasynchronous-unwind-tables -fstack-clash-protection -Werror -std=gnu++0x
-Wall -Wformat=2 -Wno-format-nonliteral -c Y2Namespace.cc -fPIC -DPIC -o
.libs/Y2Namespace.o
[ 83s] Y2Namespace.cc:96:31: error: unused variable 'it'
[-Werror,-Wunused-variable]
[ 83s] symbols_t::const_iterator it;
[ 83s] ^
[ 83s] 1 error generated.
[ 83s] make[4]: *** [Makefile:634: Y2Namespace.lo] Error 1
[ 83s] make[4]: Leaving directory
'/home/abuild/rpmbuild/BUILD/yast2-core-4.0.3/liby2/src'
[ 83s] make[4]: *** Waiting for unfinished jobs....
[ 84s] make[4]: Entering directory
'/home/abuild/rpmbuild/BUILD/yast2-core-4.0.3/liby2/src'
[ 84s] /bin/sh ../../libtool --tag=CXX --mode=compile clang++
-DHAVE_CONFIG_H -I. -I../.. -I./../../libycp/src/include -I./include
-I./include/y2 -I../../liby2util-r/src/include -DY2LOG=\"liby2\"
-DYAST2DIR=\"/usr/share/YaST2\" -DPLUGINDIR=\"/usr/lib64/YaST2/plugin\"
-DEXECCOMPDIR=\"/usr/lib/YaST2\" -DNDEBUG -fmessage-length=0 -O2 -Wall
-D_FORTIFY_SOURCE=2 -fstack-protector-strong -funwind-tables
-fasynchronous-unwind-tables -fstack-clash-protection -Werror -std=gnu++0x
-Wall -Wformat=2 -Wno-format-nonliteral -c -o Y2LanguageLoader.lo
Y2LanguageLoader.cc
[ 84s] libtool: compile: clang++ -DHAVE_CONFIG_H -I. -I../..
-I./../../libycp/src/include -I./include -I./include/y2
-I../../liby2util-r/src/include -DY2LOG=\"liby2\"
-DYAST2DIR=\"/usr/share/YaST2\" -DPLUGINDIR=\"/usr/lib64/YaST2/plugin\"
-DEXECCOMPDIR=\"/usr/lib/YaST2\" -DNDEBUG -fmessage-length=0 -O2 -Wall
-D_FORTIFY_SOURCE=2 -fstack-protector-strong -funwind-tables
-fasynchronous-unwind-tables -fstack-clash-protection -Werror -std=gnu++0x
-Wall -Wformat=2 -Wno-format-nonliteral -c Y2LanguageLoader.cc -fPIC -DPIC -o
.libs/Y2LanguageLoader.o
[ 84s] make[4]: Leaving directory
'/home/abuild/rpmbuild/BUILD/yast2-core-4.0.3/liby2/src'
[ 84s] make[3]: *** [Makefile:649: all-recursive] Error 1
[ 84s] make[2]: *** [Makefile:406: all-recursive] Error 1
[ 84s] make[1]: *** [Makefile:581: all-recursive] Error 1
[ 84s] make: *** [Makefile:450: all] Error 2
[ 84s] error: Bad exit status from /var/tmp/rpm-tmp.874jmw (%build)
[ 84s]
[ 84s]
[ 84s] RPM build errors:
[ 84s] Bad exit status from /var/tmp/rpm-tmp.874jmw (%build)
[ 84s]
[ 84s] yast-jenkins failed "build yast2-core.spec" at Wed Aug 22 14:44:15 UTC
2018.
[ 84s]

The buildroot was: /var/tmp/build-root-openSUSE_Factory
rm -rf YaST:Head
rake aborted!
Command failed with status (1): [yes | osc -A 'https://api.opensuse.org/' b...]

Tasks: TOP => osc:build
(See full trace by running task with --trace)
cleaning
Build step 'Execute shell' marked build as failure
Not sending mail to unregistered user schubi@xxxxxxx
Not sending mail to unregistered user aschnell@xxxxxxx

< Previous Next >
This Thread
  • No further messages