Mailinglist Archive: yast-commit (1998 mails)

< Previous Next >
[yast-commit] Build failed in Jenkins: yast-users-master #151
  • From: admin@xxxxxxxxxxxx
  • Date: Mon, 9 Apr 2018 08:37:10 +0000 (UTC)
  • Message-id: <558830174.6.1523263030158.JavaMail.jenkins@ci-opensuse>
See
<http://ci.opensuse.org/job/yast-users-master/151/display/redirect?page=changes>

Changes:

[igonzalezsosa] Do not crash if root is not defined

[igonzalezsosa] Bump version and update changes file

[igonzalezsosa] Add a test case for bsc#1088183

------------------------------------------
[...truncated 126.64 KB...]
[ 34s] make[2]: Entering directory
'/home/abuild/rpmbuild/BUILD/yast2-users-4.0.5/agent-crack/conf'
[ 34s] make[3]: Entering directory
'/home/abuild/rpmbuild/BUILD/yast2-users-4.0.5/agent-crack/conf'
[ 34s] make[3]: Nothing to be done for 'install-exec-am'.
[ 34s] /usr/bin/mkdir -p
'/home/abuild/rpmbuild/BUILDROOT/yast2-users-4.0.5-1.x86_64/usr/share/YaST2/scrconf'
[ 34s] /usr/bin/install -c -p -m 644 crack.scr
'/home/abuild/rpmbuild/BUILDROOT/yast2-users-4.0.5-1.x86_64/usr/share/YaST2/scrconf'
[ 34s] make[3]: Leaving directory
'/home/abuild/rpmbuild/BUILD/yast2-users-4.0.5/agent-crack/conf'
[ 34s] make[2]: Leaving directory
'/home/abuild/rpmbuild/BUILD/yast2-users-4.0.5/agent-crack/conf'
[ 34s] Making install in src
[ 34s] make[2]: Entering directory
'/home/abuild/rpmbuild/BUILD/yast2-users-4.0.5/agent-crack/src'
[ 34s] make[3]: Entering directory
'/home/abuild/rpmbuild/BUILD/yast2-users-4.0.5/agent-crack/src'
[ 34s] make[3]: Nothing to be done for 'install-exec-am'.
[ 34s] /usr/bin/mkdir -p
'/home/abuild/rpmbuild/BUILDROOT/yast2-users-4.0.5-1.x86_64/usr/lib64/YaST2/plugin'
[ 34s] /bin/sh ../../libtool --mode=install /usr/bin/install -c -p
libpy2ag_crack.la
'/home/abuild/rpmbuild/BUILDROOT/yast2-users-4.0.5-1.x86_64/usr/lib64/YaST2/plugin'
[ 34s] libtool: install: /usr/bin/install -c -p .libs/libpy2ag_crack.so.2.0.0
/home/abuild/rpmbuild/BUILDROOT/yast2-users-4.0.5-1.x86_64/usr/lib64/YaST2/plugin/libpy2ag_crack.so.2.0.0
[ 34s] libtool: install: (cd
/home/abuild/rpmbuild/BUILDROOT/yast2-users-4.0.5-1.x86_64/usr/lib64/YaST2/plugin
&& { ln -s -f libpy2ag_crack.so.2.0.0 libpy2ag_crack.so.2 || { rm -f
libpy2ag_crack.so.2 && ln -s libpy2ag_crack.so.2.0.0 libpy2ag_crack.so.2; }; })
[ 34s] libtool: install: (cd
/home/abuild/rpmbuild/BUILDROOT/yast2-users-4.0.5-1.x86_64/usr/lib64/YaST2/plugin
&& { ln -s -f libpy2ag_crack.so.2.0.0 libpy2ag_crack.so || { rm -f
libpy2ag_crack.so && ln -s libpy2ag_crack.so.2.0.0 libpy2ag_crack.so; }; })
[ 34s] libtool: install: /usr/bin/install -c -p .libs/libpy2ag_crack.lai
/home/abuild/rpmbuild/BUILDROOT/yast2-users-4.0.5-1.x86_64/usr/lib64/YaST2/plugin/libpy2ag_crack.la
[ 34s] libtool: warning: remember to run 'libtool --finish
/usr/lib64/YaST2/plugin'
[ 34s] make[3]: Leaving directory
'/home/abuild/rpmbuild/BUILD/yast2-users-4.0.5/agent-crack/src'
[ 34s] make[2]: Leaving directory
'/home/abuild/rpmbuild/BUILD/yast2-users-4.0.5/agent-crack/src'
[ 34s] Making install in testsuite
[ 34s] make[2]: Entering directory
'/home/abuild/rpmbuild/BUILD/yast2-users-4.0.5/agent-crack/testsuite'
[ 34s] make[3]: Entering directory
'/home/abuild/rpmbuild/BUILD/yast2-users-4.0.5/agent-crack/testsuite'
[ 34s] make[3]: Nothing to be done for 'install-exec-am'.
[ 34s] make[3]: Nothing to be done for 'install-data-am'.
[ 34s] make[3]: Leaving directory
'/home/abuild/rpmbuild/BUILD/yast2-users-4.0.5/agent-crack/testsuite'
[ 34s] make[2]: Leaving directory
'/home/abuild/rpmbuild/BUILD/yast2-users-4.0.5/agent-crack/testsuite'
[ 34s] make[2]: Entering directory
'/home/abuild/rpmbuild/BUILD/yast2-users-4.0.5/agent-crack'
[ 34s] make[3]: Entering directory
'/home/abuild/rpmbuild/BUILD/yast2-users-4.0.5/agent-crack'
[ 34s] make[3]: Nothing to be done for 'install-exec-am'.
[ 34s] make[3]: Nothing to be done for 'install-data-am'.
[ 34s] make[3]: Leaving directory
'/home/abuild/rpmbuild/BUILD/yast2-users-4.0.5/agent-crack'
[ 34s] make[2]: Leaving directory
'/home/abuild/rpmbuild/BUILD/yast2-users-4.0.5/agent-crack'
[ 34s] make[1]: Leaving directory
'/home/abuild/rpmbuild/BUILD/yast2-users-4.0.5/agent-crack'
[ 34s] Making install in doc
[ 34s] make[1]: Entering directory
'/home/abuild/rpmbuild/BUILD/yast2-users-4.0.5/doc'
[ 34s] make[2]: Entering directory
'/home/abuild/rpmbuild/BUILD/yast2-users-4.0.5/doc'
[ 34s] make[2]: Nothing to be done for 'install-exec-am'.
[ 34s] /usr/bin/mkdir -p
'/home/abuild/rpmbuild/BUILDROOT/yast2-users-4.0.5-1.x86_64/usr/share/doc/packages/yast2-users'
[ 34s] /usr/bin/install -c -p -m 644 users.html
'/home/abuild/rpmbuild/BUILDROOT/yast2-users-4.0.5-1.x86_64/usr/share/doc/packages/yast2-users'
[ 34s] make[2]: Leaving directory
'/home/abuild/rpmbuild/BUILD/yast2-users-4.0.5/doc'
[ 34s] make[1]: Leaving directory
'/home/abuild/rpmbuild/BUILD/yast2-users-4.0.5/doc'
[ 34s] Making install in src
[ 34s] make[1]: Entering directory
'/home/abuild/rpmbuild/BUILD/yast2-users-4.0.5/src'
[ 34s] make[2]: Entering directory
'/home/abuild/rpmbuild/BUILD/yast2-users-4.0.5/src'
[ 34s] make[2]: Nothing to be done for 'install-exec-am'.
[ 34s] /usr/bin/mkdir -p
'/home/abuild/rpmbuild/BUILDROOT/yast2-users-4.0.5-1.x86_64/usr/lib/YaST2/servers_non_y2'
[ 34s] /usr/bin/install -c -p servers_non_y2/ag_nis servers_non_y2/ag_uid
'/home/abuild/rpmbuild/BUILDROOT/yast2-users-4.0.5-1.x86_64/usr/lib/YaST2/servers_non_y2'
[ 34s] /usr/bin/mkdir -p
'/home/abuild/rpmbuild/BUILDROOT/yast2-users-4.0.5-1.x86_64/usr/share/YaST2/clients'
[ 34s] /usr/bin/install -c -p -m 644 clients/users_auto.rb
clients/users_proposal.rb clients/users_encryption_proposal.rb
clients/users_finish.rb clients/groups.rb clients/users_plugin_quota.rb
clients/users_plugin_ldap_all.rb clients/users_plugin_ldap_shadowaccount.rb
clients/users_plugin_ldap_passwordpolicy.rb clients/users.rb
clients/inst_root_first.rb clients/inst_user_first.rb
clients/users_encryption_method.rb
'/home/abuild/rpmbuild/BUILDROOT/yast2-users-4.0.5-1.x86_64/usr/share/YaST2/clients'
[ 34s] /usr/bin/mkdir -p
'/home/abuild/rpmbuild/BUILDROOT/yast2-users-4.0.5-1.x86_64/usr/share/applications/YaST2'
[ 34s] /usr/bin/install -c -p -m 644 desktop/users.desktop
'/home/abuild/rpmbuild/BUILDROOT/yast2-users-4.0.5-1.x86_64/usr/share/applications/YaST2'
[ 34s] /usr/bin/mkdir -p
'/home/abuild/rpmbuild/BUILDROOT/yast2-users-4.0.5-1.x86_64/usr/share/YaST2/modules/YaPI'
[ 34s] /usr/bin/install -c -p -m 644 modules/YaPI/ADMINISTRATOR.pm
modules/YaPI/USERS.pm
'/home/abuild/rpmbuild/BUILDROOT/yast2-users-4.0.5-1.x86_64/usr/share/YaST2/modules/YaPI'
[ 34s] /usr/bin/mkdir -p
'/home/abuild/rpmbuild/BUILDROOT/yast2-users-4.0.5-1.x86_64/usr/share/YaST2/modules'
[ 34s] /usr/bin/install -c -p -m 644 modules/SSHAuthorizedKeys.rb
modules/UsersUI.rb modules/UsersRoutines.pm modules/UsersPluginQuota.pm
modules/Users.pm modules/UsersPlugins.pm
modules/UsersPluginLDAPShadowAccount.pm modules/UsersLDAP.pm
modules/UsersSimple.pm modules/UsersCache.pm modules/UsersPluginLDAPAll.pm
modules/UsersPluginLDAPPasswordPolicy.pm modules/UsersPluginKerberos.pm
modules/UsersPasswd.pm
'/home/abuild/rpmbuild/BUILDROOT/yast2-users-4.0.5-1.x86_64/usr/share/YaST2/modules'
[ 34s] /usr/bin/mkdir -p
'/home/abuild/rpmbuild/BUILDROOT/yast2-users-4.0.5-1.x86_64/usr/share/YaST2/schema/autoyast/rnc'
[ 34s] /usr/bin/install -c -p -m 644 autoyast-rnc/users.rnc
'/home/abuild/rpmbuild/BUILDROOT/yast2-users-4.0.5-1.x86_64/usr/share/YaST2/schema/autoyast/rnc'
[ 34s] /usr/bin/mkdir -p
'/home/abuild/rpmbuild/BUILDROOT/yast2-users-4.0.5-1.x86_64/usr/share/YaST2/scrconf'
[ 34s] /usr/bin/install -c -p -m 644 scrconf/uid.scr
scrconf/etc_default_useradd.scr scrconf/nis.scr
'/home/abuild/rpmbuild/BUILDROOT/yast2-users-4.0.5-1.x86_64/usr/share/YaST2/scrconf'
[ 34s] /usr/bin/mkdir -p
'/home/abuild/rpmbuild/BUILDROOT/yast2-users-4.0.5-1.x86_64/usr/share/YaST2/lib/users'
[ 34s] /usr/bin/install -c -p -m 644 lib/users/ca_password_validator.rb
lib/users/local_password.rb lib/users/encryption_method.rb
lib/users/proposal.rb lib/users/encryption_proposal.rb
lib/users/ssh_authorized_keys_file.rb lib/users/ssh_authorized_keyring.rb
lib/users/users_database.rb lib/users/widgets.rb
'/home/abuild/rpmbuild/BUILDROOT/yast2-users-4.0.5-1.x86_64/usr/share/YaST2/lib/users'
[ 34s] /usr/bin/mkdir -p
'/home/abuild/rpmbuild/BUILDROOT/yast2-users-4.0.5-1.x86_64/usr/share/YaST2/lib/users/clients'
[ 34s] /usr/bin/install -c -p -m 644 lib/users/clients/users_finish.rb
'/home/abuild/rpmbuild/BUILDROOT/yast2-users-4.0.5-1.x86_64/usr/share/YaST2/lib/users/clients'
[ 34s] /usr/bin/mkdir -p
'/home/abuild/rpmbuild/BUILDROOT/yast2-users-4.0.5-1.x86_64/usr/share/YaST2/lib/users/dialogs'
[ 34s] /usr/bin/install -c -p -m 644 lib/users/dialogs/inst_root_first.rb
lib/users/dialogs/inst_user_first.rb lib/users/dialogs/users_to_import.rb
lib/users/dialogs/encryption_method.rb
'/home/abuild/rpmbuild/BUILDROOT/yast2-users-4.0.5-1.x86_64/usr/share/YaST2/lib/users/dialogs'
[ 34s] /usr/bin/mkdir -p
'/home/abuild/rpmbuild/BUILDROOT/yast2-users-4.0.5-1.x86_64/usr/share/YaST2/include/users'
[ 34s] /usr/bin/install -c -p -m 644 include/users/widgets.rb
include/users/wizards.rb include/users/ldap_dialogs.rb include/users/dialogs.rb
include/users/complex.rb include/users/routines.rb include/users/cmdline.rb
include/users/helps.rb
'/home/abuild/rpmbuild/BUILDROOT/yast2-users-4.0.5-1.x86_64/usr/share/YaST2/include/users'
[ 34s] make[2]: Leaving directory
'/home/abuild/rpmbuild/BUILD/yast2-users-4.0.5/src'
[ 34s] make[1]: Leaving directory
'/home/abuild/rpmbuild/BUILD/yast2-users-4.0.5/src'
[ 34s] Making install in test
[ 34s] make[1]: Entering directory
'/home/abuild/rpmbuild/BUILD/yast2-users-4.0.5/test'
[ 34s] make[2]: Entering directory
'/home/abuild/rpmbuild/BUILD/yast2-users-4.0.5/test'
[ 34s] make[2]: Nothing to be done for 'install-exec-am'.
[ 34s] make[2]: Nothing to be done for 'install-data-am'.
[ 34s] make[2]: Leaving directory
'/home/abuild/rpmbuild/BUILD/yast2-users-4.0.5/test'
[ 34s] make[1]: Leaving directory
'/home/abuild/rpmbuild/BUILD/yast2-users-4.0.5/test'
[ 34s] Making install in testsuite
[ 34s] make[1]: Entering directory
'/home/abuild/rpmbuild/BUILD/yast2-users-4.0.5/testsuite'
[ 34s] make -f /usr/share/YaST2/data/testsuite/Makefile.testsuite
RPMNAME=yast2-users srcdir=.
[ 34s] make[2]: Entering directory
'/home/abuild/rpmbuild/BUILD/yast2-users-4.0.5/testsuite'
[ 34s] cp -f /usr/share/YaST2/data/testsuite/skel/default.exp
config/default.exp
[ 34s] cp -f /usr/share/YaST2/data/testsuite/skel/unix.exp config/unix.exp
[ 34s] cp -f /usr/share/YaST2/data/testsuite/skel/unknown.exp
config/unknown.exp
[ 34s] cp -f /usr/share/YaST2/data/testsuite/skel/testsuite.exp
yast2-users.test/testsuite.exp
[ 34s] make[2]: Leaving directory
'/home/abuild/rpmbuild/BUILD/yast2-users-4.0.5/testsuite'
[ 34s] make[2]: Entering directory
'/home/abuild/rpmbuild/BUILD/yast2-users-4.0.5/testsuite'
[ 34s] make[2]: Nothing to be done for 'install-exec-am'.
[ 34s] make[2]: Nothing to be done for 'install-data-am'.
[ 34s] make[2]: Leaving directory
'/home/abuild/rpmbuild/BUILD/yast2-users-4.0.5/testsuite'
[ 34s] make[1]: Leaving directory
'/home/abuild/rpmbuild/BUILD/yast2-users-4.0.5/testsuite'
[ 34s] make[1]: Entering directory
'/home/abuild/rpmbuild/BUILD/yast2-users-4.0.5'
[ 34s] make[2]: Entering directory
'/home/abuild/rpmbuild/BUILD/yast2-users-4.0.5'
[ 34s] make[2]: Nothing to be done for 'install-exec-am'.
[ 34s] /usr/bin/mkdir -p
'/home/abuild/rpmbuild/BUILDROOT/yast2-users-4.0.5-1.x86_64/usr/share/doc/packages/yast2-users'
[ 34s] /usr/bin/install -c -p -m 644 COPYING
'/home/abuild/rpmbuild/BUILDROOT/yast2-users-4.0.5-1.x86_64/usr/share/doc/packages/yast2-users'
[ 34s] make[2]: Leaving directory
'/home/abuild/rpmbuild/BUILD/yast2-users-4.0.5'
[ 34s] make[1]: Leaving directory
'/home/abuild/rpmbuild/BUILD/yast2-users-4.0.5'
[ 34s] + '[' '!' -f /usr/share/YaST2/data/devtools/NO_MAKE_CHECK ']'
[ 34s] + '[' -f configure.in.in -o -f configure.ac.in ']'
[ 34s] + /usr/bin/make check -j2 VERBOSE=1
Y2DIR=/home/abuild/rpmbuild/BUILDROOT/yast2-users-4.0.5-1.x86_64//usr/share/YaST2
DESTDIR=/home/abuild/rpmbuild/BUILDROOT/yast2-users-4.0.5-1.x86_64
[ 34s] Making check in agent-crack
[ 34s] make[1]: Entering directory
'/home/abuild/rpmbuild/BUILD/yast2-users-4.0.5/agent-crack'
[ 34s] Making check in conf
[ 34s] make[2]: Entering directory
'/home/abuild/rpmbuild/BUILD/yast2-users-4.0.5/agent-crack/conf'
[ 34s] make[2]: Nothing to be done for 'check'.
[ 34s] make[2]: Leaving directory
'/home/abuild/rpmbuild/BUILD/yast2-users-4.0.5/agent-crack/conf'
[ 34s] Making check in src
[ 34s] make[2]: Entering directory
'/home/abuild/rpmbuild/BUILD/yast2-users-4.0.5/agent-crack/src'
[ 34s] make[2]: Nothing to be done for 'check'.
[ 34s] make[2]: Leaving directory
'/home/abuild/rpmbuild/BUILD/yast2-users-4.0.5/agent-crack/src'
[ 34s] Making check in testsuite
[ 34s] make[2]: Entering directory
'/home/abuild/rpmbuild/BUILD/yast2-users-4.0.5/agent-crack/testsuite'
[ 34s] /usr/bin/make check-DEJAGNU
[ 34s] make[3]: Entering directory
'/home/abuild/rpmbuild/BUILD/yast2-users-4.0.5/agent-crack/testsuite'
[ 34s] Making a new site.exp file ...
[ 34s] srcdir='.'; export srcdir; \
[ 34s] EXPECT=expect; export EXPECT; \
[ 34s] if /bin/sh -c "runtest --version" > /dev/null 2>&1; then \
[ 34s] exit_status=0; l='yast2-users'; for tool in $l; do \
[ 34s] if runtest --tool $tool --srcdir $srcdir ; \
[ 34s] then :; else exit_status=1; fi; \
[ 34s] done; \
[ 34s] else echo "WARNING: could not find 'runtest'" 1>&2; :;\
[ 34s] fi; \
[ 34s] exit $exit_status
[ 34s] WARNING: Couldn't find tool init file
[ 34s] Test run by abuild on Mon Apr 9 08:36:16 2018
[ 34s] Native configuration is x86_64-suse-linux-gnu
[ 34s]
[ 34s] === yast2-users tests ===
[ 34s]
[ 34s] Schedule of variations:
[ 34s] unix
[ 34s]
[ 34s] Running target unix
[ 34s] Using /usr/share/dejagnu/baseboards/unix.exp as board description file
for target.
[ 34s] Using /usr/share/dejagnu/config/unix.exp as generic interface file for
target.
[ 34s] WARNING: Couldn't find tool config file for unix, using default.
[ 34s]
[ 34s] === yast2-users Summary ===
[ 34s]
[ 34s] make[3]: Leaving directory
'/home/abuild/rpmbuild/BUILD/yast2-users-4.0.5/agent-crack/testsuite'
[ 34s] make[2]: Leaving directory
'/home/abuild/rpmbuild/BUILD/yast2-users-4.0.5/agent-crack/testsuite'
[ 34s] make[2]: Entering directory
'/home/abuild/rpmbuild/BUILD/yast2-users-4.0.5/agent-crack'
[ 34s] make[2]: Nothing to be done for 'check-am'.
[ 34s] make[2]: Leaving directory
'/home/abuild/rpmbuild/BUILD/yast2-users-4.0.5/agent-crack'
[ 34s] make[1]: Leaving directory
'/home/abuild/rpmbuild/BUILD/yast2-users-4.0.5/agent-crack'
[ 34s] Making check in doc
[ 34s] make[1]: Entering directory
'/home/abuild/rpmbuild/BUILD/yast2-users-4.0.5/doc'
[ 34s] make[1]: Nothing to be done for 'check'.
[ 34s] make[1]: Leaving directory
'/home/abuild/rpmbuild/BUILD/yast2-users-4.0.5/doc'
[ 34s] Making check in src
[ 34s] make[1]: Entering directory
'/home/abuild/rpmbuild/BUILD/yast2-users-4.0.5/src'
[ 34s] make[1]: Nothing to be done for 'check'.
[ 34s] make[1]: Leaving directory
'/home/abuild/rpmbuild/BUILD/yast2-users-4.0.5/src'
[ 34s] Making check in test
[ 34s] make[1]: Entering directory
'/home/abuild/rpmbuild/BUILD/yast2-users-4.0.5/test'
[ 34s] /usr/bin/make check-TESTS
[ 34s] make[2]: Entering directory
'/home/abuild/rpmbuild/BUILD/yast2-users-4.0.5/test'
[ 34s] make[3]: Entering directory
'/home/abuild/rpmbuild/BUILD/yast2-users-4.0.5/test'
[ 35s] PASS: lib/users/ca_password_validator_test.rb
[ 35s] PASS: lib/users/encryption_method_test.rb
[ 35s] PASS: lib/users/ssh_authorized_keys_file_test.rb
[ 36s] PASS: lib/users/users_database_test.rb
[ 36s] PASS: ssh_authorized_keys_test.rb
[ 36s] PASS: dialogs_test.rb
[ 39s] PASS: users_finish_test.rb
[ 40s] PASS: widgets_test.rb
[ 87s] FAIL: users_auto_test.rb
[ 87s] ============================================
[ 87s] yast2-users 4.0.5: test/test-suite.log
[ 87s] ============================================
[ 87s]
[ 87s] # TOTAL: 9
[ 87s] # PASS: 8
[ 87s] # SKIP: 0
[ 87s] # XFAIL: 0
[ 87s] # FAIL: 1
[ 87s] # XPASS: 0
[ 87s] # ERROR: 0
[ 87s]
[ 87s] .. contents:: :depth: 2
[ 87s]
[ 87s] FAIL: users_auto_test
[ 87s] =====================
[ 87s]
[ 87s] ..F
[ 87s]
[ 87s] Failures:
[ 87s]
[ 87s] 1) Yast::UsersAutoClient #AutoYaST #Write when root user is not
defined returns true
[ 87s] Failure/Error: expect(subject.main).to eq(true)
[ 87s]
[ 87s] expected: true
[ 87s] got: false
[ 87s]
[ 87s] (compared using ==)
[ 87s] # ./users_auto_test.rb:68:in `block (5 levels) in <top
(required)>'
[ 87s]
[ 87s] Finished in 50.44 seconds (files took 0.58373 seconds to load)
[ 87s] 3 examples, 1 failure
[ 87s]
[ 87s] Failed examples:
[ 87s]
[ 87s] rspec ./users_auto_test.rb:67 # Yast::UsersAutoClient #AutoYaST #Write
when root user is not defined returns true
[ 87s]
[ 87s] FAIL users_auto_test.rb (exit status: 1)
[ 87s]
[ 87s]
============================================================================
[ 87s] Testsuite summary for yast2-users 4.0.5
[ 87s]
============================================================================
[ 87s] # TOTAL: 9
[ 87s] # PASS: 8
[ 87s] # SKIP: 0
[ 87s] # XFAIL: 0
[ 87s] # FAIL: 1
[ 87s] # XPASS: 0
[ 87s] # ERROR: 0
[ 87s]
============================================================================
[ 87s] See test/test-suite.log
[ 87s] Please report to http://bugs.opensuse.org/
[ 87s]
============================================================================
[ 87s] make[3]: *** [Makefile:564: test-suite.log] Error 1
[ 87s] make[3]: Leaving directory
'/home/abuild/rpmbuild/BUILD/yast2-users-4.0.5/test'
[ 87s] make[2]: *** [Makefile:672: check-TESTS] Error 2
[ 87s] make[2]: Leaving directory
'/home/abuild/rpmbuild/BUILD/yast2-users-4.0.5/test'
[ 87s] make[1]: *** [Makefile:735: check-am] Error 2
[ 87s] make[1]: Leaving directory
'/home/abuild/rpmbuild/BUILD/yast2-users-4.0.5/test'
[ 87s] make: *** [Makefile:571: check-recursive] Error 1
[ 87s] error: Bad exit status from /var/tmp/rpm-tmp.Wx5nGU (%install)
[ 87s]
[ 87s]
[ 87s] RPM build errors:
[ 87s] Bad exit status from /var/tmp/rpm-tmp.Wx5nGU (%install)
[ 87s]
[ 87s] yast-jenkins failed "build yast2-users.spec" at Mon Apr 9 08:37:09
UTC 2018.
[ 87s]

The buildroot was: /var/tmp/build-root-openSUSE_Factory
rm -rf YaST:Head
rake aborted!
Command failed with status (1): [yes | osc -A 'https://api.opensuse.org/' b...]

Tasks: TOP => osc:sr => osc:commit => osc:build
(See full trace by running task with --trace)
cleaning
Build step 'Execute shell' marked build as failure
Not sending mail to unregistered user igonzalezsosa@xxxxxxxx

< Previous Next >
This Thread
Follow Ups