Mailinglist Archive: yast-commit (1979 mails)

< Previous Next >
[yast-commit] Build failed in Jenkins: yast-autoinstallation-master #183
  • From: jenkins@xxxxxxx
  • Date: Tue, 3 Apr 2018 15:34:10 +0000 (UTC)
  • Message-id: <257049379.535.1522769650403.JavaMail.jenkins@ci>
See <https://ci.suse.de/job/yast-autoinstallation-master/183/display/redirect>

------------------------------------------
[...truncated 144.34 KB...]
[ 9s] make[2]: Entering directory
'/home/abuild/rpmbuild/BUILD/autoyast2-4.0.45/scripts'
[ 9s] make[2]: Nothing to be done for 'install-exec-am'.
[ 9s] make[2]: Nothing to be done for 'install-data-am'.
[ 9s] make[2]: Leaving directory
'/home/abuild/rpmbuild/BUILD/autoyast2-4.0.45/scripts'
[ 9s] make[1]: Leaving directory
'/home/abuild/rpmbuild/BUILD/autoyast2-4.0.45/scripts'
[ 9s] Making install in src
[ 9s] make[1]: Entering directory
'/home/abuild/rpmbuild/BUILD/autoyast2-4.0.45/src'
[ 9s] make[2]: Entering directory
'/home/abuild/rpmbuild/BUILD/autoyast2-4.0.45/src'
[ 9s] make[2]: Nothing to be done for 'install-exec-am'.
[ 9s] /usr/bin/mkdir -p
'/home/abuild/rpmbuild/BUILDROOT/autoyast2-4.0.45-1.x86_64/usr/share/YaST2/clients'
[ 9s] /usr/bin/install -c -p -m 644 clients/classes_auto.rb
clients/ayast_setup.rb clients/scripts_auto.rb clients/software_auto.rb
clients/general_auto.rb clients/inst_autopost.rb clients/storage_auto.rb
clients/ayast_probe.rb clients/inst_autoconfigure.rb
clients/inst_autosetup_upgrade.rb clients/autoinst_scripts2_finish.rb
clients/inst_autosetup.rb clients/inst_autoinit.rb clients/report_auto.rb
clients/autoinst_scripts1_finish.rb clients/inst_autoimage.rb
clients/inst_store_upgrade_software.rb clients/files_auto.rb
clients/autoinst_test_clone.rb clients/autoyast.rb clients/clone_system.rb
clients/autoinst_test_stage.rb
'/home/abuild/rpmbuild/BUILDROOT/autoyast2-4.0.45-1.x86_64/usr/share/YaST2/clients'
[ 9s] /usr/bin/mkdir -p
'/home/abuild/rpmbuild/BUILDROOT/autoyast2-4.0.45-1.x86_64/usr/share/applications/YaST2'
[ 9s] /usr/bin/install -c -p -m 644 desktop/autoyast.desktop
desktop/clone_system.desktop
'/home/abuild/rpmbuild/BUILDROOT/autoyast2-4.0.45-1.x86_64/usr/share/applications/YaST2'
[ 9s] /usr/bin/mkdir -p
'/home/abuild/rpmbuild/BUILDROOT/autoyast2-4.0.45-1.x86_64/usr/share/fillup-templates'
[ 9s] /usr/bin/install -c -p -m 644 fillup/sysconfig.autoinstall
'/home/abuild/rpmbuild/BUILDROOT/autoyast2-4.0.45-1.x86_64/usr/share/fillup-templates'
[ 9s] /usr/bin/mkdir -p
'/home/abuild/rpmbuild/BUILDROOT/autoyast2-4.0.45-1.x86_64/usr/share/YaST2/modules'
[ 9s] /usr/bin/install -c -p -m 644 modules/AutoinstStorage.rb
modules/AutoinstPartPlan.rb modules/AutoInstallRules.rb
modules/Y2ModuleConfig.rb modules/ProfileLocation.rb
modules/AutoinstPartition.rb modules/AutoinstClone.rb modules/AutoinstImage.rb
modules/AutoinstConfig.rb modules/Profile.rb modules/AutoinstCommon.rb
modules/AutoinstFile.rb modules/AutoinstScripts.rb modules/AutoInstall.rb
modules/AutoinstGeneral.rb modules/AutoinstSoftware.rb modules/AutoinstDrive.rb
modules/AutoinstClass.rb modules/AutoinstFunctions.rb
'/home/abuild/rpmbuild/BUILDROOT/autoyast2-4.0.45-1.x86_64/usr/share/YaST2/modules'
[ 9s] /usr/bin/mkdir -p
'/home/abuild/rpmbuild/BUILDROOT/autoyast2-4.0.45-1.x86_64/usr/share/YaST2/schema/autoyast/rnc'
[ 9s] /usr/bin/install -c -p -m 644 autoyast-rnc/scripts.rnc
autoyast-rnc/rules.rnc autoyast-rnc/common.rnc autoyast-rnc/pxe.rnc
autoyast-rnc/classes-use.rnc autoyast-rnc/classes-decl.rnc
autoyast-rnc/software.rnc autoyast-rnc/reporting.rnc
autoyast-rnc/partitioning.rnc autoyast-rnc/profile-misc.rnc
autoyast-rnc/general.rnc autoyast-rnc/files.rnc
'/home/abuild/rpmbuild/BUILDROOT/autoyast2-4.0.45-1.x86_64/usr/share/YaST2/schema/autoyast/rnc'
[ 9s] /usr/bin/mkdir -p
'/home/abuild/rpmbuild/BUILDROOT/autoyast2-4.0.45-1.x86_64/usr/share/YaST2/scrconf'
[ 9s] /usr/bin/install -c -p -m 644 scrconf/cfg_autoinstall.scr
scrconf/autoinstall.scr
'/home/abuild/rpmbuild/BUILDROOT/autoyast2-4.0.45-1.x86_64/usr/share/YaST2/scrconf'
[ 9s] /usr/bin/mkdir -p
'/home/abuild/rpmbuild/BUILDROOT/autoyast2-4.0.45-1.x86_64/usr/lib/YaST2/bin'
[ 9s] /usr/bin/install -c -p bin/autoyast-initscripts.sh bin/fetch_image.sh
'/home/abuild/rpmbuild/BUILDROOT/autoyast2-4.0.45-1.x86_64/usr/lib/YaST2/bin'
[ 9s] /usr/bin/mkdir -p
'/home/abuild/rpmbuild/BUILDROOT/autoyast2-4.0.45-1.x86_64/usr/share/YaST2/lib/autoinstall/clients'
[ 9s] /usr/bin/install -c -p -m 644 lib/autoinstall/clients/ayast_probe.rb
'/home/abuild/rpmbuild/BUILDROOT/autoyast2-4.0.45-1.x86_64/usr/share/YaST2/lib/autoinstall/clients'
[ 9s] /usr/bin/mkdir -p
'/home/abuild/rpmbuild/BUILDROOT/autoyast2-4.0.45-1.x86_64/usr/share/YaST2/lib/autoinstall/dialogs'
[ 9s] /usr/bin/install -c -p -m 644
lib/autoinstall/dialogs/disk_selector.rb lib/autoinstall/dialogs/question.rb
'/home/abuild/rpmbuild/BUILDROOT/autoyast2-4.0.45-1.x86_64/usr/share/YaST2/lib/autoinstall/dialogs'
[ 9s] /usr/bin/mkdir -p
'/home/abuild/rpmbuild/BUILDROOT/autoyast2-4.0.45-1.x86_64/usr/share/YaST2/lib/autoinstall'
[ 9s] /usr/bin/install -c -p -m 644 lib/autoinstall/activate_callbacks.rb
lib/autoinstall/module_config_builder.rb
lib/autoinstall/pkg_gpg_check_handler.rb
lib/autoinstall/partitioning_preprocessor.rb
lib/autoinstall/autosetup_helpers.rb lib/autoinstall/storage_proposal.rb
lib/autoinstall/storage_proposal_issues_presenter.rb
'/home/abuild/rpmbuild/BUILDROOT/autoyast2-4.0.45-1.x86_64/usr/share/YaST2/lib/autoinstall'
[ 9s] /usr/bin/mkdir -p
'/home/abuild/rpmbuild/BUILDROOT/autoyast2-4.0.45-1.x86_64/usr/share/YaST2/include/autoinstall'
[ 9s] /usr/bin/install -c -p -m 644 include/autoinstall/DriveDialog.rb
include/autoinstall/io.rb include/autoinstall/wizards.rb
include/autoinstall/autoinst_dialogs.rb include/autoinstall/classes.rb
include/autoinstall/types.rb include/autoinstall/PartitionDialog.rb
include/autoinstall/StorageDialog.rb include/autoinstall/tree.rb
include/autoinstall/common.rb include/autoinstall/dialogs.rb
include/autoinstall/AdvancedPartitionDialog.rb include/autoinstall/ask.rb
include/autoinstall/VolgroupDialog.rb include/autoinstall/xml.rb
include/autoinstall/script_dialogs.rb include/autoinstall/conftree.rb
include/autoinstall/helps.rb include/autoinstall/general_dialogs.rb
'/home/abuild/rpmbuild/BUILDROOT/autoyast2-4.0.45-1.x86_64/usr/share/YaST2/include/autoinstall'
[ 9s] make[2]: Leaving directory
'/home/abuild/rpmbuild/BUILD/autoyast2-4.0.45/src'
[ 9s] make[1]: Leaving directory
'/home/abuild/rpmbuild/BUILD/autoyast2-4.0.45/src'
[ 9s] Making install in test
[ 9s] make[1]: Entering directory
'/home/abuild/rpmbuild/BUILD/autoyast2-4.0.45/test'
[ 9s] make[2]: Entering directory
'/home/abuild/rpmbuild/BUILD/autoyast2-4.0.45/test'
[ 9s] make[2]: Nothing to be done for 'install-exec-am'.
[ 9s] make[2]: Nothing to be done for 'install-data-am'.
[ 9s] make[2]: Leaving directory
'/home/abuild/rpmbuild/BUILD/autoyast2-4.0.45/test'
[ 9s] make[1]: Leaving directory
'/home/abuild/rpmbuild/BUILD/autoyast2-4.0.45/test'
[ 9s] Making install in xslt
[ 9s] make[1]: Entering directory
'/home/abuild/rpmbuild/BUILD/autoyast2-4.0.45/xslt'
[ 9s] make[2]: Entering directory
'/home/abuild/rpmbuild/BUILD/autoyast2-4.0.45/xslt'
[ 9s] make[3]: Entering directory
'/home/abuild/rpmbuild/BUILD/autoyast2-4.0.45/xslt'
[ 9s] make[3]: Nothing to be done for 'install-exec-am'.
[ 9s] /usr/bin/mkdir -p
'/home/abuild/rpmbuild/BUILDROOT/autoyast2-4.0.45-1.x86_64/usr/share/autoinstall/xslt'
[ 9s] /usr/bin/install -c -p -m 644 merge.xslt
'/home/abuild/rpmbuild/BUILDROOT/autoyast2-4.0.45-1.x86_64/usr/share/autoinstall/xslt'
[ 9s] make[3]: Leaving directory
'/home/abuild/rpmbuild/BUILD/autoyast2-4.0.45/xslt'
[ 9s] make[2]: Leaving directory
'/home/abuild/rpmbuild/BUILD/autoyast2-4.0.45/xslt'
[ 9s] make[1]: Leaving directory
'/home/abuild/rpmbuild/BUILD/autoyast2-4.0.45/xslt'
[ 9s] make[1]: Entering directory
'/home/abuild/rpmbuild/BUILD/autoyast2-4.0.45'
[ 9s] make[2]: Entering directory
'/home/abuild/rpmbuild/BUILD/autoyast2-4.0.45'
[ 9s] make[2]: Nothing to be done for 'install-exec-am'.
[ 9s] /usr/bin/mkdir -p
'/home/abuild/rpmbuild/BUILDROOT/autoyast2-4.0.45-1.x86_64/usr/share/doc/packages/autoyast2'
[ 9s] /usr/bin/install -c -p -m 644 COPYING
'/home/abuild/rpmbuild/BUILDROOT/autoyast2-4.0.45-1.x86_64/usr/share/doc/packages/autoyast2'
[ 9s] make[2]: Leaving directory
'/home/abuild/rpmbuild/BUILD/autoyast2-4.0.45'
[ 9s] make[1]: Leaving directory
'/home/abuild/rpmbuild/BUILD/autoyast2-4.0.45'
[ 9s] + '[' '!' -f /usr/share/YaST2/data/devtools/NO_MAKE_CHECK ']'
[ 9s] + '[' -f configure.in.in -o -f configure.ac.in ']'
[ 9s] + /usr/bin/make check -j2 VERBOSE=1
Y2DIR=/home/abuild/rpmbuild/BUILDROOT/autoyast2-4.0.45-1.x86_64//usr/share/YaST2
DESTDIR=/home/abuild/rpmbuild/BUILDROOT/autoyast2-4.0.45-1.x86_64
[ 9s] Making check in control
[ 9s] make[1]: Entering directory
'/home/abuild/rpmbuild/BUILD/autoyast2-4.0.45/control'
[ 9s] /usr/bin/make check-local
[ 9s] make[2]: Entering directory
'/home/abuild/rpmbuild/BUILD/autoyast2-4.0.45/control'
[ 9s] xmllint --relaxng /usr/share/YaST2/control/control.rng --noout
control_continue_autoyast.xml
[ 9s] control_continue_autoyast.xml validates
[ 9s] make[2]: Leaving directory
'/home/abuild/rpmbuild/BUILD/autoyast2-4.0.45/control'
[ 9s] make[1]: Leaving directory
'/home/abuild/rpmbuild/BUILD/autoyast2-4.0.45/control'
[ 9s] Making check in modconfig
[ 9s] make[1]: Entering directory
'/home/abuild/rpmbuild/BUILD/autoyast2-4.0.45/modconfig'
[ 9s] make[1]: Nothing to be done for 'check'.
[ 9s] make[1]: Leaving directory
'/home/abuild/rpmbuild/BUILD/autoyast2-4.0.45/modconfig'
[ 9s] Making check in scripts
[ 9s] make[1]: Entering directory
'/home/abuild/rpmbuild/BUILD/autoyast2-4.0.45/scripts'
[ 9s] make[1]: Nothing to be done for 'check'.
[ 9s] make[1]: Leaving directory
'/home/abuild/rpmbuild/BUILD/autoyast2-4.0.45/scripts'
[ 9s] Making check in src
[ 9s] make[1]: Entering directory
'/home/abuild/rpmbuild/BUILD/autoyast2-4.0.45/src'
[ 9s] make[1]: Nothing to be done for 'check'.
[ 9s] make[1]: Leaving directory
'/home/abuild/rpmbuild/BUILD/autoyast2-4.0.45/src'
[ 9s] Making check in test
[ 9s] make[1]: Entering directory
'/home/abuild/rpmbuild/BUILD/autoyast2-4.0.45/test'
[ 9s] /usr/bin/make check-TESTS
[ 9s] make[2]: Entering directory
'/home/abuild/rpmbuild/BUILD/autoyast2-4.0.45/test'
[ 9s] make[3]: Entering directory
'/home/abuild/rpmbuild/BUILD/autoyast2-4.0.45/test'
[ 10s] PASS: AutoInstall_test.rb
[ 10s] FAIL: AutoInstallRules_test.rb
[ 11s] PASS: AutoinstClass_test.rb
[ 11s] PASS: AutoinstConfig_test.rb
[ 11s] PASS: AutoinstFunctions_test.rb
[ 12s] PASS: AutoinstGeneral_test.rb
[ 13s] PASS: AutoinstPartPlan_test.rb
[ 13s] PASS: AutoinstSoftware_test.rb
[ 14s] PASS: autoinst_storage_test.rb
[ 15s] PASS: profile_test.rb
[ 15s] PASS: Y2ModuleConfig_test.rb
[ 15s] PASS: include/ask_test.rb
[ 16s] PASS: lib/activate_callbacks_test.rb
[ 16s] PASS: lib/pkg_gpg_check_handler_test.rb
[ 16s] PASS: lib/module_config_builder_test.rb
[ 17s] PASS: lib/partitioning_preprocessor_test.rb
[ 17s] PASS: lib/storage_proposal_issues_presenter_test.rb
[ 18s] PASS: lib/storage_proposal_test.rb
[ 18s] PASS: lib/clients/ayast_probe_test.rb
[ 18s] PASS: lib/dialogs/question_test.rb
[ 19s] PASS: lib/dialogs/disk_selector_test.rb
[ 19s] ===========================================
[ 19s] autoyast2 4.0.45: test/test-suite.log
[ 19s] ===========================================
[ 19s]
[ 19s] # TOTAL: 21
[ 19s] # PASS: 20
[ 19s] # SKIP: 0
[ 19s] # XFAIL: 0
[ 19s] # FAIL: 1
[ 19s] # XPASS: 0
[ 19s] # ERROR: 0
[ 19s]
[ 19s] .. contents:: :depth: 2
[ 19s]
[ 19s] FAIL: AutoInstallRules_test
[ 19s] ===========================
[ 19s]
[ 19s] F.....FFF...
[ 19s]
[ 19s] Failures:
[ 19s]
[ 19s] 1) Yast::AutoInstallRules #ProbeRules detect system properties
[ 19s] Failure/Error:
[ 19s] allow(Y2Storage::StorageManager.instance).to receive(:probed)
[ 19s] .and_return(devicegraph)
[ 19s]
[ 19s] Storage::LockException:
[ 19s] Storage::LockException
[ 19s] # /usr/share/YaST2/lib/y2storage/storage_manager.rb:86:in
`initialize'
[ 19s] # /usr/share/YaST2/lib/y2storage/storage_manager.rb:86:in `new'
[ 19s] # /usr/share/YaST2/lib/y2storage/storage_manager.rb:86:in
`initialize'
[ 19s] # /usr/share/YaST2/lib/y2storage/storage_manager.rb:492:in `new'
[ 19s] # /usr/share/YaST2/lib/y2storage/storage_manager.rb:492:in
`create_instance'
[ 19s] # /usr/share/YaST2/lib/y2storage/storage_manager.rb:475:in
`instance'
[ 19s] # ./AutoInstallRules_test.rb:20:in `block (3 levels) in <top
(required)>'
[ 19s]
[ 19s] 2) Yast::AutoInstallRules #Rules XML Reading rules with -or- operator
[ 19s] Failure/Error: subject.Read
[ 19s]
[ 19s] Storage::LockException:
[ 19s] Storage::LockException
[ 19s] # /usr/share/YaST2/lib/y2storage/storage_manager.rb:86:in
`initialize'
[ 19s] # /usr/share/YaST2/lib/y2storage/storage_manager.rb:86:in `new'
[ 19s] # /usr/share/YaST2/lib/y2storage/storage_manager.rb:86:in
`initialize'
[ 19s] # /usr/share/YaST2/lib/y2storage/storage_manager.rb:492:in `new'
[ 19s] # /usr/share/YaST2/lib/y2storage/storage_manager.rb:492:in
`create_instance'
[ 19s] # /usr/share/YaST2/lib/y2storage/storage_manager.rb:475:in
`instance'
[ 19s] #
/home/abuild/rpmbuild/BUILD/autoyast2-4.0.45/src/modules/AutoInstallRules.rb:278:in
`ProbeRules'
[ 19s] #
/home/abuild/rpmbuild/BUILD/autoyast2-4.0.45/src/modules/AutoInstallRules.rb:454:in
`Read'
[ 19s] # ./AutoInstallRules_test.rb:130:in `block (3 levels) in <top
(required)>'
[ 19s]
[ 19s] 3) Yast::AutoInstallRules #Rules XML Reading rules with -and-
operator
[ 19s] Failure/Error: subject.Read
[ 19s]
[ 19s] Yast::SCR received :Execute with unexpected arguments
[ 19s] expected: (#<Yast::Path:0x0000000004090b38
@components=["target", "bash_output"]>, "if ( [ \"$hostaddress\" =
\"10.69.57.43\" ] ) && ( [ \"$mac\" = \"000c2903d288\" ] ); then exit 0;
else exit 1; fi", {"hostaddress"=>"10.160.1.87", "mac"=>""})
[ 19s] got: (#<Yast::Path:0x00000000040ac0b8
@components=["target", "bash_output"]>, "if ( [ \"$hostaddress\" =
\"10.69.57.43\" ] ) && ( [ \"$mac\" = \"000c2903d288\" ] ); then exit 0;
else exit 1; fi", {"hostaddress"=>"", "mac"=>""})
[ 19s] Diff:
[ 19s]
[ 19s] @@ -1,4 +1,4 @@
[ 19s] -[#<Yast::Path:0x0000000004090b38 @components=["target",
"bash_output"]>,
[ 19s] +[#<Yast::Path:0x00000000040ac0b8 @components=["target",
"bash_output"]>,
[ 19s] "if ( [ \"$hostaddress\" = \"10.69.57.43\" ] ) && ( [
\"$mac\" = \"000c2903d288\" ] ); then exit 0; else exit 1; fi",
[ 19s] - {"hostaddress"=>"10.160.1.87", "mac"=>""}]
[ 19s] + {"hostaddress"=>"", "mac"=>""}]
[ 19s] #
/home/abuild/rpmbuild/BUILD/autoyast2-4.0.45/src/modules/AutoInstallRules.rb:402:in
`verifyrules'
[ 19s] #
/home/abuild/rpmbuild/BUILD/autoyast2-4.0.45/src/modules/AutoInstallRules.rb:609:in
`block (2 levels) in Read'
[ 19s] #
/home/abuild/rpmbuild/BUILD/autoyast2-4.0.45/src/modules/AutoInstallRules.rb:465:in
`block in Read'
[ 19s] #
/home/abuild/rpmbuild/BUILD/autoyast2-4.0.45/src/modules/AutoInstallRules.rb:455:in
`Read'
[ 19s] # ./AutoInstallRules_test.rb:150:in `block (3 levels) in <top
(required)>'
[ 19s]
[ 19s] 4) Yast::AutoInstallRules #Rules XML Reading rules with default
operator
[ 19s] Failure/Error: subject.Read
[ 19s]
[ 19s] Yast::SCR received :Execute with unexpected arguments
[ 19s] expected: (#<Yast::Path:0x000000000416fa90
@components=["target", "bash_output"]>, "if ( [ \"$hostaddress\" =
\"10.69.57.43\" ] ) && ( [ \"$mac\" = \"000c2903d288\" ] ); then exit 0;
else exit 1; fi", {"hostaddress"=>"10.160.1.87", "mac"=>""})
[ 19s] got: (#<Yast::Path:0x0000000004187078
@components=["target", "bash_output"]>, "if ( [ \"$hostaddress\" =
\"10.69.57.43\" ] ) && ( [ \"$mac\" = \"000c2903d288\" ] ); then exit 0;
else exit 1; fi", {"hostaddress"=>"", "mac"=>""})
[ 19s] Diff:
[ 19s]
[ 19s] @@ -1,4 +1,4 @@
[ 19s] -[#<Yast::Path:0x000000000416fa90 @components=["target",
"bash_output"]>,
[ 19s] +[#<Yast::Path:0x0000000004187078 @components=["target",
"bash_output"]>,
[ 19s] "if ( [ \"$hostaddress\" = \"10.69.57.43\" ] ) && ( [
\"$mac\" = \"000c2903d288\" ] ); then exit 0; else exit 1; fi",
[ 19s] - {"hostaddress"=>"10.160.1.87", "mac"=>""}]
[ 19s] + {"hostaddress"=>"", "mac"=>""}]
[ 19s] #
/home/abuild/rpmbuild/BUILD/autoyast2-4.0.45/src/modules/AutoInstallRules.rb:402:in
`verifyrules'
[ 19s] #
/home/abuild/rpmbuild/BUILD/autoyast2-4.0.45/src/modules/AutoInstallRules.rb:609:in
`block (2 levels) in Read'
[ 19s] #
/home/abuild/rpmbuild/BUILD/autoyast2-4.0.45/src/modules/AutoInstallRules.rb:465:in
`block in Read'
[ 19s] #
/home/abuild/rpmbuild/BUILD/autoyast2-4.0.45/src/modules/AutoInstallRules.rb:455:in
`Read'
[ 19s] # ./AutoInstallRules_test.rb:169:in `block (3 levels) in <top
(required)>'
[ 19s]
[ 19s] Finished in 0.15461 seconds (files took 0.77445 seconds to load)
[ 19s] 12 examples, 4 failures
[ 19s]
[ 19s] Failed examples:
[ 19s]
[ 19s] rspec ./AutoInstallRules_test.rb:19 # Yast::AutoInstallRules
#ProbeRules detect system properties
[ 19s] rspec ./AutoInstallRules_test.rb:113 # Yast::AutoInstallRules #Rules
XML Reading rules with -or- operator
[ 19s] rspec ./AutoInstallRules_test.rb:133 # Yast::AutoInstallRules #Rules
XML Reading rules with -and- operator
[ 19s] rspec ./AutoInstallRules_test.rb:153 # Yast::AutoInstallRules #Rules
XML Reading rules with default operator
[ 19s]
[ 19s] FAIL AutoInstallRules_test.rb (exit status: 1)
[ 19s]
[ 19s]
============================================================================
[ 19s] Testsuite summary for autoyast2 4.0.45
[ 19s]
============================================================================
[ 19s] # TOTAL: 21
[ 19s] # PASS: 20
[ 19s] # SKIP: 0
[ 19s] # XFAIL: 0
[ 19s] # FAIL: 1
[ 19s] # XPASS: 0
[ 19s] # ERROR: 0
[ 19s]
============================================================================
[ 19s] See test/test-suite.log
[ 19s] Please report to http://bugs.opensuse.org/
[ 19s]
============================================================================
[ 19s] make[3]: *** [Makefile:522: test-suite.log] Error 1
[ 19s] make[3]: Leaving directory
'/home/abuild/rpmbuild/BUILD/autoyast2-4.0.45/test'
[ 19s] make[2]: *** [Makefile:630: check-TESTS] Error 2
[ 19s] make[2]: Leaving directory
'/home/abuild/rpmbuild/BUILD/autoyast2-4.0.45/test'
[ 19s] make[1]: *** [Makefile:686: check-am] Error 2
[ 19s] make[1]: Leaving directory
'/home/abuild/rpmbuild/BUILD/autoyast2-4.0.45/test'
[ 19s] make: *** [Makefile:497: check-recursive] Error 1
[ 19s] error: Bad exit status from /var/tmp/rpm-tmp.eFiYXx (%install)
[ 19s]
[ 19s]
[ 19s] RPM build errors:
[ 19s] Bad exit status from /var/tmp/rpm-tmp.eFiYXx (%install)
[ 19s]
[ 19s] yast-ci-worker-3 failed "build autoyast2.spec" at Tue Apr 3 15:34:10
UTC 2018.
[ 19s]

The buildroot was: /var/tmp/build-root-SUSE_SLE-15_GA
rm -rf Devel:YaST:Head
rake aborted!
Command failed with status (1): [yes | osc -A 'https://api.suse.de/' build ...]

Tasks: TOP => osc:sr => osc:commit => osc:build
(See full trace by running task with --trace)
cleaning
Build step 'Execute shell' marked build as failure
Not sending mail to unregistered user jlopez@xxxxxxxx

< Previous Next >
Follow Ups
References