Mailinglist Archive: yast-commit (619 mails)

< Previous Next >
[yast-commit] Build failed in Jenkins: autoyast-profiles-test #832
  • From: jenkins@xxxxxxx
  • Date: Sat, 17 Feb 2018 00:03:35 +0000 (UTC)
  • Message-id: <-437446520.209.1518825815295.JavaMail.jenkins@ci>
See <https://ci.suse.de/job/autoyast-profiles-test/832/display/redirect>

------------------------------------------
[...truncated 18.25 KB...]
Retrieving: repomd.xml.asc [done]
Retrieving: repomd.xml.key [done]
Retrieving: repomd.xml [done]
Retrieving:
873dcb429a0778f1e29947549c0448694a7716b6235dce52bd0743c7472c5715-app-icons.tar.gz
[done]
Retrieving:
ca2a2bdee6b9efda88ce3b754673a569b9bf1a50e0bd14b617c76ceda66dd120-appdata.xml.gz
[done]
Retrieving:
d0866958f18efd8aca5bec598811fefa5ad3ebfa7cc343e5a0eeae0e42fa4325-primary.xml.gz
[done]
Retrieving:
b503b198b5a9b8e63aa1c4de77c9fb9260234466565ecbdfaf8fe7f8e982f2c7-susedata.xml.gz
[done]
Loading repository data...
Repository 'temporary_1' not cached. Caching...
Building repository 'temporary_1' cache [....done]
Repository 'temporary_2' not cached. Caching...
Building repository 'temporary_2' cache [....done]
yast2-schema:
yast2-schema-3.1.0.2-1.27.noarch (temporary_1)
yast2-schema-3.1.0-1.217.noarch (temporary_2)
yast2-schema-3.1.0-1.333.noarch (temporary_2)
yast2-schema-3.1.0-1.474.noarch (temporary_2)
Prune to best version...
Retrieving package yast2-schema-3.1.0.2-1.27.noarch (1/1), 77.8 KiB ( 1.1 MiB
unpacked)
Retrieving: yast2-schema-3.1.0.2-1.27.noarch.rpm [......done]
.done]

download: Done.
Installing
/tmp/schema-validation_sle-12_20180217-23714-f9mshw/var/cache/zypp/packages/temporary_1/noarch/yast2-schema-3.1.0.2-1.27.noarch.rpm
to /tmp/schema-validation_sle-12_20180217-23714-f9mshw
Preparing packages...
yast2-schema-3.1.0.2-1.27.noarch

Test will use latest schema from:
/tmp/schema-validation_sle-12_20180217-23714-f9mshw/usr/share/YaST2/schema/autoyast/rng/profile.rng

When checking correct profiles stored in
<https://ci.suse.de/job/autoyast-profiles-test/ws/test/sle-12-sp2-s390/correct,>
Profile
<https://ci.suse.de/job/autoyast-profiles-test/ws/test/sle-12-sp2-s390/correct/sles-12-sp1-944349-s390.xml>
Checking
<https://ci.suse.de/job/autoyast-profiles-test/ws/test/sle-12-sp2-s390/correct/sles-12-sp1-944349-s390.xml>
according to
/tmp/schema-validation_sle-12-sp2-s390_20180217-23714-1llcya7/usr/share/YaST2/schema/autoyast/rng/profile.rng
passes validation according to schema

When checking correct profiles stored in
<https://ci.suse.de/job/autoyast-profiles-test/ws/test/Head/correct,>
Profile
<https://ci.suse.de/job/autoyast-profiles-test/ws/test/Head/correct/sles-12-sp1-954291-bad.xml>
Checking
<https://ci.suse.de/job/autoyast-profiles-test/ws/test/Head/correct/sles-12-sp1-954291-bad.xml>
according to
/tmp/schema-validation_Head_20180217-23714-1tzlnu7/usr/share/YaST2/schema/autoyast/rng/profile.rng

passes validation according to schema (FAILED - 1)
Profile
<https://ci.suse.de/job/autoyast-profiles-test/ws/test/Head/correct/sles-12-949193.xml>
Checking
<https://ci.suse.de/job/autoyast-profiles-test/ws/test/Head/correct/sles-12-949193.xml>
according to
/tmp/schema-validation_Head_20180217-23714-1tzlnu7/usr/share/YaST2/schema/autoyast/rng/profile.rng

passes validation according to schema (FAILED - 2)
Profile
<https://ci.suse.de/job/autoyast-profiles-test/ws/test/Head/correct/opensuse-13.2-full_clone.xml>
Checking
<https://ci.suse.de/job/autoyast-profiles-test/ws/test/Head/correct/opensuse-13.2-full_clone.xml>
according to
/tmp/schema-validation_Head_20180217-23714-1tzlnu7/usr/share/YaST2/schema/autoyast/rng/profile.rng

passes validation according to schema (FAILED - 3)
Profile
<https://ci.suse.de/job/autoyast-profiles-test/ws/test/Head/correct/sles-12-minimalistic.xml>
Checking
<https://ci.suse.de/job/autoyast-profiles-test/ws/test/Head/correct/sles-12-minimalistic.xml>
according to
/tmp/schema-validation_Head_20180217-23714-1tzlnu7/usr/share/YaST2/schema/autoyast/rng/profile.rng

passes validation according to schema (FAILED - 4)
Profile
<https://ci.suse.de/job/autoyast-profiles-test/ws/test/Head/correct/sles-12-sp1-954291-good.xml>
Checking
<https://ci.suse.de/job/autoyast-profiles-test/ws/test/Head/correct/sles-12-sp1-954291-good.xml>
according to
/tmp/schema-validation_Head_20180217-23714-1tzlnu7/usr/share/YaST2/schema/autoyast/rng/profile.rng

passes validation according to schema (FAILED - 5)
Profile
<https://ci.suse.de/job/autoyast-profiles-test/ws/test/Head/correct/sles-12-sp1-955217.xml>
Checking
<https://ci.suse.de/job/autoyast-profiles-test/ws/test/Head/correct/sles-12-sp1-955217.xml>
according to
/tmp/schema-validation_Head_20180217-23714-1tzlnu7/usr/share/YaST2/schema/autoyast/rng/profile.rng

passes validation according to schema (FAILED - 6)
Profile
<https://ci.suse.de/job/autoyast-profiles-test/ws/test/Head/correct/sles-12-sp1-941406.xml>
Checking
<https://ci.suse.de/job/autoyast-profiles-test/ws/test/Head/correct/sles-12-sp1-941406.xml>
according to
/tmp/schema-validation_Head_20180217-23714-1tzlnu7/usr/share/YaST2/schema/autoyast/rng/profile.rng

passes validation according to schema (FAILED - 7)
Profile
<https://ci.suse.de/job/autoyast-profiles-test/ws/test/Head/correct/sles-11-sp3.xml>
Checking
<https://ci.suse.de/job/autoyast-profiles-test/ws/test/Head/correct/sles-11-sp3.xml>
according to
/tmp/schema-validation_Head_20180217-23714-1tzlnu7/usr/share/YaST2/schema/autoyast/rng/profile.rng

passes validation according to schema (FAILED - 8)

When checking incorrect profiles,
Profile deploy_image.xml
Checking deploy_image.xml according to
/tmp/schema-validation_Head_20180217-23714-1tzlnu7/usr/share/YaST2/schema/autoyast/rng/profile.rng

complains about wrong deploy_images definition (FAILED - 9)

When checking correct profiles stored in
<https://ci.suse.de/job/autoyast-profiles-test/ws/test/sle-12-sp1/correct,>
Profile
<https://ci.suse.de/job/autoyast-profiles-test/ws/test/sle-12-sp1/correct/sles-12-sp1-955217.xml>
Checking
<https://ci.suse.de/job/autoyast-profiles-test/ws/test/sle-12-sp1/correct/sles-12-sp1-955217.xml>
according to
/tmp/schema-validation_sle-12-sp1_20180217-23714-dm6eic/usr/share/YaST2/schema/autoyast/rng/profile.rng
passes validation according to schema

When checking correct profiles stored in
<https://ci.suse.de/job/autoyast-profiles-test/ws/test/sle-11-sp4/correct,>
Profile
<https://ci.suse.de/job/autoyast-profiles-test/ws/test/sle-11-sp4/correct/minimalistic.xml>
Checking
<https://ci.suse.de/job/autoyast-profiles-test/ws/test/sle-11-sp4/correct/minimalistic.xml>
according to
/tmp/schema-validation_sle-11-sp4_20180217-23714-t6xqdc/usr/share/YaST2/schema/autoyast/rng/profile.rng
passes validation according to schema

When checking correct profiles stored in
<https://ci.suse.de/job/autoyast-profiles-test/ws/test/sle-12/correct,>
Profile
<https://ci.suse.de/job/autoyast-profiles-test/ws/test/sle-12/correct/minimalistic.xml>
Checking
<https://ci.suse.de/job/autoyast-profiles-test/ws/test/sle-12/correct/minimalistic.xml>
according to
/tmp/schema-validation_sle-12_20180217-23714-f9mshw/usr/share/YaST2/schema/autoyast/rng/profile.rng
passes validation according to schema
Removing temporary directory /tmp/schema-validation_sle-12_20180217-23714-f9mshw
Removing temporary directory
/tmp/schema-validation_sle-11-sp4_20180217-23714-t6xqdc
Removing temporary directory
/tmp/schema-validation_sle-12-sp1_20180217-23714-dm6eic
Removing temporary directory /tmp/schema-validation_Head_20180217-23714-1tzlnu7
Removing temporary directory
/tmp/schema-validation_sle-12-sp2-s390_20180217-23714-1llcya7

Failures:

1) When checking correct profiles stored in
<https://ci.suse.de/job/autoyast-profiles-test/ws/test/Head/correct,> Profile
<https://ci.suse.de/job/autoyast-profiles-test/ws/test/Head/correct/sles-12-sp1-954291-bad.xml>
passes validation according to schema
Failure/Error: DEFAULT_FAILURE_NOTIFIER = lambda { |failure, _opts| raise
failure }

expected: ""
got:
"/tmp/schema-validation_Head_20180217-23714-1tzlnu7/usr/share/YaST2/schema/autoyast/rng/networking.rn...2/schema/autoyast/rng/firewall.rng:348:33:
error: reference to undefined pattern \"default_zone\"\n"

(compared using ==)

Diff:
@@ -1 +1,4 @@

+/tmp/schema-validation_Head_20180217-23714-1tzlnu7/usr/share/YaST2/schema/autoyast/rng/networking.rng:70:29:
error: multiple definitions of "interfaces" without "combine" attribute

+/tmp/schema-validation_Head_20180217-23714-1tzlnu7/usr/share/YaST2/schema/autoyast/rng/services-manager.rng:122:27:
error: multiple definitions of "services" without "combine" attribute

+/tmp/schema-validation_Head_20180217-23714-1tzlnu7/usr/share/YaST2/schema/autoyast/rng/firewall.rng:348:33:
error: reference to undefined pattern "default_zone"
# ./test/profile_test_helper.rb:121:in `block (4 levels) in
validate_correct_profiles'

2) When checking correct profiles stored in
<https://ci.suse.de/job/autoyast-profiles-test/ws/test/Head/correct,> Profile
<https://ci.suse.de/job/autoyast-profiles-test/ws/test/Head/correct/sles-12-949193.xml>
passes validation according to schema
Failure/Error: DEFAULT_FAILURE_NOTIFIER = lambda { |failure, _opts| raise
failure }

expected: ""
got:
"/tmp/schema-validation_Head_20180217-23714-1tzlnu7/usr/share/YaST2/schema/autoyast/rng/networking.rn...2/schema/autoyast/rng/firewall.rng:348:33:
error: reference to undefined pattern \"default_zone\"\n"

(compared using ==)

Diff:
@@ -1 +1,4 @@

+/tmp/schema-validation_Head_20180217-23714-1tzlnu7/usr/share/YaST2/schema/autoyast/rng/networking.rng:70:29:
error: multiple definitions of "interfaces" without "combine" attribute

+/tmp/schema-validation_Head_20180217-23714-1tzlnu7/usr/share/YaST2/schema/autoyast/rng/services-manager.rng:122:27:
error: multiple definitions of "services" without "combine" attribute

+/tmp/schema-validation_Head_20180217-23714-1tzlnu7/usr/share/YaST2/schema/autoyast/rng/firewall.rng:348:33:
error: reference to undefined pattern "default_zone"
# ./test/profile_test_helper.rb:121:in `block (4 levels) in
validate_correct_profiles'

3) When checking correct profiles stored in
<https://ci.suse.de/job/autoyast-profiles-test/ws/test/Head/correct,> Profile
<https://ci.suse.de/job/autoyast-profiles-test/ws/test/Head/correct/opensuse-13.2-full_clone.xml>
passes validation according to schema
Failure/Error: DEFAULT_FAILURE_NOTIFIER = lambda { |failure, _opts| raise
failure }

expected: ""
got:
"/tmp/schema-validation_Head_20180217-23714-1tzlnu7/usr/share/YaST2/schema/autoyast/rng/networking.rn...2/schema/autoyast/rng/firewall.rng:348:33:
error: reference to undefined pattern \"default_zone\"\n"

(compared using ==)

Diff:
@@ -1 +1,4 @@

+/tmp/schema-validation_Head_20180217-23714-1tzlnu7/usr/share/YaST2/schema/autoyast/rng/networking.rng:70:29:
error: multiple definitions of "interfaces" without "combine" attribute

+/tmp/schema-validation_Head_20180217-23714-1tzlnu7/usr/share/YaST2/schema/autoyast/rng/services-manager.rng:122:27:
error: multiple definitions of "services" without "combine" attribute

+/tmp/schema-validation_Head_20180217-23714-1tzlnu7/usr/share/YaST2/schema/autoyast/rng/firewall.rng:348:33:
error: reference to undefined pattern "default_zone"
# ./test/profile_test_helper.rb:121:in `block (4 levels) in
validate_correct_profiles'

4) When checking correct profiles stored in
<https://ci.suse.de/job/autoyast-profiles-test/ws/test/Head/correct,> Profile
<https://ci.suse.de/job/autoyast-profiles-test/ws/test/Head/correct/sles-12-minimalistic.xml>
passes validation according to schema
Failure/Error: DEFAULT_FAILURE_NOTIFIER = lambda { |failure, _opts| raise
failure }

expected: ""
got:
"/tmp/schema-validation_Head_20180217-23714-1tzlnu7/usr/share/YaST2/schema/autoyast/rng/networking.rn...2/schema/autoyast/rng/firewall.rng:348:33:
error: reference to undefined pattern \"default_zone\"\n"

(compared using ==)

Diff:
@@ -1 +1,4 @@

+/tmp/schema-validation_Head_20180217-23714-1tzlnu7/usr/share/YaST2/schema/autoyast/rng/networking.rng:70:29:
error: multiple definitions of "interfaces" without "combine" attribute

+/tmp/schema-validation_Head_20180217-23714-1tzlnu7/usr/share/YaST2/schema/autoyast/rng/services-manager.rng:122:27:
error: multiple definitions of "services" without "combine" attribute

+/tmp/schema-validation_Head_20180217-23714-1tzlnu7/usr/share/YaST2/schema/autoyast/rng/firewall.rng:348:33:
error: reference to undefined pattern "default_zone"
# ./test/profile_test_helper.rb:121:in `block (4 levels) in
validate_correct_profiles'

5) When checking correct profiles stored in
<https://ci.suse.de/job/autoyast-profiles-test/ws/test/Head/correct,> Profile
<https://ci.suse.de/job/autoyast-profiles-test/ws/test/Head/correct/sles-12-sp1-954291-good.xml>
passes validation according to schema
Failure/Error: DEFAULT_FAILURE_NOTIFIER = lambda { |failure, _opts| raise
failure }

expected: ""
got:
"/tmp/schema-validation_Head_20180217-23714-1tzlnu7/usr/share/YaST2/schema/autoyast/rng/networking.rn...2/schema/autoyast/rng/firewall.rng:348:33:
error: reference to undefined pattern \"default_zone\"\n"

(compared using ==)

Diff:
@@ -1 +1,4 @@

+/tmp/schema-validation_Head_20180217-23714-1tzlnu7/usr/share/YaST2/schema/autoyast/rng/networking.rng:70:29:
error: multiple definitions of "interfaces" without "combine" attribute

+/tmp/schema-validation_Head_20180217-23714-1tzlnu7/usr/share/YaST2/schema/autoyast/rng/services-manager.rng:122:27:
error: multiple definitions of "services" without "combine" attribute

+/tmp/schema-validation_Head_20180217-23714-1tzlnu7/usr/share/YaST2/schema/autoyast/rng/firewall.rng:348:33:
error: reference to undefined pattern "default_zone"
# ./test/profile_test_helper.rb:121:in `block (4 levels) in
validate_correct_profiles'

6) When checking correct profiles stored in
<https://ci.suse.de/job/autoyast-profiles-test/ws/test/Head/correct,> Profile
<https://ci.suse.de/job/autoyast-profiles-test/ws/test/Head/correct/sles-12-sp1-955217.xml>
passes validation according to schema
Failure/Error: DEFAULT_FAILURE_NOTIFIER = lambda { |failure, _opts| raise
failure }

expected: ""
got:
"/tmp/schema-validation_Head_20180217-23714-1tzlnu7/usr/share/YaST2/schema/autoyast/rng/networking.rn...2/schema/autoyast/rng/firewall.rng:348:33:
error: reference to undefined pattern \"default_zone\"\n"

(compared using ==)

Diff:
@@ -1 +1,4 @@

+/tmp/schema-validation_Head_20180217-23714-1tzlnu7/usr/share/YaST2/schema/autoyast/rng/networking.rng:70:29:
error: multiple definitions of "interfaces" without "combine" attribute

+/tmp/schema-validation_Head_20180217-23714-1tzlnu7/usr/share/YaST2/schema/autoyast/rng/services-manager.rng:122:27:
error: multiple definitions of "services" without "combine" attribute

+/tmp/schema-validation_Head_20180217-23714-1tzlnu7/usr/share/YaST2/schema/autoyast/rng/firewall.rng:348:33:
error: reference to undefined pattern "default_zone"
# ./test/profile_test_helper.rb:121:in `block (4 levels) in
validate_correct_profiles'

7) When checking correct profiles stored in
<https://ci.suse.de/job/autoyast-profiles-test/ws/test/Head/correct,> Profile
<https://ci.suse.de/job/autoyast-profiles-test/ws/test/Head/correct/sles-12-sp1-941406.xml>
passes validation according to schema
Failure/Error: DEFAULT_FAILURE_NOTIFIER = lambda { |failure, _opts| raise
failure }

expected: ""
got:
"/tmp/schema-validation_Head_20180217-23714-1tzlnu7/usr/share/YaST2/schema/autoyast/rng/networking.rn...2/schema/autoyast/rng/firewall.rng:348:33:
error: reference to undefined pattern \"default_zone\"\n"

(compared using ==)

Diff:
@@ -1 +1,4 @@

+/tmp/schema-validation_Head_20180217-23714-1tzlnu7/usr/share/YaST2/schema/autoyast/rng/networking.rng:70:29:
error: multiple definitions of "interfaces" without "combine" attribute

+/tmp/schema-validation_Head_20180217-23714-1tzlnu7/usr/share/YaST2/schema/autoyast/rng/services-manager.rng:122:27:
error: multiple definitions of "services" without "combine" attribute

+/tmp/schema-validation_Head_20180217-23714-1tzlnu7/usr/share/YaST2/schema/autoyast/rng/firewall.rng:348:33:
error: reference to undefined pattern "default_zone"
# ./test/profile_test_helper.rb:121:in `block (4 levels) in
validate_correct_profiles'

8) When checking correct profiles stored in
<https://ci.suse.de/job/autoyast-profiles-test/ws/test/Head/correct,> Profile
<https://ci.suse.de/job/autoyast-profiles-test/ws/test/Head/correct/sles-11-sp3.xml>
passes validation according to schema
Failure/Error: DEFAULT_FAILURE_NOTIFIER = lambda { |failure, _opts| raise
failure }

expected: ""
got:
"/tmp/schema-validation_Head_20180217-23714-1tzlnu7/usr/share/YaST2/schema/autoyast/rng/networking.rn...2/schema/autoyast/rng/firewall.rng:348:33:
error: reference to undefined pattern \"default_zone\"\n"

(compared using ==)

Diff:
@@ -1 +1,4 @@

+/tmp/schema-validation_Head_20180217-23714-1tzlnu7/usr/share/YaST2/schema/autoyast/rng/networking.rng:70:29:
error: multiple definitions of "interfaces" without "combine" attribute

+/tmp/schema-validation_Head_20180217-23714-1tzlnu7/usr/share/YaST2/schema/autoyast/rng/services-manager.rng:122:27:
error: multiple definitions of "services" without "combine" attribute

+/tmp/schema-validation_Head_20180217-23714-1tzlnu7/usr/share/YaST2/schema/autoyast/rng/firewall.rng:348:33:
error: reference to undefined pattern "default_zone"
# ./test/profile_test_helper.rb:121:in `block (4 levels) in
validate_correct_profiles'

9) When checking incorrect profiles, Profile deploy_image.xml complains about
wrong deploy_images definition
Failure/Error: expect(errors).to match(/"image_installation" missing
required attribute "config:type"/)

expected
"/tmp/schema-validation_Head_20180217-23714-1tzlnu7/usr/share/YaST2/schema/autoyast/rng/networking.rn...2/schema/autoyast/rng/firewall.rng:348:33:
error: reference to undefined pattern \"default_zone\"\n" to match
/"image_installation" missing required attribute "config:type"/
Diff:
@@ -1,2 +1,4 @@
-/"image_installation" missing required attribute "config:type"/

+/tmp/schema-validation_Head_20180217-23714-1tzlnu7/usr/share/YaST2/schema/autoyast/rng/networking.rng:70:29:
error: multiple definitions of "interfaces" without "combine" attribute

+/tmp/schema-validation_Head_20180217-23714-1tzlnu7/usr/share/YaST2/schema/autoyast/rng/services-manager.rng:122:27:
error: multiple definitions of "services" without "combine" attribute

+/tmp/schema-validation_Head_20180217-23714-1tzlnu7/usr/share/YaST2/schema/autoyast/rng/firewall.rng:348:33:
error: reference to undefined pattern "default_zone"
# ./test/Head_test.rb:13:in `block (3 levels) in <top (required)>'

Finished in 4.47 seconds (files took 27.87 seconds to load)
13 examples, 9 failures

Failed examples:

rspec ./test/profile_test_helper.rb[2:1:1] # When checking correct profiles
stored in <https://ci.suse.de/job/autoyast-profiles-test/ws/test/Head/correct,>
Profile
<https://ci.suse.de/job/autoyast-profiles-test/ws/test/Head/correct/sles-12-sp1-954291-bad.xml>
passes validation according to schema
rspec ./test/profile_test_helper.rb[2:2:1] # When checking correct profiles
stored in <https://ci.suse.de/job/autoyast-profiles-test/ws/test/Head/correct,>
Profile
<https://ci.suse.de/job/autoyast-profiles-test/ws/test/Head/correct/sles-12-949193.xml>
passes validation according to schema
rspec ./test/profile_test_helper.rb[2:3:1] # When checking correct profiles
stored in <https://ci.suse.de/job/autoyast-profiles-test/ws/test/Head/correct,>
Profile
<https://ci.suse.de/job/autoyast-profiles-test/ws/test/Head/correct/opensuse-13.2-full_clone.xml>
passes validation according to schema
rspec ./test/profile_test_helper.rb[2:4:1] # When checking correct profiles
stored in <https://ci.suse.de/job/autoyast-profiles-test/ws/test/Head/correct,>
Profile
<https://ci.suse.de/job/autoyast-profiles-test/ws/test/Head/correct/sles-12-minimalistic.xml>
passes validation according to schema
rspec ./test/profile_test_helper.rb[2:5:1] # When checking correct profiles
stored in <https://ci.suse.de/job/autoyast-profiles-test/ws/test/Head/correct,>
Profile
<https://ci.suse.de/job/autoyast-profiles-test/ws/test/Head/correct/sles-12-sp1-954291-good.xml>
passes validation according to schema
rspec ./test/profile_test_helper.rb[2:6:1] # When checking correct profiles
stored in <https://ci.suse.de/job/autoyast-profiles-test/ws/test/Head/correct,>
Profile
<https://ci.suse.de/job/autoyast-profiles-test/ws/test/Head/correct/sles-12-sp1-955217.xml>
passes validation according to schema
rspec ./test/profile_test_helper.rb[2:7:1] # When checking correct profiles
stored in <https://ci.suse.de/job/autoyast-profiles-test/ws/test/Head/correct,>
Profile
<https://ci.suse.de/job/autoyast-profiles-test/ws/test/Head/correct/sles-12-sp1-941406.xml>
passes validation according to schema
rspec ./test/profile_test_helper.rb[2:8:1] # When checking correct profiles
stored in <https://ci.suse.de/job/autoyast-profiles-test/ws/test/Head/correct,>
Profile
<https://ci.suse.de/job/autoyast-profiles-test/ws/test/Head/correct/sles-11-sp3.xml>
passes validation according to schema
rspec ./test/Head_test.rb:11 # When checking incorrect profiles, Profile
deploy_image.xml complains about wrong deploy_images definition

rake aborted!
Command failed with status (1): [rspec --color --format doc 'test/sle-12-sp...]

Tasks: TOP => test:unit
(See full trace by running task with --trace)
Build step 'Execute shell' marked build as failure

< Previous Next >
Follow Ups
References