Mailinglist Archive: yast-commit (619 mails)

< Previous Next >
[yast-commit] Build failed in Jenkins: yast-yast2-master #266
  • From: jenkins@xxxxxxx
  • Date: Thu, 1 Feb 2018 15:12:15 +0000 (UTC)
  • Message-id: <28531455.1079.1517497935524.JavaMail.jenkins@ci>
See <https://ci.suse.de/job/yast-yast2-master/266/display/redirect?page=changes>

Changes:

[igonzalezsosa] Add basic tests for the Punycode module

[igonzalezsosa] Punycode module uses the simpleidn library instead of idnconv

[igonzalezsosa] Replace idnconv dependency with simpleidn

[igonzalezsosa] Refactor Punycode#ConvertBackAndForth to look more up-to-date

[igonzalezsosa] Bump version and update changes file

------------------------------------------
[...truncated 386.24 KB...]
[ 35s] Native configuration is x86_64-suse-linux-gnu
[ 35s]
[ 35s] === yast2 tests ===
[ 35s]
[ 35s] Schedule of variations:
[ 35s] unix
[ 35s]
[ 35s] Running target unix
[ 35s] Using /usr/share/dejagnu/baseboards/unix.exp as board description file
for target.
[ 35s] Using /usr/share/dejagnu/config/unix.exp as generic interface file for
target.
[ 35s] Using ./config/unix.exp as tool-and-target-specific interface file.
[ 35s] Running ./yast2.test/testsuite.exp ...
[ 35s]
[ 35s] Checking started
[ 35s]
[ 35s] Running initrd ...
[ 35s] Running filechanges ...
[ 35s] Running kernel ...
[ 35s]
[ 35s] Checking finished
[ 35s]
[ 35s]
[ 35s] === yast2 Summary ===
[ 35s]
[ 35s] # of expected passes 3
[ 35s] make[4]: Leaving directory
'/home/abuild/rpmbuild/BUILD/yast2-4.0.48/library/system/testsuite'
[ 35s] make[3]: Leaving directory
'/home/abuild/rpmbuild/BUILD/yast2-4.0.48/library/system/testsuite'
[ 35s] Making check in test
[ 35s] make[3]: Entering directory
'/home/abuild/rpmbuild/BUILD/yast2-4.0.48/library/system/test'
[ 35s] /usr/bin/make check-TESTS
[ 35s] make[4]: Entering directory
'/home/abuild/rpmbuild/BUILD/yast2-4.0.48/library/system/test'
[ 35s] make[5]: Entering directory
'/home/abuild/rpmbuild/BUILD/yast2-4.0.48/library/system/test'
[ 36s] PASS: execute_test.rb
[ 36s] PASS: kernel_test.rb
[ 36s] PASS: hw_detection_test.rb
[ 36s] PASS: fs_snapshot_test.rb
[ 37s] PASS: fs_snapshot_store_test.rb
[ 37s] PASS: proc_cmdline_test.rb
[ 37s]
============================================================================
[ 37s] Testsuite summary for yast2 4.0.48
[ 37s]
============================================================================
[ 37s] # TOTAL: 6
[ 37s] # PASS: 6
[ 37s] # SKIP: 0
[ 37s] # XFAIL: 0
[ 37s] # FAIL: 0
[ 37s] # XPASS: 0
[ 37s] # ERROR: 0
[ 37s]
============================================================================
[ 37s] make[5]: Leaving directory
'/home/abuild/rpmbuild/BUILD/yast2-4.0.48/library/system/test'
[ 37s] make[4]: Leaving directory
'/home/abuild/rpmbuild/BUILD/yast2-4.0.48/library/system/test'
[ 37s] make[3]: Leaving directory
'/home/abuild/rpmbuild/BUILD/yast2-4.0.48/library/system/test'
[ 37s] make[3]: Entering directory
'/home/abuild/rpmbuild/BUILD/yast2-4.0.48/library/system'
[ 37s] make[3]: Nothing to be done for 'check-am'.
[ 37s] make[3]: Leaving directory
'/home/abuild/rpmbuild/BUILD/yast2-4.0.48/library/system'
[ 37s] make[2]: Leaving directory
'/home/abuild/rpmbuild/BUILD/yast2-4.0.48/library/system'
[ 37s] Making check in packages
[ 37s] make[2]: Entering directory
'/home/abuild/rpmbuild/BUILD/yast2-4.0.48/library/packages'
[ 37s] Making check in src
[ 37s] make[3]: Entering directory
'/home/abuild/rpmbuild/BUILD/yast2-4.0.48/library/packages/src'
[ 37s] make[3]: Nothing to be done for 'check'.
[ 37s] make[3]: Leaving directory
'/home/abuild/rpmbuild/BUILD/yast2-4.0.48/library/packages/src'
[ 37s] Making check in testsuite
[ 37s] make[3]: Entering directory
'/home/abuild/rpmbuild/BUILD/yast2-4.0.48/library/packages/testsuite'
[ 37s] make -f /usr/share/YaST2/data/testsuite/Makefile.testsuite
RPMNAME=yast2 srcdir=.
[ 37s] make[4]: Entering directory
'/home/abuild/rpmbuild/BUILD/yast2-4.0.48/library/packages/testsuite'
[ 37s] make[4]: warning: jobserver unavailable: using -j1. Add '+' to parent
make rule.
[ 37s] make[4]: Nothing to be done for 'all'.
[ 37s] make[4]: Leaving directory
'/home/abuild/rpmbuild/BUILD/yast2-4.0.48/library/packages/testsuite'
[ 37s] /usr/bin/make check-DEJAGNU check-local
[ 37s] make[4]: Entering directory
'/home/abuild/rpmbuild/BUILD/yast2-4.0.48/library/packages/testsuite'
[ 37s] make -f /usr/share/YaST2/data/testsuite/Makefile.testsuite
RPMNAME=yast2 srcdir=. check
[ 37s] Making a new site.exp file ...
[ 37s] make[5]: Entering directory
'/home/abuild/rpmbuild/BUILD/yast2-4.0.48/library/packages/testsuite'
[ 37s] make[5]: warning: jobserver unavailable: using -j1. Add '+' to parent
make rule.
[ 37s]
[ 37s] Parse YCP
[ 37s] NOT RUNNING
[ 37s]
[ 37s] make[5]: Leaving directory
'/home/abuild/rpmbuild/BUILD/yast2-4.0.48/library/packages/testsuite'
[ 37s] srcdir='.'; export srcdir; \
[ 37s] EXPECT=expect; export EXPECT; \
[ 37s] if /bin/sh -c "runtest --version" > /dev/null 2>&1; then \
[ 37s] exit_status=0; l='yast2'; for tool in $l; do \
[ 37s] if runtest --tool $tool --srcdir $srcdir ; \
[ 37s] then :; else exit_status=1; fi; \
[ 37s] done; \
[ 37s] else echo "WARNING: could not find 'runtest'" 1>&2; :;\
[ 37s] fi; \
[ 37s] exit $exit_status
[ 37s] WARNING: Couldn't find tool init file
[ 37s] Test run by abuild on Thu Feb 1 15:12:11 2018
[ 37s] Native configuration is x86_64-suse-linux-gnu
[ 37s]
[ 37s] === yast2 tests ===
[ 37s]
[ 37s] Schedule of variations:
[ 37s] unix
[ 37s]
[ 37s] Running target unix
[ 37s] Using /usr/share/dejagnu/baseboards/unix.exp as board description file
for target.
[ 37s] Using /usr/share/dejagnu/config/unix.exp as generic interface file for
target.
[ 37s] Using ./config/unix.exp as tool-and-target-specific interface file.
[ 37s] Running ./yast2.test/testsuite.exp ...
[ 37s]
[ 37s] No test cases found
[ 37s]
[ 37s] make[4]: Leaving directory
'/home/abuild/rpmbuild/BUILD/yast2-4.0.48/library/packages/testsuite'
[ 37s] make[3]: Leaving directory
'/home/abuild/rpmbuild/BUILD/yast2-4.0.48/library/packages/testsuite'
[ 37s] Making check in test
[ 37s] make[3]: Entering directory
'/home/abuild/rpmbuild/BUILD/yast2-4.0.48/library/packages/test'
[ 37s] /usr/bin/make check-TESTS
[ 37s] make[4]: Entering directory
'/home/abuild/rpmbuild/BUILD/yast2-4.0.48/library/packages/test'
[ 37s] make[5]: Entering directory
'/home/abuild/rpmbuild/BUILD/yast2-4.0.48/library/packages/test'
[ 37s] PASS: commit_result_test.rb
[ 37s] PASS: dummy_callbacks_test.rb
[ 38s] PASS: file_conflict_callbacks_test.rb
[ 38s] PASS: package_callbacks_test.rb
[ 38s] PASS: lib/product_test.rb
[ 38s] PASS: lib/repository_test.rb
[ 39s] PASS: lib/package_downloader_test.rb
[ 39s] PASS: lib/package_extractor_test.rb
[ 39s] FAIL: lib/product_reader_test.rb
[ 39s] FAIL: lib/product_sorter_test.rb
[ 40s] FAIL: product_test.rb
[ 40s] PASS: packages_ui_test.rb
[ 40s] PASS: signature_check_callbacks_test.rb
[ 40s] PASS: slide_show_test.rb
[ 41s] PASS: update_messages_view_test.rb
[ 41s] ========================================================
[ 41s] yast2 4.0.48: library/packages/test/test-suite.log
[ 41s] ========================================================
[ 41s]
[ 41s] # TOTAL: 15
[ 41s] # PASS: 12
[ 41s] # SKIP: 0
[ 41s] # XFAIL: 0
[ 41s] # FAIL: 3
[ 41s] # XPASS: 0
[ 41s] # ERROR: 0
[ 41s]
[ 41s] .. contents:: :depth: 2
[ 41s]
[ 41s] FAIL: lib/product_reader_test
[ 41s] =============================
[ 41s]
[ 41s]
[ 41s] An error occurred while loading ./lib/product_reader_test.rb.
[ 41s] Failure/Error: require "y2packager/product_reader"
[ 41s]
[ 41s] NameError:
[ 41s] component cannot import namespace 'Language'
[ 41s] #
/home/abuild/rpmbuild/BUILD/yast2-4.0.48/library/packages/src/lib/y2packager/product.rb:14:in
`<top (required)>'
[ 41s] #
/home/abuild/rpmbuild/BUILD/yast2-4.0.48/library/packages/src/lib/y2packager/product_reader.rb:14:in
`<top (required)>'
[ 41s] # ./lib/product_reader_test.rb:16:in `<top (required)>'
[ 41s] No examples found.
[ 41s]
[ 41s]
[ 41s] Finished in 0.00029 seconds (files took 0.29257 seconds to load)
[ 41s] 0 examples, 0 failures, 1 error occurred outside of examples
[ 41s]
[ 41s] FAIL lib/product_reader_test.rb (exit status: 1)
[ 41s]
[ 41s] FAIL: lib/product_sorter_test
[ 41s] =============================
[ 41s]
[ 41s]
[ 41s] An error occurred while loading ./lib/product_sorter_test.rb.
[ 41s] Failure/Error: require "y2packager/product"
[ 41s]
[ 41s] NameError:
[ 41s] component cannot import namespace 'Language'
[ 41s] #
/home/abuild/rpmbuild/BUILD/yast2-4.0.48/library/packages/src/lib/y2packager/product.rb:14:in
`<top (required)>'
[ 41s] # ./lib/product_sorter_test.rb:15:in `<top (required)>'
[ 41s] No examples found.
[ 41s]
[ 41s]
[ 41s] Finished in 0.0003 seconds (files took 0.25182 seconds to load)
[ 41s] 0 examples, 0 failures, 1 error occurred outside of examples
[ 41s]
[ 41s] FAIL lib/product_sorter_test.rb (exit status: 1)
[ 41s]
[ 41s] FAIL: product_test
[ 41s] ==================
[ 41s]
[ 41s]
[ 41s] An error occurred while loading ./product_test.rb.
[ 41s] Failure/Error: import_pure(mname)
[ 41s]
[ 41s] RuntimeError:
[ 41s] Failed to load Module 'Product' due to: component cannot import
namespace 'Language'
[ 41s] #
/home/abuild/rpmbuild/BUILD/yast2-4.0.48/library/packages/src/lib/y2packager/product.rb:14:in
`<top (required)>'
[ 41s] #
/home/abuild/rpmbuild/BUILD/yast2-4.0.48/library/packages/src/lib/y2packager/product_reader.rb:14:in
`<top (required)>'
[ 41s] #
/home/abuild/rpmbuild/BUILD/yast2-4.0.48/library/packages/src/modules/Product.rb:32:in
`<top (required)>'
[ 41s] # ./product_test.rb:8:in `<top (required)>'
[ 41s] No examples found.
[ 41s]
[ 41s]
[ 41s] Finished in 0.00033 seconds (files took 0.30734 seconds to load)
[ 41s] 0 examples, 0 failures, 1 error occurred outside of examples
[ 41s]
[ 41s] FAIL product_test.rb (exit status: 1)
[ 41s]
[ 41s]
============================================================================
[ 41s] Testsuite summary for yast2 4.0.48
[ 41s]
============================================================================
[ 41s] # TOTAL: 15
[ 41s] # PASS: 12
[ 41s] # SKIP: 0
[ 41s] # XFAIL: 0
[ 41s] # FAIL: 3
[ 41s] # XPASS: 0
[ 41s] # ERROR: 0
[ 41s]
============================================================================
[ 41s] See library/packages/test/test-suite.log
[ 41s] Please report to http://bugs.opensuse.org/
[ 41s]
============================================================================
[ 41s] make[5]: *** [Makefile:515: test-suite.log] Error 1
[ 41s] make[5]: Leaving directory
'/home/abuild/rpmbuild/BUILD/yast2-4.0.48/library/packages/test'
[ 41s] make[4]: *** [Makefile:623: check-TESTS] Error 2
[ 41s] make[4]: Leaving directory
'/home/abuild/rpmbuild/BUILD/yast2-4.0.48/library/packages/test'
[ 41s] make[3]: *** [Makefile:679: check-am] Error 2
[ 41s] make[3]: Leaving directory
'/home/abuild/rpmbuild/BUILD/yast2-4.0.48/library/packages/test'
[ 41s] make[2]: *** [Makefile:342: check-recursive] Error 1
[ 41s] make[2]: Leaving directory
'/home/abuild/rpmbuild/BUILD/yast2-4.0.48/library/packages'
[ 41s] make[1]: *** [Makefile:342: check-recursive] Error 1
[ 41s] make[1]: Leaving directory
'/home/abuild/rpmbuild/BUILD/yast2-4.0.48/library'
[ 41s] make: *** [Makefile:503: check-recursive] Error 1
[ 41s] error: Bad exit status from /var/tmp/rpm-tmp.rZTalQ (%install)
[ 41s]
[ 41s]
[ 41s] RPM build errors:
[ 41s] Bad exit status from /var/tmp/rpm-tmp.rZTalQ (%install)
[ 41s]
[ 41s] vm-yast-ci-worker failed "build yast2.spec" at Thu Feb 1 15:12:15 UTC
2018.
[ 41s]

The buildroot was: /var/tmp/build-root-SUSE_SLE-15_GA
rm -rf Devel:YaST:Head
rake aborted!
Command failed with status (1): [yes | osc -A 'https://api.suse.de/' build ...]

Tasks: TOP => osc:sr => osc:commit => osc:build
(See full trace by running task with --trace)
cleaning
Build step 'Execute shell' marked build as failure
Not sending mail to unregistered user teclator@xxxxxxxxx
Not sending mail to unregistered user noreply@xxxxxxxxxx
Not sending mail to unregistered user igonzalezsosa@xxxxxxxx

< Previous Next >
Follow Ups
References