Mailinglist Archive: yast-commit (619 mails)

< Previous Next >
[yast-commit] Build failed in Jenkins: yast-yast2-master #507
  • From: admin@xxxxxxxxxxxx
  • Date: Thu, 1 Feb 2018 13:28:25 +0000 (UTC)
  • Message-id: <416353487.19.1517491705985.JavaMail.jenkins@ci-opensuse>
See
<http://ci.opensuse.org/job/yast-yast2-master/507/display/redirect?page=changes>

Changes:

[teclator] Improve the performance of modified?.

[teclator] Bump version & changelog.

[teclator] Added method for read current relations state.

[teclator] Firewalld: Relations doc update and set modified as empty when not

[teclator] Mock firewalld.installed? call

[teclator] Changes based on CR.

[teclator] Changes based on CR

[teclator] Added the cache options directly into the relation module.

[teclator] Improvements based on code review, and export also service state

[teclator] Use modified! instead of check it directly

------------------------------------------
[...truncated 386.32 KB...]
[ 42s] Test run by abuild on Thu Feb 1 13:28:18 2018
[ 42s] Native configuration is x86_64-suse-linux-gnu
[ 42s]
[ 42s] === yast2 tests ===
[ 42s]
[ 42s] Schedule of variations:
[ 42s] unix
[ 42s]
[ 42s] Running target unix
[ 42s] Using /usr/share/dejagnu/baseboards/unix.exp as board description file
for target.
[ 42s] Using /usr/share/dejagnu/config/unix.exp as generic interface file for
target.
[ 42s] Using ./config/unix.exp as tool-and-target-specific interface file.
[ 42s] Running ./yast2.test/testsuite.exp ...
[ 42s]
[ 42s] Checking started
[ 42s]
[ 42s] Running filechanges ...
[ 43s] Running initrd ...
[ 43s] Running kernel ...
[ 43s]
[ 43s] Checking finished
[ 43s]
[ 43s]
[ 43s] === yast2 Summary ===
[ 43s]
[ 43s] # of expected passes 3
[ 43s] make[4]: Leaving directory
'/home/abuild/rpmbuild/BUILD/yast2-4.0.47/library/system/testsuite'
[ 43s] make[3]: Leaving directory
'/home/abuild/rpmbuild/BUILD/yast2-4.0.47/library/system/testsuite'
[ 43s] Making check in test
[ 43s] make[3]: Entering directory
'/home/abuild/rpmbuild/BUILD/yast2-4.0.47/library/system/test'
[ 43s] /usr/bin/make check-TESTS
[ 43s] make[4]: Entering directory
'/home/abuild/rpmbuild/BUILD/yast2-4.0.47/library/system/test'
[ 43s] make[5]: Entering directory
'/home/abuild/rpmbuild/BUILD/yast2-4.0.47/library/system/test'
[ 44s] PASS: execute_test.rb
[ 44s] PASS: kernel_test.rb
[ 44s] PASS: hw_detection_test.rb
[ 44s] PASS: fs_snapshot_test.rb
[ 45s] PASS: fs_snapshot_store_test.rb
[ 45s] PASS: proc_cmdline_test.rb
[ 45s]
============================================================================
[ 45s] Testsuite summary for yast2 4.0.47
[ 45s]
============================================================================
[ 45s] # TOTAL: 6
[ 45s] # PASS: 6
[ 45s] # SKIP: 0
[ 45s] # XFAIL: 0
[ 45s] # FAIL: 0
[ 45s] # XPASS: 0
[ 45s] # ERROR: 0
[ 45s]
============================================================================
[ 45s] make[5]: Leaving directory
'/home/abuild/rpmbuild/BUILD/yast2-4.0.47/library/system/test'
[ 45s] make[4]: Leaving directory
'/home/abuild/rpmbuild/BUILD/yast2-4.0.47/library/system/test'
[ 45s] make[3]: Leaving directory
'/home/abuild/rpmbuild/BUILD/yast2-4.0.47/library/system/test'
[ 45s] make[3]: Entering directory
'/home/abuild/rpmbuild/BUILD/yast2-4.0.47/library/system'
[ 45s] make[3]: Nothing to be done for 'check-am'.
[ 45s] make[3]: Leaving directory
'/home/abuild/rpmbuild/BUILD/yast2-4.0.47/library/system'
[ 45s] make[2]: Leaving directory
'/home/abuild/rpmbuild/BUILD/yast2-4.0.47/library/system'
[ 45s] Making check in packages
[ 45s] make[2]: Entering directory
'/home/abuild/rpmbuild/BUILD/yast2-4.0.47/library/packages'
[ 45s] Making check in src
[ 45s] make[3]: Entering directory
'/home/abuild/rpmbuild/BUILD/yast2-4.0.47/library/packages/src'
[ 45s] make[3]: Nothing to be done for 'check'.
[ 45s] make[3]: Leaving directory
'/home/abuild/rpmbuild/BUILD/yast2-4.0.47/library/packages/src'
[ 45s] Making check in testsuite
[ 45s] make[3]: Entering directory
'/home/abuild/rpmbuild/BUILD/yast2-4.0.47/library/packages/testsuite'
[ 45s] make -f /usr/share/YaST2/data/testsuite/Makefile.testsuite
RPMNAME=yast2 srcdir=.
[ 45s] make[4]: Entering directory
'/home/abuild/rpmbuild/BUILD/yast2-4.0.47/library/packages/testsuite'
[ 45s] make[4]: warning: jobserver unavailable: using -j1. Add '+' to parent
make rule.
[ 45s] make[4]: Nothing to be done for 'all'.
[ 45s] make[4]: Leaving directory
'/home/abuild/rpmbuild/BUILD/yast2-4.0.47/library/packages/testsuite'
[ 45s] /usr/bin/make check-DEJAGNU check-local
[ 45s] make[4]: Entering directory
'/home/abuild/rpmbuild/BUILD/yast2-4.0.47/library/packages/testsuite'
[ 45s] make -f /usr/share/YaST2/data/testsuite/Makefile.testsuite
RPMNAME=yast2 srcdir=. check
[ 45s] Making a new site.exp file ...
[ 45s] make[5]: Entering directory
'/home/abuild/rpmbuild/BUILD/yast2-4.0.47/library/packages/testsuite'
[ 45s] make[5]: warning: jobserver unavailable: using -j1. Add '+' to parent
make rule.
[ 45s]
[ 45s] Parse YCP
[ 45s] NOT RUNNING
[ 45s]
[ 45s] make[5]: Leaving directory
'/home/abuild/rpmbuild/BUILD/yast2-4.0.47/library/packages/testsuite'
[ 45s] srcdir='.'; export srcdir; \
[ 45s] EXPECT=expect; export EXPECT; \
[ 45s] if /bin/sh -c "runtest --version" > /dev/null 2>&1; then \
[ 45s] exit_status=0; l='yast2'; for tool in $l; do \
[ 45s] if runtest --tool $tool --srcdir $srcdir ; \
[ 45s] then :; else exit_status=1; fi; \
[ 45s] done; \
[ 45s] else echo "WARNING: could not find 'runtest'" 1>&2; :;\
[ 45s] fi; \
[ 45s] exit $exit_status
[ 45s] WARNING: Couldn't find tool init file
[ 45s] Test run by abuild on Thu Feb 1 13:28:21 2018
[ 45s] Native configuration is x86_64-suse-linux-gnu
[ 45s]
[ 45s] === yast2 tests ===
[ 45s]
[ 45s] Schedule of variations:
[ 45s] unix
[ 45s]
[ 45s] Running target unix
[ 45s] Using /usr/share/dejagnu/baseboards/unix.exp as board description file
for target.
[ 45s] Using /usr/share/dejagnu/config/unix.exp as generic interface file for
target.
[ 45s] Using ./config/unix.exp as tool-and-target-specific interface file.
[ 45s] Running ./yast2.test/testsuite.exp ...
[ 45s]
[ 45s] No test cases found
[ 45s]
[ 45s] make[4]: Leaving directory
'/home/abuild/rpmbuild/BUILD/yast2-4.0.47/library/packages/testsuite'
[ 45s] make[3]: Leaving directory
'/home/abuild/rpmbuild/BUILD/yast2-4.0.47/library/packages/testsuite'
[ 45s] Making check in test
[ 45s] make[3]: Entering directory
'/home/abuild/rpmbuild/BUILD/yast2-4.0.47/library/packages/test'
[ 45s] /usr/bin/make check-TESTS
[ 45s] make[4]: Entering directory
'/home/abuild/rpmbuild/BUILD/yast2-4.0.47/library/packages/test'
[ 45s] make[5]: Entering directory
'/home/abuild/rpmbuild/BUILD/yast2-4.0.47/library/packages/test'
[ 46s] PASS: dummy_callbacks_test.rb
[ 46s] PASS: commit_result_test.rb
[ 46s] PASS: file_conflict_callbacks_test.rb
[ 46s] PASS: package_callbacks_test.rb
[ 47s] PASS: lib/product_test.rb
[ 47s] PASS: lib/repository_test.rb
[ 47s] PASS: lib/package_downloader_test.rb
[ 47s] PASS: lib/package_extractor_test.rb
[ 48s] FAIL: lib/product_reader_test.rb
[ 48s] FAIL: lib/product_sorter_test.rb
[ 48s] PASS: packages_ui_test.rb
[ 48s] FAIL: product_test.rb
[ 49s] PASS: signature_check_callbacks_test.rb
[ 49s] PASS: slide_show_test.rb
[ 49s] PASS: update_messages_view_test.rb
[ 49s] ========================================================
[ 49s] yast2 4.0.47: library/packages/test/test-suite.log
[ 49s] ========================================================
[ 49s]
[ 49s] # TOTAL: 15
[ 49s] # PASS: 12
[ 49s] # SKIP: 0
[ 49s] # XFAIL: 0
[ 49s] # FAIL: 3
[ 49s] # XPASS: 0
[ 49s] # ERROR: 0
[ 49s]
[ 49s] .. contents:: :depth: 2
[ 49s]
[ 49s] FAIL: lib/product_reader_test
[ 49s] =============================
[ 49s]
[ 49s]
[ 49s] An error occurred while loading ./lib/product_reader_test.rb.
[ 49s] Failure/Error: require "y2packager/product_reader"
[ 49s]
[ 49s] NameError:
[ 49s] component cannot import namespace 'Language'
[ 49s] #
/home/abuild/rpmbuild/BUILD/yast2-4.0.47/library/packages/src/lib/y2packager/product.rb:14:in
`<top (required)>'
[ 49s] #
/home/abuild/rpmbuild/BUILD/yast2-4.0.47/library/packages/src/lib/y2packager/product_reader.rb:14:in
`<top (required)>'
[ 49s] # ./lib/product_reader_test.rb:16:in `<top (required)>'
[ 49s] No examples found.
[ 49s]
[ 49s]
[ 49s] Finished in 0.0003 seconds (files took 0.32558 seconds to load)
[ 49s] 0 examples, 0 failures, 1 error occurred outside of examples
[ 49s]
[ 49s] FAIL lib/product_reader_test.rb (exit status: 1)
[ 49s]
[ 49s] FAIL: lib/product_sorter_test
[ 49s] =============================
[ 49s]
[ 49s]
[ 49s] An error occurred while loading ./lib/product_sorter_test.rb.
[ 49s] Failure/Error: require "y2packager/product"
[ 49s]
[ 49s] NameError:
[ 49s] component cannot import namespace 'Language'
[ 49s] #
/home/abuild/rpmbuild/BUILD/yast2-4.0.47/library/packages/src/lib/y2packager/product.rb:14:in
`<top (required)>'
[ 49s] # ./lib/product_sorter_test.rb:15:in `<top (required)>'
[ 49s] No examples found.
[ 49s]
[ 49s]
[ 49s] Finished in 0.00035 seconds (files took 0.29161 seconds to load)
[ 49s] 0 examples, 0 failures, 1 error occurred outside of examples
[ 49s]
[ 49s] FAIL lib/product_sorter_test.rb (exit status: 1)
[ 49s]
[ 49s] FAIL: product_test
[ 49s] ==================
[ 49s]
[ 49s]
[ 49s] An error occurred while loading ./product_test.rb.
[ 49s] Failure/Error: import_pure(mname)
[ 49s]
[ 49s] RuntimeError:
[ 49s] Failed to load Module 'Product' due to: component cannot import
namespace 'Language'
[ 49s] #
/home/abuild/rpmbuild/BUILD/yast2-4.0.47/library/packages/src/lib/y2packager/product.rb:14:in
`<top (required)>'
[ 49s] #
/home/abuild/rpmbuild/BUILD/yast2-4.0.47/library/packages/src/lib/y2packager/product_reader.rb:14:in
`<top (required)>'
[ 49s] #
/home/abuild/rpmbuild/BUILD/yast2-4.0.47/library/packages/src/modules/Product.rb:32:in
`<top (required)>'
[ 49s] # ./product_test.rb:8:in `<top (required)>'
[ 49s] No examples found.
[ 49s]
[ 49s]
[ 49s] Finished in 0.0003 seconds (files took 0.36565 seconds to load)
[ 49s] 0 examples, 0 failures, 1 error occurred outside of examples
[ 49s]
[ 49s] FAIL product_test.rb (exit status: 1)
[ 49s]
[ 49s]
============================================================================
[ 49s] Testsuite summary for yast2 4.0.47
[ 49s]
============================================================================
[ 49s] # TOTAL: 15
[ 49s] # PASS: 12
[ 49s] # SKIP: 0
[ 49s] # XFAIL: 0
[ 49s] # FAIL: 3
[ 49s] # XPASS: 0
[ 49s] # ERROR: 0
[ 49s]
============================================================================
[ 49s] See library/packages/test/test-suite.log
[ 49s] Please report to http://bugs.opensuse.org/
[ 49s]
============================================================================
[ 49s] make[5]: *** [Makefile:515: test-suite.log] Error 1
[ 49s] make[5]: Leaving directory
'/home/abuild/rpmbuild/BUILD/yast2-4.0.47/library/packages/test'
[ 49s] make[4]: *** [Makefile:623: check-TESTS] Error 2
[ 49s] make[4]: Leaving directory
'/home/abuild/rpmbuild/BUILD/yast2-4.0.47/library/packages/test'
[ 49s] make[3]: *** [Makefile:679: check-am] Error 2
[ 49s] make[3]: Leaving directory
'/home/abuild/rpmbuild/BUILD/yast2-4.0.47/library/packages/test'
[ 49s] make[2]: *** [Makefile:342: check-recursive] Error 1
[ 49s] make[2]: Leaving directory
'/home/abuild/rpmbuild/BUILD/yast2-4.0.47/library/packages'
[ 49s] make[1]: *** [Makefile:342: check-recursive] Error 1
[ 49s] make[1]: Leaving directory
'/home/abuild/rpmbuild/BUILD/yast2-4.0.47/library'
[ 49s] make: *** [Makefile:503: check-recursive] Error 1
[ 49s] error: Bad exit status from /var/tmp/rpm-tmp.tDSY7a (%install)
[ 49s]
[ 49s]
[ 49s] RPM build errors:
[ 49s] Bad exit status from /var/tmp/rpm-tmp.tDSY7a (%install)
[ 49s]
[ 49s] yast-jenkins failed "build yast2.spec" at Thu Feb 1 13:28:25 UTC 2018.
[ 49s]

The buildroot was: /var/tmp/build-root-openSUSE_Factory
rm -rf YaST:Head
rake aborted!
Command failed with status (1): [yes | osc -A 'https://api.opensuse.org/' b...]

Tasks: TOP => osc:sr => osc:commit => osc:build
(See full trace by running task with --trace)
cleaning
Build step 'Execute shell' marked build as failure
Not sending mail to unregistered user teclator@xxxxxxxxx
Not sending mail to unregistered user github@xxxxxxxxxxxxxxxx

< Previous Next >
This Thread
Follow Ups
References