Mailinglist Archive: yast-commit (559 mails)

< Previous Next >
[yast-commit] Build failed in Jenkins: yast-storage-master #219
  • From: admin@xxxxxxxxxxxx
  • Date: Thu, 28 May 2015 14:05:04 +0200 (CEST)
  • Message-id: <1848536622.0.1432814704579.JavaMail.jenkins@ci-opensuse>
See <http://ci.opensuse.org/job/yast-storage-master/219/changes>

Changes:

[igonzalezsosa] Add a snapshots_finish client

[igonzalezsosa] Update from code review

[igonzalezsosa] Move ::Storage module into Yast::YStorage

[igonzalezsosa] Change SnapshotsFinish client to use FsSnapshot.configured?

[igonzalezsosa] Add yast2-installation to travis environment

[igonzalezsosa] SnapshotsFinish client creates a 'post' snapshot on upgrade

[igonzalezsosa] Update dependency on yast2

[igonzalezsosa] SnapshotsFinish client does not rescue from any error

------------------------------------------
[...truncated 2517 lines...]
[ 96s] make[4]: Entering directory
'/home/abuild/rpmbuild/BUILD/yast2-storage-3.1.55/testsuite/data/windows'
[ 96s] make[4]: Nothing to be done for 'install-exec-am'.
[ 96s] make[4]: Nothing to be done for 'install-data-am'.
[ 96s] make[4]: Leaving directory
'/home/abuild/rpmbuild/BUILD/yast2-storage-3.1.55/testsuite/data/windows'
[ 96s] make[3]: Leaving directory
'/home/abuild/rpmbuild/BUILD/yast2-storage-3.1.55/testsuite/data/windows'
[ 96s] Making install in windows-only
[ 96s] make[3]: Entering directory
'/home/abuild/rpmbuild/BUILD/yast2-storage-3.1.55/testsuite/data/windows-only'
[ 96s] make[4]: Entering directory
'/home/abuild/rpmbuild/BUILD/yast2-storage-3.1.55/testsuite/data/windows-only'
[ 96s] make[4]: Nothing to be done for 'install-exec-am'.
[ 96s] make[4]: Nothing to be done for 'install-data-am'.
[ 96s] make[4]: Leaving directory
'/home/abuild/rpmbuild/BUILD/yast2-storage-3.1.55/testsuite/data/windows-only'
[ 96s] make[3]: Leaving directory
'/home/abuild/rpmbuild/BUILD/yast2-storage-3.1.55/testsuite/data/windows-only'
[ 96s] Making install in windows-only-no-resize
[ 96s] make[3]: Entering directory
'/home/abuild/rpmbuild/BUILD/yast2-storage-3.1.55/testsuite/data/windows-only-no-resize'
[ 96s] make[4]: Entering directory
'/home/abuild/rpmbuild/BUILD/yast2-storage-3.1.55/testsuite/data/windows-only-no-resize'
[ 96s] make[4]: Nothing to be done for 'install-exec-am'.
[ 96s] make[4]: Nothing to be done for 'install-data-am'.
[ 96s] make[4]: Leaving directory
'/home/abuild/rpmbuild/BUILD/yast2-storage-3.1.55/testsuite/data/windows-only-no-resize'
[ 96s] make[3]: Leaving directory
'/home/abuild/rpmbuild/BUILD/yast2-storage-3.1.55/testsuite/data/windows-only-no-resize'
[ 96s] Making install in windows-only-efi
[ 96s] make[3]: Entering directory
'/home/abuild/rpmbuild/BUILD/yast2-storage-3.1.55/testsuite/data/windows-only-efi'
[ 96s] make[4]: Entering directory
'/home/abuild/rpmbuild/BUILD/yast2-storage-3.1.55/testsuite/data/windows-only-efi'
[ 96s] make[4]: Nothing to be done for 'install-exec-am'.
[ 96s] make[4]: Nothing to be done for 'install-data-am'.
[ 96s] make[4]: Leaving directory
'/home/abuild/rpmbuild/BUILD/yast2-storage-3.1.55/testsuite/data/windows-only-efi'
[ 96s] make[3]: Leaving directory
'/home/abuild/rpmbuild/BUILD/yast2-storage-3.1.55/testsuite/data/windows-only-efi'
[ 96s] Making install in empty-s390x
[ 96s] make[3]: Entering directory
'/home/abuild/rpmbuild/BUILD/yast2-storage-3.1.55/testsuite/data/empty-s390x'
[ 96s] make[4]: Entering directory
'/home/abuild/rpmbuild/BUILD/yast2-storage-3.1.55/testsuite/data/empty-s390x'
[ 96s] make[4]: Nothing to be done for 'install-exec-am'.
[ 96s] make[4]: Nothing to be done for 'install-data-am'.
[ 96s] make[4]: Leaving directory
'/home/abuild/rpmbuild/BUILD/yast2-storage-3.1.55/testsuite/data/empty-s390x'
[ 96s] make[3]: Leaving directory
'/home/abuild/rpmbuild/BUILD/yast2-storage-3.1.55/testsuite/data/empty-s390x'
[ 96s] Making install in empty-ppc64le
[ 96s] make[3]: Entering directory
'/home/abuild/rpmbuild/BUILD/yast2-storage-3.1.55/testsuite/data/empty-ppc64le'
[ 96s] make[4]: Entering directory
'/home/abuild/rpmbuild/BUILD/yast2-storage-3.1.55/testsuite/data/empty-ppc64le'
[ 96s] make[4]: Nothing to be done for 'install-exec-am'.
[ 96s] make[4]: Nothing to be done for 'install-data-am'.
[ 96s] make[4]: Leaving directory
'/home/abuild/rpmbuild/BUILD/yast2-storage-3.1.55/testsuite/data/empty-ppc64le'
[ 96s] make[3]: Leaving directory
'/home/abuild/rpmbuild/BUILD/yast2-storage-3.1.55/testsuite/data/empty-ppc64le'
[ 96s] Making install in empty-small
[ 96s] make[3]: Entering directory
'/home/abuild/rpmbuild/BUILD/yast2-storage-3.1.55/testsuite/data/empty-small'
[ 96s] make[4]: Entering directory
'/home/abuild/rpmbuild/BUILD/yast2-storage-3.1.55/testsuite/data/empty-small'
[ 96s] make[4]: Nothing to be done for 'install-exec-am'.
[ 96s] make[4]: Nothing to be done for 'install-data-am'.
[ 96s] make[4]: Leaving directory
'/home/abuild/rpmbuild/BUILD/yast2-storage-3.1.55/testsuite/data/empty-small'
[ 96s] make[3]: Leaving directory
'/home/abuild/rpmbuild/BUILD/yast2-storage-3.1.55/testsuite/data/empty-small'
[ 96s] Making install in empty-big
[ 96s] make[3]: Entering directory
'/home/abuild/rpmbuild/BUILD/yast2-storage-3.1.55/testsuite/data/empty-big'
[ 96s] make[4]: Entering directory
'/home/abuild/rpmbuild/BUILD/yast2-storage-3.1.55/testsuite/data/empty-big'
[ 96s] make[4]: Nothing to be done for 'install-exec-am'.
[ 96s] make[4]: Nothing to be done for 'install-data-am'.
[ 96s] make[4]: Leaving directory
'/home/abuild/rpmbuild/BUILD/yast2-storage-3.1.55/testsuite/data/empty-big'
[ 96s] make[3]: Leaving directory
'/home/abuild/rpmbuild/BUILD/yast2-storage-3.1.55/testsuite/data/empty-big'
[ 96s] Making install in empty-big-ppc64le
[ 96s] make[3]: Entering directory
'/home/abuild/rpmbuild/BUILD/yast2-storage-3.1.55/testsuite/data/empty-big-ppc64le'
[ 96s] make[4]: Entering directory
'/home/abuild/rpmbuild/BUILD/yast2-storage-3.1.55/testsuite/data/empty-big-ppc64le'
[ 96s] make[4]: Nothing to be done for 'install-exec-am'.
[ 96s] make[4]: Nothing to be done for 'install-data-am'.
[ 96s] make[4]: Leaving directory
'/home/abuild/rpmbuild/BUILD/yast2-storage-3.1.55/testsuite/data/empty-big-ppc64le'
[ 96s] make[3]: Leaving directory
'/home/abuild/rpmbuild/BUILD/yast2-storage-3.1.55/testsuite/data/empty-big-ppc64le'
[ 96s] Making install in lvm
[ 96s] make[3]: Entering directory
'/home/abuild/rpmbuild/BUILD/yast2-storage-3.1.55/testsuite/data/lvm'
[ 96s] make[4]: Entering directory
'/home/abuild/rpmbuild/BUILD/yast2-storage-3.1.55/testsuite/data/lvm'
[ 96s] make[4]: Nothing to be done for 'install-exec-am'.
[ 96s] make[4]: Nothing to be done for 'install-data-am'.
[ 96s] make[4]: Leaving directory
'/home/abuild/rpmbuild/BUILD/yast2-storage-3.1.55/testsuite/data/lvm'
[ 96s] make[3]: Leaving directory
'/home/abuild/rpmbuild/BUILD/yast2-storage-3.1.55/testsuite/data/lvm'
[ 96s] make[3]: Entering directory
'/home/abuild/rpmbuild/BUILD/yast2-storage-3.1.55/testsuite/data'
[ 96s] make[4]: Entering directory
'/home/abuild/rpmbuild/BUILD/yast2-storage-3.1.55/testsuite/data'
[ 96s] make[4]: Nothing to be done for 'install-exec-am'.
[ 96s] make[4]: Nothing to be done for 'install-data-am'.
[ 96s] make[4]: Leaving directory
'/home/abuild/rpmbuild/BUILD/yast2-storage-3.1.55/testsuite/data'
[ 96s] make[3]: Leaving directory
'/home/abuild/rpmbuild/BUILD/yast2-storage-3.1.55/testsuite/data'
[ 96s] make[2]: Leaving directory
'/home/abuild/rpmbuild/BUILD/yast2-storage-3.1.55/testsuite/data'
[ 96s] make[2]: Entering directory
'/home/abuild/rpmbuild/BUILD/yast2-storage-3.1.55/testsuite'
[ 96s] make -f /usr/share/YaST2/data/testsuite/Makefile.testsuite
RPMNAME=yast2-storage srcdir=.
[ 96s] make[3]: Entering directory
'/home/abuild/rpmbuild/BUILD/yast2-storage-3.1.55/testsuite'
[ 96s] cp -f /usr/share/YaST2/data/testsuite/skel/default.exp
config/default.exp
[ 96s] cp -f /usr/share/YaST2/data/testsuite/skel/unix.exp config/unix.exp
[ 96s] cp -f /usr/share/YaST2/data/testsuite/skel/unknown.exp
config/unknown.exp
[ 96s] cp -f /usr/share/YaST2/data/testsuite/skel/testsuite.exp
yast2-storage.test/testsuite.exp
[ 96s] make[3]: Leaving directory
'/home/abuild/rpmbuild/BUILD/yast2-storage-3.1.55/testsuite'
[ 96s] make[3]: Entering directory
'/home/abuild/rpmbuild/BUILD/yast2-storage-3.1.55/testsuite'
[ 96s] make[3]: Nothing to be done for 'install-exec-am'.
[ 96s] make[3]: Nothing to be done for 'install-data-am'.
[ 96s] make[3]: Leaving directory
'/home/abuild/rpmbuild/BUILD/yast2-storage-3.1.55/testsuite'
[ 96s] make[2]: Leaving directory
'/home/abuild/rpmbuild/BUILD/yast2-storage-3.1.55/testsuite'
[ 96s] make[1]: Leaving directory
'/home/abuild/rpmbuild/BUILD/yast2-storage-3.1.55/testsuite'
[ 96s] make[1]: Entering directory
'/home/abuild/rpmbuild/BUILD/yast2-storage-3.1.55'
[ 96s] make[2]: Entering directory
'/home/abuild/rpmbuild/BUILD/yast2-storage-3.1.55'
[ 96s] make[2]: Nothing to be done for 'install-exec-am'.
[ 96s] /usr/bin/mkdir -p
'/home/abuild/rpmbuild/BUILDROOT/yast2-storage-3.1.55-1.x86_64/usr/share/doc/packages/yast2-storage'
[ 96s] /usr/bin/install -c -p -m 644 COPYING
'/home/abuild/rpmbuild/BUILDROOT/yast2-storage-3.1.55-1.x86_64/usr/share/doc/packages/yast2-storage'
[ 96s] make[2]: Leaving directory
'/home/abuild/rpmbuild/BUILD/yast2-storage-3.1.55'
[ 96s] make[1]: Leaving directory
'/home/abuild/rpmbuild/BUILD/yast2-storage-3.1.55'
[ 96s] + '[' '!' -f /usr/share/YaST2/data/devtools/NO_MAKE_CHECK ']'
[ 96s] + /usr/bin/make check VERBOSE=1
Y2DIR=/home/abuild/rpmbuild/BUILDROOT/yast2-storage-3.1.55-1.x86_64//usr/share/YaST2
DESTDIR=/home/abuild/rpmbuild/BUILDROOT/yast2-storage-3.1.55-1.x86_64
[ 96s] Making check in bindings
[ 96s] make[1]: Entering directory
'/home/abuild/rpmbuild/BUILD/yast2-storage-3.1.55/bindings'
[ 96s] Making check in ruby
[ 96s] make[2]: Entering directory
'/home/abuild/rpmbuild/BUILD/yast2-storage-3.1.55/bindings/ruby'
[ 96s] make[2]: Nothing to be done for 'check'.
[ 96s] make[2]: Leaving directory
'/home/abuild/rpmbuild/BUILD/yast2-storage-3.1.55/bindings/ruby'
[ 96s] Making check in src
[ 96s] make[2]: Entering directory
'/home/abuild/rpmbuild/BUILD/yast2-storage-3.1.55/bindings/src'
[ 96s] /usr/bin/make check-am
[ 96s] make[3]: Entering directory
'/home/abuild/rpmbuild/BUILD/yast2-storage-3.1.55/bindings/src'
[ 96s] make[3]: Nothing to be done for 'check-am'.
[ 96s] make[3]: Leaving directory
'/home/abuild/rpmbuild/BUILD/yast2-storage-3.1.55/bindings/src'
[ 96s] make[2]: Leaving directory
'/home/abuild/rpmbuild/BUILD/yast2-storage-3.1.55/bindings/src'
[ 96s] make[2]: Entering directory
'/home/abuild/rpmbuild/BUILD/yast2-storage-3.1.55/bindings'
[ 96s] make[2]: Nothing to be done for 'check-am'.
[ 96s] make[2]: Leaving directory
'/home/abuild/rpmbuild/BUILD/yast2-storage-3.1.55/bindings'
[ 96s] make[1]: Leaving directory
'/home/abuild/rpmbuild/BUILD/yast2-storage-3.1.55/bindings'
[ 96s] Making check in doc
[ 96s] make[1]: Entering directory
'/home/abuild/rpmbuild/BUILD/yast2-storage-3.1.55/doc'
[ 96s] Making check in autodocs
[ 96s] make[2]: Entering directory
'/home/abuild/rpmbuild/BUILD/yast2-storage-3.1.55/doc/autodocs'
[ 96s] make[2]: Nothing to be done for 'check'.
[ 96s] make[2]: Leaving directory
'/home/abuild/rpmbuild/BUILD/yast2-storage-3.1.55/doc/autodocs'
[ 96s] make[2]: Entering directory
'/home/abuild/rpmbuild/BUILD/yast2-storage-3.1.55/doc'
[ 96s] make[2]: Nothing to be done for 'check-am'.
[ 96s] make[2]: Leaving directory
'/home/abuild/rpmbuild/BUILD/yast2-storage-3.1.55/doc'
[ 96s] make[1]: Leaving directory
'/home/abuild/rpmbuild/BUILD/yast2-storage-3.1.55/doc'
[ 96s] Making check in src
[ 96s] make[1]: Entering directory
'/home/abuild/rpmbuild/BUILD/yast2-storage-3.1.55/src'
[ 96s] make[1]: Nothing to be done for 'check'.
[ 96s] make[1]: Leaving directory
'/home/abuild/rpmbuild/BUILD/yast2-storage-3.1.55/src'
[ 96s] Making check in test
[ 96s] make[1]: Entering directory
'/home/abuild/rpmbuild/BUILD/yast2-storage-3.1.55/test'
[ 96s] /usr/bin/make check-TESTS
[ 96s] make[2]: Entering directory
'/home/abuild/rpmbuild/BUILD/yast2-storage-3.1.55/test'
[ 96s] make[3]: Entering directory
'/home/abuild/rpmbuild/BUILD/yast2-storage-3.1.55/test'
[ 97s] PASS: storage_snapper_configure_snapper_test.rb
[ 98s] PASS: storage_get_disk_partition.rb
[ 99s] FAIL: ystorage/snapshots_finish_test.rb
[ 99s] ===============================================
[ 99s] yast2-storage 3.1.55: test/test-suite.log
[ 99s] ===============================================
[ 99s]
[ 99s] # TOTAL: 3
[ 99s] # PASS: 2
[ 99s] # SKIP: 0
[ 99s] # XFAIL: 0
[ 99s] # FAIL: 1
[ 99s] # XPASS: 0
[ 99s] # ERROR: 0
[ 99s]
[ 99s] .. contents:: :depth: 2
[ 99s]
[ 99s] FAIL: ystorage/snapshots_finish_test
[ 99s] ====================================
[ 99s]
[ 99s] FFFFF
[ 99s]
[ 99s] Failures:
[ 99s]
[ 99s] 1) Yast::YStorage::SnapshotsFinish#write when second stage is
required when snapper is configured does not create any snapshot
[ 99s] Failure/Error: allow(subject).to
receive(:second_stage_required?).and_return(second_stage_required)
[ 99s] RuntimeError:
[ 99s] Cannot find client installation/misc.rb
[ 99s] #
/home/abuild/rpmbuild/BUILD/yast2-storage-3.1.55/src/lib/ystorage/snapshots_finish.rb:17:in
`initialize'
[ 99s] # ./ystorage/snapshots_finish_test.rb:9:in `block (3 levels) in
<top (required)>'
[ 99s]
[ 99s] 2) Yast::YStorage::SnapshotsFinish#write when second stage is
required when snapper is not configured does not create any snapshot
[ 99s] Failure/Error: allow(subject).to
receive(:second_stage_required?).and_return(second_stage_required)
[ 99s] RuntimeError:
[ 99s] Cannot find client installation/misc.rb
[ 99s] #
/home/abuild/rpmbuild/BUILD/yast2-storage-3.1.55/src/lib/ystorage/snapshots_finish.rb:17:in
`initialize'
[ 99s] # ./ystorage/snapshots_finish_test.rb:9:in `block (3 levels) in
<top (required)>'
[ 99s]
[ 99s] 3) Yast::YStorage::SnapshotsFinish#write when second stage isn't
required when snapper is configured when upgrading creates a snapshot of type
'post' with 'after upgrade' as description and paired with 'pre' snapshot
[ 99s] Failure/Error: allow(subject).to
receive(:second_stage_required?).and_return(second_stage_required)
[ 99s] RuntimeError:
[ 99s] Cannot find client installation/misc.rb
[ 99s] #
/home/abuild/rpmbuild/BUILD/yast2-storage-3.1.55/src/lib/ystorage/snapshots_finish.rb:17:in
`initialize'
[ 99s] # ./ystorage/snapshots_finish_test.rb:9:in `block (3 levels) in
<top (required)>'
[ 99s]
[ 99s] 4) Yast::YStorage::SnapshotsFinish#write when second stage isn't
required when snapper is configured when installing creates a snapshot of type
'single' with 'after installation' as description
[ 99s] Failure/Error: allow(subject).to
receive(:second_stage_required?).and_return(second_stage_required)
[ 99s] RuntimeError:
[ 99s] Cannot find client installation/misc.rb
[ 99s] #
/home/abuild/rpmbuild/BUILD/yast2-storage-3.1.55/src/lib/ystorage/snapshots_finish.rb:17:in
`initialize'
[ 99s] # ./ystorage/snapshots_finish_test.rb:9:in `block (3 levels) in
<top (required)>'
[ 99s]
[ 99s] 5) Yast::YStorage::SnapshotsFinish#write when second stage isn't
required when snapper is not configured does not create any snapshot
[ 99s] Failure/Error: allow(subject).to
receive(:second_stage_required?).and_return(second_stage_required)
[ 99s] RuntimeError:
[ 99s] Cannot find client installation/misc.rb
[ 99s] #
/home/abuild/rpmbuild/BUILD/yast2-storage-3.1.55/src/lib/ystorage/snapshots_finish.rb:17:in
`initialize'
[ 99s] # ./ystorage/snapshots_finish_test.rb:9:in `block (3 levels) in
<top (required)>'
[ 99s]
[ 99s] Finished in 0.46945 seconds (files took 0.18178 seconds to load)
[ 99s] 5 examples, 5 failures
[ 99s]
[ 99s] Failed examples:
[ 99s]
[ 99s] rspec ./ystorage/snapshots_finish_test.rb:19 #
Yast::YStorage::SnapshotsFinish#write when second stage is required when
snapper is configured does not create any snapshot
[ 99s] rspec ./ystorage/snapshots_finish_test.rb:28 #
Yast::YStorage::SnapshotsFinish#write when second stage is required when
snapper is not configured does not create any snapshot
[ 99s] rspec ./ystorage/snapshots_finish_test.rb:46 #
Yast::YStorage::SnapshotsFinish#write when second stage isn't required when
snapper is configured when upgrading creates a snapshot of type 'post' with
'after upgrade' as description and paired with 'pre' snapshot
[ 99s] rspec ./ystorage/snapshots_finish_test.rb:59 #
Yast::YStorage::SnapshotsFinish#write when second stage isn't required when
snapper is configured when installing creates a snapshot of type 'single' with
'after installation' as description
[ 99s] rspec ./ystorage/snapshots_finish_test.rb:69 #
Yast::YStorage::SnapshotsFinish#write when second stage isn't required when
snapper is not configured does not create any snapshot
[ 99s]
[ 99s] FAIL ystorage/snapshots_finish_test.rb (exit status: 1)
[ 99s]
[ 99s]
============================================================================
[ 99s] Testsuite summary for yast2-storage 3.1.55
[ 99s]
============================================================================
[ 99s] # TOTAL: 3
[ 99s] # PASS: 2
[ 99s] # SKIP: 0
[ 99s] # XFAIL: 0
[ 99s] # FAIL: 1
[ 99s] # XPASS: 0
[ 99s] # ERROR: 0
[ 99s]
============================================================================
[ 99s] See test/test-suite.log
[ 99s] Please report to http://bugs.opensuse.org/
[ 99s]
============================================================================
[ 99s] Makefile:560: recipe for target 'test-suite.log' failed
[ 99s] make[3]: *** [test-suite.log] Error 1
[ 99s] make[3]: Leaving directory
'/home/abuild/rpmbuild/BUILD/yast2-storage-3.1.55/test'
[ 99s] Makefile:666: recipe for target 'check-TESTS' failed
[ 99s] make[2]: *** [check-TESTS] Error 2
[ 99s] make[2]: Leaving directory
'/home/abuild/rpmbuild/BUILD/yast2-storage-3.1.55/test'
[ 99s] Makefile:732: recipe for target 'check-am' failed
[ 99s] make[1]: *** [check-am] Error 2
[ 99s] make[1]: Leaving directory
'/home/abuild/rpmbuild/BUILD/yast2-storage-3.1.55/test'
[ 99s] Makefile:572: recipe for target 'check-recursive' failed
[ 99s] make: *** [check-recursive] Error 1
[ 99s] error: Bad exit status from /var/tmp/rpm-tmp.dtBSm8 (%install)
[ 99s]
[ 99s]
[ 99s] RPM build errors:
[ 99s] Bad exit status from /var/tmp/rpm-tmp.dtBSm8 (%install)
Skipping verification of package signatures
Writing build configuration
Running build

The buildroot was: /var/tmp/build-root-openSUSE_Factory
rm -rf YaST:Head
rake aborted!
Command failed with status (1): [yes | osc -A 'https://api.opensuse.org/' b...]

Tasks: TOP => osc:sr => osc:commit => osc:build
(See full trace by running task with --trace)
cleaning
Build step 'Execute shell' marked build as failure

< Previous Next >
This Thread
Follow Ups