Mailinglist Archive: yast-commit (5667 mails)

< Previous Next >
[yast-commit] Build failed in Jenkins: yast-storage-master #23
  • From: admin@xxxxxxxxxxxx
  • Date: Wed, 13 Nov 2013 15:45:12 +0100 (CET)
  • Message-id: <227544464.0.1384353912533.JavaMail.jenkins@ci-opensuse>
See <http://ci.opensuse.org/job/yast-storage-master/23/changes>

Changes:

[aschnell] - use correct binary prefix (bnc#849276)

------------------------------------------
[...truncated 1993 lines...]
[ 62s] -Dump Create swap volume /dev/sda1 (517.72 MiB)
[ 62s] -Dump Create root volume /dev/sda2 (297.58 GiB) with ext4
[ 62s] +Dump Create swap volume /dev/sda1 (517.72 MB)
[ 62s] +Dump Create root volume /dev/sda2 (297.58 GB) with ext4
[ 62s]
[ 62s] FAIL: Wrong stdout for empty1
[ 62s] See the diff above.
[ 62s] Running empty2 ...
[ 63s] FAIL: Wrong stdout for empty2
[ 63s]
[ 63s] The diff follows...
[ 63s]
[ 63s] --- tests/empty2.out 2013-11-13 14:43:56.836000000 +0000
[ 63s] +++ tmp.out.empty2 2013-11-13 14:45:05.348000000 +0000
[ 63s] @@ -1,4 +1,4 @@
[ 63s] Dump Proposal:
[ 63s] -Dump Create swap volume /dev/sda1 (2.01 GiB)
[ 63s] -Dump Create root volume /dev/sda2 (20.00 GiB) with ext4
[ 63s] -Dump Create volume /dev/sda3 (276.08 GiB) for /home with ext4
[ 63s] +Dump Create swap volume /dev/sda1 (2.01 GB)
[ 63s] +Dump Create root volume /dev/sda2 (20.00 GB) with ext4
[ 63s] +Dump Create volume /dev/sda3 (276.08 GB) for /home with ext4
[ 63s]
[ 63s] FAIL: Wrong stdout for empty2
[ 63s] See the diff above.
[ 63s] Running empty3 ...
[ 64s] FAIL: Wrong stdout for empty3
[ 64s]
[ 64s] The diff follows...
[ 64s]
[ 64s] --- tests/empty3.out 2013-11-13 14:43:56.864000000 +0000
[ 64s] +++ tmp.out.empty3 2013-11-13 14:45:06.228000000 +0000
[ 64s] @@ -1,6 +1,6 @@
[ 64s] Dump Proposal:
[ 64s] -Dump Create boot volume /dev/sda1 (400.06 MiB) with ext4
[ 64s] -Dump Create volume /dev/sda2 (29.96 GiB)
[ 64s] -Dump Create volume group system (29.95 GiB) from /dev/sda2
[destructive]
[ 64s] -Dump Create logical volume /dev/system/root (10.00 GiB) for / with
ext4
[ 64s] -Dump Create swap logical volume /dev/system/swap (512.00 MiB)
[ 64s] +Dump Create boot volume /dev/sda1 (400.06 MB) with ext4
[ 64s] +Dump Create volume /dev/sda2 (29.96 GB)
[ 64s] +Dump Create volume group system (29.95 GB) from /dev/sda2
[destructive]
[ 64s] +Dump Create logical volume /dev/system/root (10.00 GB) for / with
ext4
[ 64s] +Dump Create swap logical volume /dev/system/swap (512.00 MB)
[ 64s]
[ 64s] FAIL: Wrong stdout for empty3
[ 64s] See the diff above.
[ 64s] Running empty4 ...
[ 65s] FAIL: Wrong stdout for empty4
[ 65s]
[ 65s] The diff follows...
[ 65s]
[ 65s] --- tests/empty4.out 2013-11-13 14:43:56.864000000 +0000
[ 65s] +++ tmp.out.empty4 2013-11-13 14:45:07.356000000 +0000
[ 65s] @@ -1,7 +1,7 @@
[ 65s] Dump Proposal:
[ 65s] -Dump Create boot volume /dev/sda1 (400.06 MiB) with ext4
[ 65s] -Dump Create volume /dev/sda2 (29.96 GiB)
[ 65s] -Dump Create volume group system (29.95 GiB) from /dev/sda2
[destructive]
[ 65s] -Dump Create logical volume /dev/system/home (19.45 GiB) for /home
with ext4
[ 65s] -Dump Create logical volume /dev/system/root (10.00 GiB) for / with
ext4
[ 65s] -Dump Create swap logical volume /dev/system/swap (512.00 MiB)
[ 65s] +Dump Create boot volume /dev/sda1 (400.06 MB) with ext4
[ 65s] +Dump Create volume /dev/sda2 (29.96 GB)
[ 65s] +Dump Create volume group system (29.95 GB) from /dev/sda2
[destructive]
[ 65s] +Dump Create logical volume /dev/system/home (19.45 GB) for /home
with ext4
[ 65s] +Dump Create logical volume /dev/system/root (10.00 GB) for / with
ext4
[ 65s] +Dump Create swap logical volume /dev/system/swap (512.00 MB)
[ 65s]
[ 65s] FAIL: Wrong stdout for empty4
[ 65s] See the diff above.
[ 65s] Running empty5 ...
[ 66s] FAIL: Wrong stdout for empty5
[ 66s]
[ 66s] The diff follows...
[ 66s]
[ 66s] --- tests/empty5.out 2013-11-13 14:43:56.864000000 +0000
[ 66s] +++ tmp.out.empty5 2013-11-13 14:45:08.168000000 +0000
[ 66s] @@ -1,6 +1,6 @@
[ 66s] Dump Proposal:
[ 66s] -Dump Create boot volume /dev/sda1 (400.06 MiB) with ext4
[ 66s] -Dump Create volume /dev/sda2 (297.70 GiB)
[ 66s] -Dump Create volume group system (297.69 GiB) from /dev/sda2
[destructive]
[ 66s] -Dump Create logical volume /dev/system/root (10.00 GiB) for / with
ext4
[ 66s] -Dump Create swap logical volume /dev/system/swap (768.00 MiB)
[ 66s] +Dump Create boot volume /dev/sda1 (400.06 MB) with ext4
[ 66s] +Dump Create volume /dev/sda2 (297.70 GB)
[ 66s] +Dump Create volume group system (297.69 GB) from /dev/sda2
[destructive]
[ 66s] +Dump Create logical volume /dev/system/root (10.00 GB) for / with
ext4
[ 66s] +Dump Create swap logical volume /dev/system/swap (768.00 MB)
[ 66s]
[ 66s] FAIL: Wrong stdout for empty5
[ 66s] See the diff above.
[ 66s] Running empty6 ...
[ 67s] FAIL: Wrong stdout for empty6
[ 67s]
[ 67s] The diff follows...
[ 67s]
[ 67s] --- tests/empty6.out 2013-11-13 14:43:56.864000000 +0000
[ 67s] +++ tmp.out.empty6 2013-11-13 14:45:09.032000000 +0000
[ 67s] @@ -1,7 +1,7 @@
[ 67s] Dump Proposal:
[ 67s] -Dump Create boot volume /dev/sda1 (400.06 MiB) with ext4
[ 67s] -Dump Create volume /dev/sda2 (297.70 GiB)
[ 67s] -Dump Create volume group system (297.69 GiB) from /dev/sda2
[destructive]
[ 67s] -Dump Create logical volume /dev/system/home (25.00 GiB) for /home
with ext4
[ 67s] -Dump Create logical volume /dev/system/root (10.00 GiB) for / with
ext4
[ 67s] -Dump Create swap logical volume /dev/system/swap (768.00 MiB)
[ 67s] +Dump Create boot volume /dev/sda1 (400.06 MB) with ext4
[ 67s] +Dump Create volume /dev/sda2 (297.70 GB)
[ 67s] +Dump Create volume group system (297.69 GB) from /dev/sda2
[destructive]
[ 67s] +Dump Create logical volume /dev/system/home (25.00 GB) for /home
with ext4
[ 67s] +Dump Create logical volume /dev/system/root (10.00 GB) for / with
ext4
[ 67s] +Dump Create swap logical volume /dev/system/swap (768.00 MB)
[ 67s]
[ 67s] FAIL: Wrong stdout for empty6
[ 67s] See the diff above.
[ 67s] Running half-empty1 ...
[ 67s] FAIL: Wrong stdout for half-empty1
[ 67s]
[ 67s] The diff follows...
[ 67s]
[ 67s] --- tests/half-empty1.out 2013-11-13 14:43:56.880000000 +0000
[ 67s] +++ tmp.out.half-empty1 2013-11-13 14:45:09.836000000 +0000
[ 67s] @@ -1,5 +1,5 @@
[ 67s] Dump Proposal:
[ 67s] -Dump Create extended partition /dev/sda3 (147.09 GiB)
[ 67s] -Dump Create swap volume /dev/sda5 (2.01 GiB)
[ 67s] -Dump Create root volume /dev/sda6 (20.00 GiB) with ext4
[ 67s] -Dump Create volume /dev/sda7 (125.08 GiB) for /home with ext4
[ 67s] +Dump Create extended partition /dev/sda3 (147.09 GB)
[ 67s] +Dump Create swap volume /dev/sda5 (2.01 GB)
[ 67s] +Dump Create root volume /dev/sda6 (20.00 GB) with ext4
[ 67s] +Dump Create volume /dev/sda7 (125.08 GB) for /home with ext4
[ 67s]
[ 67s] FAIL: Wrong stdout for half-empty1
[ 67s] See the diff above.
[ 67s] Skipping file helper1a.rb ...
[ 67s] Skipping file helper1b.rb ...
[ 67s] Running reuse-home1 ...
[ 68s] FAIL: Wrong stdout for reuse-home1
[ 68s]
[ 68s] The diff follows...
[ 68s]
[ 68s] --- tests/reuse-home1.out 2013-11-13 14:43:56.888000000 +0000
[ 68s] +++ tmp.out.reuse-home1 2013-11-13 14:45:10.460000000 +0000
[ 68s] @@ -1,4 +1,4 @@
[ 68s] Dump Proposal:
[ 68s] -Dump Format partition /dev/sda2 (15.01 GiB) for / with ext4
[destructive]
[ 68s] +Dump Format partition /dev/sda2 (15.01 GB) for / with ext4
[destructive]
[ 68s] Dump Use /dev/sda1 as swap
[ 68s] Dump Set mount point of /dev/sda3 to /home
[ 68s]
[ 68s] FAIL: Wrong stdout for reuse-home1
[ 68s] See the diff above.
[ 68s] Skipping file setup-system.rb ...
[ 68s] Running windows-only-efi1 ...
[ 69s] FAIL: Wrong stdout for windows-only-efi1
[ 69s]
[ 69s] The diff follows...
[ 69s]
[ 69s] --- tests/windows-only-efi1.out 2013-11-13 14:43:56.888000000
+0000
[ 69s] +++ tmp.out.windows-only-efi1 2013-11-13 14:45:11.224000000 +0000
[ 69s] @@ -1,5 +1,5 @@
[ 69s] Dump Proposal:
[ 69s] -Dump Shrink Windows partition /dev/sda2 to 7.78 GiB [destructive]
[ 69s] -Dump Create swap volume /dev/sda3 (517.72 MiB)
[ 69s] -Dump Create root volume /dev/sda4 (7.62 GiB) with ext4
[ 69s] +Dump Shrink Windows partition /dev/sda2 to 7.78 GB [destructive]
[ 69s] +Dump Create swap volume /dev/sda3 (517.72 MB)
[ 69s] +Dump Create root volume /dev/sda4 (7.62 GB) with ext4
[ 69s] Dump Set mount point of /dev/sda1 to /boot/efi
[ 69s]
[ 69s] FAIL: Wrong stdout for windows-only-efi1
[ 69s] See the diff above.
[ 69s] Running windows-only1 ...
[ 70s] FAIL: Wrong stdout for windows-only1
[ 70s]
[ 70s] The diff follows...
[ 70s]
[ 70s] --- tests/windows-only1.out 2013-11-13 14:43:56.888000000 +0000
[ 70s] +++ tmp.out.windows-only1 2013-11-13 14:45:12.052000000 +0000
[ 70s] @@ -1,6 +1,6 @@
[ 70s] Dump Proposal:
[ 70s] -Dump Shrink Windows partition /dev/sda1 to 33.21 GiB [destructive]
[ 70s] -Dump Create extended partition /dev/sda2 (41.32 GiB)
[ 70s] -Dump Create swap volume /dev/sda5 (517.72 MiB)
[ 70s] -Dump Create root volume /dev/sda6 (16.50 GiB) with ext4
[ 70s] -Dump Create volume /dev/sda7 (24.31 GiB) for /home with ext4
[ 70s] +Dump Shrink Windows partition /dev/sda1 to 33.21 GB [destructive]
[ 70s] +Dump Create extended partition /dev/sda2 (41.32 GB)
[ 70s] +Dump Create swap volume /dev/sda5 (517.72 MB)
[ 70s] +Dump Create root volume /dev/sda6 (16.50 GB) with ext4
[ 70s] +Dump Create volume /dev/sda7 (24.31 GB) for /home with ext4
[ 70s]
[ 70s] FAIL: Wrong stdout for windows-only1
[ 70s] See the diff above.
[ 70s] Running windows1 ...
[ 70s] FAIL: Wrong stdout for windows1
[ 70s]
[ 70s] The diff follows...
[ 70s]
[ 70s] --- tests/windows1.out 2013-11-13 14:43:56.888000000 +0000
[ 70s] +++ tmp.out.windows1 2013-11-13 14:45:12.820000000 +0000
[ 70s] @@ -1,5 +1,5 @@
[ 70s] Dump Proposal:
[ 70s] -Dump Create extended partition /dev/sda2 (34.52 GiB)
[ 70s] -Dump Create swap volume /dev/sda5 (517.72 MiB)
[ 70s] -Dump Create root volume /dev/sda6 (15.01 GiB) with ext4
[ 70s] -Dump Create volume /dev/sda7 (19.01 GiB) for /home with ext4
[ 70s] +Dump Create extended partition /dev/sda2 (34.52 GB)
[ 70s] +Dump Create swap volume /dev/sda5 (517.72 MB)
[ 70s] +Dump Create root volume /dev/sda6 (15.01 GB) with ext4
[ 70s] +Dump Create volume /dev/sda7 (19.01 GB) for /home with ext4
[ 70s]
[ 70s] FAIL: Wrong stdout for windows1
[ 70s] See the diff above.
[ 70s]
[ 70s] Checking finished
[ 70s]
[ 70s]
[ 70s] === yast2-storage Summary ===
[ 70s]
[ 70s] # of unexpected failures 26
[ 70s] make[3]: *** [check-DEJAGNU] Error 1
[ 70s] make[3]: Leaving directory
`/home/abuild/rpmbuild/BUILD/yast2-storage-3.1.2/testsuite'
[ 70s] make[2]: *** [check-am] Error 2
[ 70s] make[2]: Leaving directory
`/home/abuild/rpmbuild/BUILD/yast2-storage-3.1.2/testsuite'
[ 70s] make[1]: *** [check-recursive] Error 1
[ 70s] make[1]: Leaving directory
`/home/abuild/rpmbuild/BUILD/yast2-storage-3.1.2/testsuite'
[ 70s] make: *** [check-recursive] Error 1
[ 70s] error: Bad exit status from /var/tmp/rpm-tmp.NVHP9f (%install)
[ 70s]
[ 70s]
[ 70s] RPM build errors:
[ 70s] Bad exit status from /var/tmp/rpm-tmp.NVHP9f (%install)
Skipping verification of package signatures
Writing build configuration
Running build

The buildroot was: /var/tmp/build-root-openSUSE_Factory
rm -rf YaST:Head
rake aborted!
Command failed with status (1): [osc build --no-verify --release=1 --root=/...]

Tasks: TOP => osc:sr => osc:commit => osc:build
(See full trace by running task with --trace)
cleaning
Build step 'Execute shell' marked build as failure
--
To unsubscribe, e-mail: yast-commit+unsubscribe@xxxxxxxxxxxx
For additional commands, e-mail: yast-commit+help@xxxxxxxxxxxx

< Previous Next >
This Thread
Follow Ups