Mailinglist Archive: yast-commit (5667 mails)

< Previous Next >
[yast-commit] Build failed in Jenkins: yast-yast2-master #22
  • From: admin@xxxxxxxxxxxx
  • Date: Tue, 12 Nov 2013 11:34:53 +0100 (CET)
  • Message-id: <952580295.1.1384252493646.JavaMail.jenkins@ci-opensuse>
See <http://ci.opensuse.org/job/yast-yast2-master/22/changes>

Changes:

[Martin Vidner] rewrote the last minitest to rspec (gh#yast/yast-rake#2)

[Martin Vidner] fix running tests from another directory (like `rake test:unit`)

------------------------------------------
[...truncated 6735 lines...]
[ 109s] /usr/bin/install -c -p -m 644 data/country.ycp data/country_long.ycp
'/home/abuild/rpmbuild/BUILDROOT/yast2-3.1.3-1.x86_64/usr/share/YaST2/data'
[ 109s] make[4]: Leaving directory
`/home/abuild/rpmbuild/BUILD/yast2-3.1.3/library/general/src'
[ 109s] make[3]: Leaving directory
`/home/abuild/rpmbuild/BUILD/yast2-3.1.3/library/general/src'
[ 109s] Making install in testsuite
[ 109s] make[3]: Entering directory
`/home/abuild/rpmbuild/BUILD/yast2-3.1.3/library/general/testsuite'
[ 109s] make -f /usr/share/YaST2/data/testsuite/Makefile.testsuite
RPMNAME=yast2 srcdir=.
[ 109s] make[4]: Entering directory
`/home/abuild/rpmbuild/BUILD/yast2-3.1.3/library/general/testsuite'
[ 109s] cp -f /usr/share/YaST2/data/testsuite/skel/default.exp
config/default.exp
[ 109s] cp -f /usr/share/YaST2/data/testsuite/skel/unix.exp config/unix.exp
[ 109s] cp -f /usr/share/YaST2/data/testsuite/skel/unknown.exp
config/unknown.exp
[ 109s] cp -f /usr/share/YaST2/data/testsuite/skel/testsuite.exp
yast2.test/testsuite.exp
[ 109s] make[4]: Leaving directory
`/home/abuild/rpmbuild/BUILD/yast2-3.1.3/library/general/testsuite'
[ 109s] make[4]: Entering directory
`/home/abuild/rpmbuild/BUILD/yast2-3.1.3/library/general/testsuite'
[ 109s] make[4]: Nothing to be done for `install-exec-am'.
[ 109s] make[4]: Nothing to be done for `install-data-am'.
[ 109s] make[4]: Leaving directory
`/home/abuild/rpmbuild/BUILD/yast2-3.1.3/library/general/testsuite'
[ 109s] make[3]: Leaving directory
`/home/abuild/rpmbuild/BUILD/yast2-3.1.3/library/general/testsuite'
[ 109s] Making install in test
[ 109s] make[3]: Entering directory
`/home/abuild/rpmbuild/BUILD/yast2-3.1.3/library/general/test'
[ 109s] make[4]: Entering directory
`/home/abuild/rpmbuild/BUILD/yast2-3.1.3/library/general/test'
[ 109s] make[4]: Nothing to be done for `install-exec-am'.
[ 109s] make[4]: Nothing to be done for `install-data-am'.
[ 109s] make[4]: Leaving directory
`/home/abuild/rpmbuild/BUILD/yast2-3.1.3/library/general/test'
[ 109s] make[3]: Leaving directory
`/home/abuild/rpmbuild/BUILD/yast2-3.1.3/library/general/test'
[ 109s] make[3]: Entering directory
`/home/abuild/rpmbuild/BUILD/yast2-3.1.3/library/general'
[ 109s] make[4]: Entering directory
`/home/abuild/rpmbuild/BUILD/yast2-3.1.3/library/general'
[ 109s] make[4]: Nothing to be done for `install-exec-am'.
[ 109s] make[4]: Nothing to be done for `install-data-am'.
[ 109s] make[4]: Leaving directory
`/home/abuild/rpmbuild/BUILD/yast2-3.1.3/library/general'
[ 109s] make[3]: Leaving directory
`/home/abuild/rpmbuild/BUILD/yast2-3.1.3/library/general'
[ 109s] make[2]: Leaving directory
`/home/abuild/rpmbuild/BUILD/yast2-3.1.3/library/general'
[ 109s] make[2]: Entering directory
`/home/abuild/rpmbuild/BUILD/yast2-3.1.3/library'
[ 109s] make[3]: Entering directory
`/home/abuild/rpmbuild/BUILD/yast2-3.1.3/library'
[ 109s] make[3]: Nothing to be done for `install-exec-am'.
[ 109s] make[3]: Nothing to be done for `install-data-am'.
[ 109s] make[3]: Leaving directory
`/home/abuild/rpmbuild/BUILD/yast2-3.1.3/library'
[ 109s] make[2]: Leaving directory
`/home/abuild/rpmbuild/BUILD/yast2-3.1.3/library'
[ 109s] make[1]: Leaving directory
`/home/abuild/rpmbuild/BUILD/yast2-3.1.3/library'
[ 109s] Making install in scripts
[ 109s] make[1]: Entering directory
`/home/abuild/rpmbuild/BUILD/yast2-3.1.3/scripts'
[ 109s] make[2]: Entering directory
`/home/abuild/rpmbuild/BUILD/yast2-3.1.3/scripts'
[ 109s] /usr/bin/mkdir -p
'/home/abuild/rpmbuild/BUILDROOT/yast2-3.1.3-1.x86_64/usr/sbin'
[ 109s] /usr/bin/install -c -p yast2 save_y2logs
'/home/abuild/rpmbuild/BUILDROOT/yast2-3.1.3-1.x86_64/usr/sbin'
[ 109s] /usr/bin/mkdir -p
'/home/abuild/rpmbuild/BUILDROOT/yast2-3.1.3-1.x86_64/etc/bash_completion.d'
[ 109s] /usr/bin/install -c -p -m 644 yast2-completion.sh
'/home/abuild/rpmbuild/BUILDROOT/yast2-3.1.3-1.x86_64/etc/bash_completion.d'
[ 109s] install -d -m 755
/home/abuild/rpmbuild/BUILDROOT/yast2-3.1.3-1.x86_64/usr/lib/YaST2/bin
[ 109s] ln -snf yast2
/home/abuild/rpmbuild/BUILDROOT/yast2-3.1.3-1.x86_64/usr/sbin/yast
[ 109s] install -d -m 755
/home/abuild/rpmbuild/BUILDROOT/yast2-3.1.3-1.x86_64/sbin
[ 109s] ln -snf /usr/sbin/yast2
/home/abuild/rpmbuild/BUILDROOT/yast2-3.1.3-1.x86_64/sbin/yast2
[ 109s] ln -snf /usr/sbin/yast2
/home/abuild/rpmbuild/BUILDROOT/yast2-3.1.3-1.x86_64/sbin/yast
[ 109s] /usr/bin/mkdir -p
'/home/abuild/rpmbuild/BUILDROOT/yast2-3.1.3-1.x86_64/usr/lib/YaST2/bin'
[ 109s] /usr/bin/install -c -p yast2-funcs check-all-syntax
'/home/abuild/rpmbuild/BUILDROOT/yast2-3.1.3-1.x86_64/usr/lib/YaST2/bin'
[ 109s] make[2]: Leaving directory
`/home/abuild/rpmbuild/BUILD/yast2-3.1.3/scripts'
[ 109s] make[1]: Leaving directory
`/home/abuild/rpmbuild/BUILD/yast2-3.1.3/scripts'
[ 109s] make[1]: Entering directory `/home/abuild/rpmbuild/BUILD/yast2-3.1.3'
[ 109s] make[2]: Entering directory `/home/abuild/rpmbuild/BUILD/yast2-3.1.3'
[ 109s] make[2]: Nothing to be done for `install-exec-am'.
[ 109s] /usr/bin/mkdir -p
'/home/abuild/rpmbuild/BUILDROOT/yast2-3.1.3-1.x86_64/usr/share/doc/packages/yast2'
[ 109s] /usr/bin/install -c -p -m 644 COPYING
'/home/abuild/rpmbuild/BUILDROOT/yast2-3.1.3-1.x86_64/usr/share/doc/packages/yast2'
[ 109s] make[2]: Leaving directory `/home/abuild/rpmbuild/BUILD/yast2-3.1.3'
[ 109s] make[1]: Leaving directory `/home/abuild/rpmbuild/BUILD/yast2-3.1.3'
[ 109s] + '[' '!' -f /usr/share/YaST2/data/devtools/NO_MAKE_CHECK ']'
[ 109s] + make check VERBOSE=1
Y2DIR=/home/abuild/rpmbuild/BUILDROOT/yast2-3.1.3-1.x86_64//usr/share/YaST2
DESTDIR=/home/abuild/rpmbuild/BUILDROOT/yast2-3.1.3-1.x86_64
[ 109s] Making check in data
[ 109s] make[1]: Entering directory
`/home/abuild/rpmbuild/BUILD/yast2-3.1.3/data'
[ 109s] make[1]: Nothing to be done for `check'.
[ 109s] make[1]: Leaving directory
`/home/abuild/rpmbuild/BUILD/yast2-3.1.3/data'
[ 109s] Making check in doc
[ 109s] make[1]: Entering directory
`/home/abuild/rpmbuild/BUILD/yast2-3.1.3/doc'
[ 109s] Making check in autodocs
[ 109s] make[2]: Entering directory
`/home/abuild/rpmbuild/BUILD/yast2-3.1.3/doc/autodocs'
[ 109s] make[2]: Nothing to be done for `check'.
[ 109s] make[2]: Leaving directory
`/home/abuild/rpmbuild/BUILD/yast2-3.1.3/doc/autodocs'
[ 109s] Making check in examples
[ 109s] make[2]: Entering directory
`/home/abuild/rpmbuild/BUILD/yast2-3.1.3/doc/examples'
[ 109s] make[2]: Nothing to be done for `check'.
[ 109s] make[2]: Leaving directory
`/home/abuild/rpmbuild/BUILD/yast2-3.1.3/doc/examples'
[ 109s] Making check in screenshots
[ 109s] make[2]: Entering directory
`/home/abuild/rpmbuild/BUILD/yast2-3.1.3/doc/screenshots'
[ 109s] make[2]: Nothing to be done for `check'.
[ 109s] make[2]: Leaving directory
`/home/abuild/rpmbuild/BUILD/yast2-3.1.3/doc/screenshots'
[ 109s] make[2]: Entering directory
`/home/abuild/rpmbuild/BUILD/yast2-3.1.3/doc'
[ 109s] make[2]: Nothing to be done for `check-am'.
[ 109s] make[2]: Leaving directory
`/home/abuild/rpmbuild/BUILD/yast2-3.1.3/doc'
[ 109s] make[1]: Leaving directory
`/home/abuild/rpmbuild/BUILD/yast2-3.1.3/doc'
[ 109s] Making check in library
[ 109s] make[1]: Entering directory
`/home/abuild/rpmbuild/BUILD/yast2-3.1.3/library'
[ 109s] Making check in types
[ 109s] make[2]: Entering directory
`/home/abuild/rpmbuild/BUILD/yast2-3.1.3/library/types'
[ 109s] Making check in src
[ 109s] make[3]: Entering directory
`/home/abuild/rpmbuild/BUILD/yast2-3.1.3/library/types/src'
[ 109s] make[3]: Nothing to be done for `check'.
[ 109s] make[3]: Leaving directory
`/home/abuild/rpmbuild/BUILD/yast2-3.1.3/library/types/src'
[ 109s] Making check in testsuite
[ 109s] make[3]: Entering directory
`/home/abuild/rpmbuild/BUILD/yast2-3.1.3/library/types/testsuite'
[ 109s] make -f /usr/share/YaST2/data/testsuite/Makefile.testsuite
RPMNAME=yast2 srcdir=.
[ 109s] make[4]: Entering directory
`/home/abuild/rpmbuild/BUILD/yast2-3.1.3/library/types/testsuite'
[ 109s] make[4]: Nothing to be done for `all'.
[ 109s] make[4]: Leaving directory
`/home/abuild/rpmbuild/BUILD/yast2-3.1.3/library/types/testsuite'
[ 109s] make check-DEJAGNU check-local
[ 109s] make[4]: Entering directory
`/home/abuild/rpmbuild/BUILD/yast2-3.1.3/library/types/testsuite'
[ 109s] Making a new site.exp file ...
[ 109s] srcdir='.'; export srcdir; \
[ 109s] EXPECT=expect; export EXPECT; \
[ 109s] if /bin/sh -c "runtest --version" > /dev/null 2>&1; then \
[ 109s] exit_status=0; l='yast2'; for tool in $l; do \
[ 109s] if runtest --tool $tool --srcdir $srcdir ; \
[ 109s] then :; else exit_status=1; fi; \
[ 109s] done; \
[ 109s] else echo "WARNING: could not find 'runtest'" 1>&2; :;\
[ 109s] fi; \
[ 109s] exit $exit_status
[ 109s] WARNING: Couldn't find tool init file
[ 109s] Test Run By abuild on Tue Nov 12 10:34:49 2013
[ 109s] Native configuration is x86_64-suse-linux-gnu
[ 109s]
[ 109s] === yast2 tests ===
[ 109s]
[ 109s] Schedule of variations:
[ 109s] unix
[ 109s]
[ 109s] Running target unix
[ 109s] Using /usr/share/dejagnu/baseboards/unix.exp as board description file
for target.
[ 109s] Using /usr/share/dejagnu/config/unix.exp as generic interface file for
target.
[ 109s] Using ./config/unix.exp as tool-and-target-specific interface file.
[ 109s] Running ./yast2.test/testsuite.exp ...
[ 109s]
[ 109s] Checking started
[ 109s]
[ 109s] Running Address ...
[ 110s] Running FindMountPoint ...
[ 110s] Running Hostname ...
[ 110s] Running IP ...
[ 110s] Running IPvalidation ...
[ 110s] Running Integer ...
[ 111s] Running Map ...
[ 111s] Running Netmask ...
[ 111s] Running String ...
[ 111s] Running URL ...
[ 112s] Running URLRecode ...
[ 112s] Running enumtype ...
[ 112s] Running isempty ...
[ 113s] Running regextype ...
[ 113s] Running undefinedtype ...
[ 113s]
[ 113s] Checking finished
[ 113s]
[ 113s]
[ 113s] === yast2 Summary ===
[ 113s]
[ 113s] # of expected passes 15
[ 113s] make -f /usr/share/YaST2/data/testsuite/Makefile.testsuite
RPMNAME=yast2 srcdir=. check
[ 113s] make[5]: Entering directory
`/home/abuild/rpmbuild/BUILD/yast2-3.1.3/library/types/testsuite'
[ 113s]
[ 113s] Parse YCP
[ 113s] NOT RUNNING
[ 113s]
[ 113s] make[5]: Leaving directory
`/home/abuild/rpmbuild/BUILD/yast2-3.1.3/library/types/testsuite'
[ 113s] make[4]: Leaving directory
`/home/abuild/rpmbuild/BUILD/yast2-3.1.3/library/types/testsuite'
[ 113s] make[3]: Leaving directory
`/home/abuild/rpmbuild/BUILD/yast2-3.1.3/library/types/testsuite'
[ 113s] Making check in doc
[ 113s] make[3]: Entering directory
`/home/abuild/rpmbuild/BUILD/yast2-3.1.3/library/types/doc'
[ 113s] Making check in autodocs
[ 113s] make[4]: Entering directory
`/home/abuild/rpmbuild/BUILD/yast2-3.1.3/library/types/doc/autodocs'
[ 113s] make[4]: Nothing to be done for `check'.
[ 113s] make[4]: Leaving directory
`/home/abuild/rpmbuild/BUILD/yast2-3.1.3/library/types/doc/autodocs'
[ 113s] make[4]: Entering directory
`/home/abuild/rpmbuild/BUILD/yast2-3.1.3/library/types/doc'
[ 113s] make[4]: Nothing to be done for `check-am'.
[ 113s] make[4]: Leaving directory
`/home/abuild/rpmbuild/BUILD/yast2-3.1.3/library/types/doc'
[ 113s] make[3]: Leaving directory
`/home/abuild/rpmbuild/BUILD/yast2-3.1.3/library/types/doc'
[ 113s] Making check in test
[ 113s] make[3]: Entering directory
`/home/abuild/rpmbuild/BUILD/yast2-3.1.3/library/types/test'
[ 113s] make check-TESTS
[ 113s] make[4]: Entering directory
`/home/abuild/rpmbuild/BUILD/yast2-3.1.3/library/types/test'
[ 113s] make[5]: Entering directory
`/home/abuild/rpmbuild/BUILD/yast2-3.1.3/library/types/test'
[ 113s] FAIL: ipv4_netmask_test.rb
[ 113s] make[6]: Entering directory
`/home/abuild/rpmbuild/BUILD/yast2-3.1.3/library/types/test'
[ 113s] make[6]: Nothing to be done for `all'.
[ 113s] make[6]: Leaving directory
`/home/abuild/rpmbuild/BUILD/yast2-3.1.3/library/types/test'
[ 113s] ====================================================
[ 113s] yast2 3.1.3: library/types/test/test-suite.log
[ 113s] ====================================================
[ 113s]
[ 113s] # TOTAL: 1
[ 113s] # PASS: 0
[ 113s] # SKIP: 0
[ 113s] # XFAIL: 0
[ 113s] # FAIL: 1
[ 113s] # XPASS: 0
[ 113s] # ERROR: 0
[ 113s]
[ 113s] .. contents:: :depth: 2
[ 113s]
[ 113s] FAIL: ipv4_netmask_test
[ 113s] =======================
[ 113s]
[ 113s] ruby: no Ruby script found in input (LoadError)
[ 113s]
[ 113s]
============================================================================
[ 113s] Testsuite summary for yast2 3.1.3
[ 113s]
============================================================================
[ 113s] # TOTAL: 1
[ 113s] # PASS: 0
[ 113s] # SKIP: 0
[ 113s] # XFAIL: 0
[ 113s] # FAIL: 1
[ 113s] # XPASS: 0
[ 113s] # ERROR: 0
[ 113s]
============================================================================
[ 113s] See library/types/test/test-suite.log
[ 113s] Please report to http://bugs.opensuse.org/
[ 113s]
============================================================================
[ 113s] make[5]: *** [test-suite.log] Error 1
[ 113s] make[5]: Leaving directory
`/home/abuild/rpmbuild/BUILD/yast2-3.1.3/library/types/test'
[ 113s] make[4]: *** [check-TESTS] Error 2
[ 113s] make[4]: Leaving directory
`/home/abuild/rpmbuild/BUILD/yast2-3.1.3/library/types/test'
[ 113s] make[3]: *** [check-am] Error 2
[ 113s] make[3]: Leaving directory
`/home/abuild/rpmbuild/BUILD/yast2-3.1.3/library/types/test'
[ 113s] make[2]: *** [check-recursive] Error 1
[ 113s] make[2]: Leaving directory
`/home/abuild/rpmbuild/BUILD/yast2-3.1.3/library/types'
[ 113s] make[1]: *** [check-recursive] Error 1
[ 113s] make[1]: Leaving directory
`/home/abuild/rpmbuild/BUILD/yast2-3.1.3/library'
[ 113s] make: *** [check-recursive] Error 1
[ 113s] error: Bad exit status from /var/tmp/rpm-tmp.hQ487O (%install)
[ 113s]
[ 113s]
[ 113s] RPM build errors:
[ 113s] Bad exit status from /var/tmp/rpm-tmp.hQ487O (%install)
Run source service: /usr/lib/obs/service/format_spec_file --outdir
/tmp/tmpEm0EHL
Run source service: /usr/lib/obs/service/source_validator --outdir
/tmp/tmp3rxJY0
Building yast2.spec for openSUSE_Factory/x86_64
Getting buildinfo from server and store to
<http://ci.opensuse.org/job/yast-yast2-master/ws/YaST>:Head/yast2/.osc/_buildinfo-openSUSE_Factory-x86_64.xml
Getting buildconfig from server and store to
<http://ci.opensuse.org/job/yast-yast2-master/ws/YaST>:Head/yast2/.osc/_buildconfig-openSUSE_Factory-x86_64
Updating cache of required packages
0.0% cache miss. 159/159 dependencies cached.

Skipping verification of package signatures
Writing build configuration
Running build

The buildroot was: /var/tmp/build-root-openSUSE_Factory
rm -rf YaST:Head
rake aborted!
Command failed with status (1): [osc build --no-verify --release=1 --root=/...]

Tasks: TOP => osc:sr => osc:commit => osc:build
(See full trace by running task with --trace)
cleaning
Build step 'Execute shell' marked build as failure
--
To unsubscribe, e-mail: yast-commit+unsubscribe@xxxxxxxxxxxx
For additional commands, e-mail: yast-commit+help@xxxxxxxxxxxx

< Previous Next >
This Thread
Follow Ups