Mailinglist Archive: yast-commit (5667 mails)

< Previous Next >
[yast-commit] Build failed in Jenkins: yast-installation-master #23
  • From: admin@xxxxxxxxxxxx
  • Date: Mon, 11 Nov 2013 15:59:42 +0100 (CET)
  • Message-id: <1223444716.3.1384181982084.JavaMail.jenkins@ci-opensuse>
See <http://ci.opensuse.org/job/yast-installation-master/23/>

------------------------------------------
[...truncated 2128 lines...]
[ 21s] make[3]: Leaving directory
`/home/abuild/rpmbuild/BUILD/yast2-installation-3.1.5/control'
[ 21s] make[2]: Leaving directory
`/home/abuild/rpmbuild/BUILD/yast2-installation-3.1.5/control'
[ 21s] Making install in docs
[ 21s] make[2]: Entering directory
`/home/abuild/rpmbuild/BUILD/yast2-installation-3.1.5/control/docs'
[ 21s] Making install in examples
[ 21s] make[3]: Entering directory
`/home/abuild/rpmbuild/BUILD/yast2-installation-3.1.5/control/docs/examples'
[ 21s] make[4]: Entering directory
`/home/abuild/rpmbuild/BUILD/yast2-installation-3.1.5/control/docs/examples'
[ 21s] make[4]: Nothing to be done for `install-exec-am'.
[ 21s] make[4]: Nothing to be done for `install-data-am'.
[ 21s] make[4]: Leaving directory
`/home/abuild/rpmbuild/BUILD/yast2-installation-3.1.5/control/docs/examples'
[ 21s] make[3]: Leaving directory
`/home/abuild/rpmbuild/BUILD/yast2-installation-3.1.5/control/docs/examples'
[ 21s] make[3]: Entering directory
`/home/abuild/rpmbuild/BUILD/yast2-installation-3.1.5/control/docs'
[ 21s] make[4]: Entering directory
`/home/abuild/rpmbuild/BUILD/yast2-installation-3.1.5/control/docs'
[ 21s] make[4]: Nothing to be done for `install-exec-am'.
[ 21s] mkdir -p
/home/abuild/rpmbuild/BUILDROOT/yast2-installation-3.1.5-1.x86_64/usr/share/doc/packages/yast2-installation/control-doc
[ 21s] cp -a ./html/images
/home/abuild/rpmbuild/BUILDROOT/yast2-installation-3.1.5-1.x86_64/usr/share/doc/packages/yast2-installation/control-doc
[ 21s] /usr/bin/mkdir -p
'/home/abuild/rpmbuild/BUILDROOT/yast2-installation-3.1.5-1.x86_64/usr/share/doc/packages/yast2-installation/control-doc'
[ 21s] /usr/bin/install -c -p -m 644 html/index.html html/yast2docs.css
'/home/abuild/rpmbuild/BUILDROOT/yast2-installation-3.1.5-1.x86_64/usr/share/doc/packages/yast2-installation/control-doc'
[ 21s] make[4]: Leaving directory
`/home/abuild/rpmbuild/BUILD/yast2-installation-3.1.5/control/docs'
[ 21s] make[3]: Leaving directory
`/home/abuild/rpmbuild/BUILD/yast2-installation-3.1.5/control/docs'
[ 21s] make[2]: Leaving directory
`/home/abuild/rpmbuild/BUILD/yast2-installation-3.1.5/control/docs'
[ 21s] Making install in tests
[ 21s] make[2]: Entering directory
`/home/abuild/rpmbuild/BUILD/yast2-installation-3.1.5/control/tests'
[ 21s] make[3]: Entering directory
`/home/abuild/rpmbuild/BUILD/yast2-installation-3.1.5/control/tests'
[ 21s] make[3]: Nothing to be done for `install-exec-am'.
[ 21s] /usr/bin/mkdir -p
'/home/abuild/rpmbuild/BUILDROOT/yast2-installation-3.1.5-1.x86_64/usr/share/YaST2/clients'
[ 21s] /usr/bin/install -c -p -m 644 inst_test_workflow.rb
complete_workflow.rb
'/home/abuild/rpmbuild/BUILDROOT/yast2-installation-3.1.5-1.x86_64/usr/share/YaST2/clients'
[ 21s] make[3]: Leaving directory
`/home/abuild/rpmbuild/BUILD/yast2-installation-3.1.5/control/tests'
[ 21s] make[2]: Leaving directory
`/home/abuild/rpmbuild/BUILD/yast2-installation-3.1.5/control/tests'
[ 21s] Making install in examples
[ 21s] make[2]: Entering directory
`/home/abuild/rpmbuild/BUILD/yast2-installation-3.1.5/control/examples'
[ 21s] make[3]: Entering directory
`/home/abuild/rpmbuild/BUILD/yast2-installation-3.1.5/control/examples'
[ 21s] make[3]: Nothing to be done for `install-exec-am'.
[ 21s] make[3]: Nothing to be done for `install-data-am'.
[ 21s] make[3]: Leaving directory
`/home/abuild/rpmbuild/BUILD/yast2-installation-3.1.5/control/examples'
[ 21s] make[2]: Leaving directory
`/home/abuild/rpmbuild/BUILD/yast2-installation-3.1.5/control/examples'
[ 21s] make[1]: Leaving directory
`/home/abuild/rpmbuild/BUILD/yast2-installation-3.1.5/control'
[ 21s] Making install in autoyast_desktop
[ 21s] make[1]: Entering directory
`/home/abuild/rpmbuild/BUILD/yast2-installation-3.1.5/autoyast_desktop'
[ 21s] make[2]: Entering directory
`/home/abuild/rpmbuild/BUILD/yast2-installation-3.1.5/autoyast_desktop'
[ 21s] make[2]: Nothing to be done for `install-exec-am'.
[ 21s] /usr/bin/mkdir -p
'/home/abuild/rpmbuild/BUILDROOT/yast2-installation-3.1.5-1.x86_64/usr/share/autoinstall/modules'
[ 21s] /usr/bin/install -c -p -m 644 deploy_image.desktop
'/home/abuild/rpmbuild/BUILDROOT/yast2-installation-3.1.5-1.x86_64/usr/share/autoinstall/modules'
[ 21s] make[2]: Leaving directory
`/home/abuild/rpmbuild/BUILD/yast2-installation-3.1.5/autoyast_desktop'
[ 21s] make[1]: Leaving directory
`/home/abuild/rpmbuild/BUILD/yast2-installation-3.1.5/autoyast_desktop'
[ 21s] Making install in test
[ 21s] make[1]: Entering directory
`/home/abuild/rpmbuild/BUILD/yast2-installation-3.1.5/test'
[ 21s] make[2]: Entering directory
`/home/abuild/rpmbuild/BUILD/yast2-installation-3.1.5/test'
[ 21s] make[2]: Nothing to be done for `install-exec-am'.
[ 21s] make[2]: Nothing to be done for `install-data-am'.
[ 21s] make[2]: Leaving directory
`/home/abuild/rpmbuild/BUILD/yast2-installation-3.1.5/test'
[ 21s] make[1]: Leaving directory
`/home/abuild/rpmbuild/BUILD/yast2-installation-3.1.5/test'
[ 21s] make[1]: Entering directory
`/home/abuild/rpmbuild/BUILD/yast2-installation-3.1.5'
[ 21s] make[2]: Entering directory
`/home/abuild/rpmbuild/BUILD/yast2-installation-3.1.5'
[ 21s] make[2]: Nothing to be done for `install-exec-am'.
[ 21s] /usr/bin/mkdir -p
'/home/abuild/rpmbuild/BUILDROOT/yast2-installation-3.1.5-1.x86_64/usr/share/doc/packages/yast2-installation'
[ 21s] /usr/bin/install -c -p -m 644 COPYING
'/home/abuild/rpmbuild/BUILDROOT/yast2-installation-3.1.5-1.x86_64/usr/share/doc/packages/yast2-installation'
[ 21s] make[2]: Leaving directory
`/home/abuild/rpmbuild/BUILD/yast2-installation-3.1.5'
[ 21s] make[1]: Leaving directory
`/home/abuild/rpmbuild/BUILD/yast2-installation-3.1.5'
[ 21s] + '[' '!' -f /usr/share/YaST2/data/devtools/NO_MAKE_CHECK ']'
[ 21s] + make check VERBOSE=1
Y2DIR=/home/abuild/rpmbuild/BUILDROOT/yast2-installation-3.1.5-1.x86_64//usr/share/YaST2
DESTDIR=/home/abuild/rpmbuild/BUILDROOT/yast2-installation-3.1.5-1.x86_64
[ 21s] Making check in src
[ 21s] make[1]: Entering directory
`/home/abuild/rpmbuild/BUILD/yast2-installation-3.1.5/src'
[ 21s] make[1]: Nothing to be done for `check'.
[ 21s] make[1]: Leaving directory
`/home/abuild/rpmbuild/BUILD/yast2-installation-3.1.5/src'
[ 21s] Making check in doc
[ 21s] make[1]: Entering directory
`/home/abuild/rpmbuild/BUILD/yast2-installation-3.1.5/doc'
[ 21s] Making check in autodocs
[ 21s] make[2]: Entering directory
`/home/abuild/rpmbuild/BUILD/yast2-installation-3.1.5/doc/autodocs'
[ 21s] make[2]: Nothing to be done for `check'.
[ 21s] make[2]: Leaving directory
`/home/abuild/rpmbuild/BUILD/yast2-installation-3.1.5/doc/autodocs'
[ 21s] Making check in proposal
[ 21s] make[2]: Entering directory
`/home/abuild/rpmbuild/BUILD/yast2-installation-3.1.5/doc/proposal'
[ 21s] make[2]: Nothing to be done for `check'.
[ 21s] make[2]: Leaving directory
`/home/abuild/rpmbuild/BUILD/yast2-installation-3.1.5/doc/proposal'
[ 21s] Making check in features
[ 21s] make[2]: Entering directory
`/home/abuild/rpmbuild/BUILD/yast2-installation-3.1.5/doc/features'
[ 21s] Making check in examples
[ 21s] make[3]: Entering directory
`/home/abuild/rpmbuild/BUILD/yast2-installation-3.1.5/doc/features/examples'
[ 21s] make[3]: Nothing to be done for `check'.
[ 21s] make[3]: Leaving directory
`/home/abuild/rpmbuild/BUILD/yast2-installation-3.1.5/doc/features/examples'
[ 21s] make[3]: Entering directory
`/home/abuild/rpmbuild/BUILD/yast2-installation-3.1.5/doc/features'
[ 21s] make[3]: Nothing to be done for `check-am'.
[ 21s] make[3]: Leaving directory
`/home/abuild/rpmbuild/BUILD/yast2-installation-3.1.5/doc/features'
[ 21s] make[2]: Leaving directory
`/home/abuild/rpmbuild/BUILD/yast2-installation-3.1.5/doc/features'
[ 21s] Making check in inst_images
[ 21s] make[2]: Entering directory
`/home/abuild/rpmbuild/BUILD/yast2-installation-3.1.5/doc/inst_images'
[ 21s] make[3]: Entering directory
`/home/abuild/rpmbuild/BUILD/yast2-installation-3.1.5/doc/inst_images'
[ 21s] make[3]: Nothing to be done for `check-am'.
[ 21s] make[3]: Leaving directory
`/home/abuild/rpmbuild/BUILD/yast2-installation-3.1.5/doc/inst_images'
[ 21s] make[2]: Leaving directory
`/home/abuild/rpmbuild/BUILD/yast2-installation-3.1.5/doc/inst_images'
[ 21s] make[2]: Entering directory
`/home/abuild/rpmbuild/BUILD/yast2-installation-3.1.5/doc'
[ 21s] make[2]: Nothing to be done for `check-am'.
[ 21s] make[2]: Leaving directory
`/home/abuild/rpmbuild/BUILD/yast2-installation-3.1.5/doc'
[ 21s] make[1]: Leaving directory
`/home/abuild/rpmbuild/BUILD/yast2-installation-3.1.5/doc'
[ 21s] Making check in startup
[ 21s] make[1]: Entering directory
`/home/abuild/rpmbuild/BUILD/yast2-installation-3.1.5/startup'
[ 21s] Making check in First-Stage
[ 21s] make[2]: Entering directory
`/home/abuild/rpmbuild/BUILD/yast2-installation-3.1.5/startup/First-Stage'
[ 21s] make[2]: Nothing to be done for `check'.
[ 21s] make[2]: Leaving directory
`/home/abuild/rpmbuild/BUILD/yast2-installation-3.1.5/startup/First-Stage'
[ 21s] Making check in Second-Stage
[ 21s] make[2]: Entering directory
`/home/abuild/rpmbuild/BUILD/yast2-installation-3.1.5/startup/Second-Stage'
[ 21s] make[2]: Nothing to be done for `check'.
[ 21s] make[2]: Leaving directory
`/home/abuild/rpmbuild/BUILD/yast2-installation-3.1.5/startup/Second-Stage'
[ 21s] Making check in arch
[ 21s] make[2]: Entering directory
`/home/abuild/rpmbuild/BUILD/yast2-installation-3.1.5/startup/arch'
[ 21s] Making check in ppc
[ 21s] make[3]: Entering directory
`/home/abuild/rpmbuild/BUILD/yast2-installation-3.1.5/startup/arch/ppc'
[ 21s] make[3]: Nothing to be done for `check'.
[ 21s] make[3]: Leaving directory
`/home/abuild/rpmbuild/BUILD/yast2-installation-3.1.5/startup/arch/ppc'
[ 21s] Making check in s390
[ 21s] make[3]: Entering directory
`/home/abuild/rpmbuild/BUILD/yast2-installation-3.1.5/startup/arch/s390'
[ 21s] make[3]: Nothing to be done for `check'.
[ 21s] make[3]: Leaving directory
`/home/abuild/rpmbuild/BUILD/yast2-installation-3.1.5/startup/arch/s390'
[ 21s] Making check in x86_64
[ 21s] make[3]: Entering directory
`/home/abuild/rpmbuild/BUILD/yast2-installation-3.1.5/startup/arch/x86_64'
[ 21s] make[3]: Nothing to be done for `check'.
[ 21s] make[3]: Leaving directory
`/home/abuild/rpmbuild/BUILD/yast2-installation-3.1.5/startup/arch/x86_64'
[ 21s] Making check in ia64
[ 21s] make[3]: Entering directory
`/home/abuild/rpmbuild/BUILD/yast2-installation-3.1.5/startup/arch/ia64'
[ 21s] make[3]: Nothing to be done for `check'.
[ 21s] make[3]: Leaving directory
`/home/abuild/rpmbuild/BUILD/yast2-installation-3.1.5/startup/arch/ia64'
[ 21s] Making check in i386
[ 21s] make[3]: Entering directory
`/home/abuild/rpmbuild/BUILD/yast2-installation-3.1.5/startup/arch/i386'
[ 21s] make[3]: Nothing to be done for `check'.
[ 21s] make[3]: Leaving directory
`/home/abuild/rpmbuild/BUILD/yast2-installation-3.1.5/startup/arch/i386'
[ 21s] make[3]: Entering directory
`/home/abuild/rpmbuild/BUILD/yast2-installation-3.1.5/startup/arch'
[ 21s] make[3]: Nothing to be done for `check-am'.
[ 21s] make[3]: Leaving directory
`/home/abuild/rpmbuild/BUILD/yast2-installation-3.1.5/startup/arch'
[ 21s] make[2]: Leaving directory
`/home/abuild/rpmbuild/BUILD/yast2-installation-3.1.5/startup/arch'
[ 21s] Making check in common
[ 21s] make[2]: Entering directory
`/home/abuild/rpmbuild/BUILD/yast2-installation-3.1.5/startup/common'
[ 21s] make[2]: Nothing to be done for `check'.
[ 21s] make[2]: Leaving directory
`/home/abuild/rpmbuild/BUILD/yast2-installation-3.1.5/startup/common'
[ 21s] Making check in hooks
[ 21s] make[2]: Entering directory
`/home/abuild/rpmbuild/BUILD/yast2-installation-3.1.5/startup/hooks'
[ 21s] Making check in postFirstCall
[ 21s] make[3]: Entering directory
`/home/abuild/rpmbuild/BUILD/yast2-installation-3.1.5/startup/hooks/postFirstCall'
[ 21s] make[3]: Nothing to be done for `check'.
[ 21s] make[3]: Leaving directory
`/home/abuild/rpmbuild/BUILD/yast2-installation-3.1.5/startup/hooks/postFirstCall'
[ 21s] Making check in postFirstStage
[ 21s] make[3]: Entering directory
`/home/abuild/rpmbuild/BUILD/yast2-installation-3.1.5/startup/hooks/postFirstStage'
[ 21s] make[3]: Nothing to be done for `check'.
[ 21s] make[3]: Leaving directory
`/home/abuild/rpmbuild/BUILD/yast2-installation-3.1.5/startup/hooks/postFirstStage'
[ 21s] Making check in postSecondCall
[ 21s] make[3]: Entering directory
`/home/abuild/rpmbuild/BUILD/yast2-installation-3.1.5/startup/hooks/postSecondCall'
[ 21s] make[3]: Nothing to be done for `check'.
[ 21s] make[3]: Leaving directory
`/home/abuild/rpmbuild/BUILD/yast2-installation-3.1.5/startup/hooks/postSecondCall'
[ 21s] Making check in postSecondStage
[ 21s] make[3]: Entering directory
`/home/abuild/rpmbuild/BUILD/yast2-installation-3.1.5/startup/hooks/postSecondStage'
[ 21s] make[3]: Nothing to be done for `check'.
[ 21s] make[3]: Leaving directory
`/home/abuild/rpmbuild/BUILD/yast2-installation-3.1.5/startup/hooks/postSecondStage'
[ 21s] Making check in preFirstCall
[ 21s] make[3]: Entering directory
`/home/abuild/rpmbuild/BUILD/yast2-installation-3.1.5/startup/hooks/preFirstCall'
[ 21s] make[3]: Nothing to be done for `check'.
[ 21s] make[3]: Leaving directory
`/home/abuild/rpmbuild/BUILD/yast2-installation-3.1.5/startup/hooks/preFirstCall'
[ 21s] Making check in preFirstStage
[ 21s] make[3]: Entering directory
`/home/abuild/rpmbuild/BUILD/yast2-installation-3.1.5/startup/hooks/preFirstStage'
[ 21s] make[3]: Nothing to be done for `check'.
[ 21s] make[3]: Leaving directory
`/home/abuild/rpmbuild/BUILD/yast2-installation-3.1.5/startup/hooks/preFirstStage'
[ 21s] Making check in preSecondCall
[ 21s] make[3]: Entering directory
`/home/abuild/rpmbuild/BUILD/yast2-installation-3.1.5/startup/hooks/preSecondCall'
[ 21s] make[3]: Nothing to be done for `check'.
[ 21s] make[3]: Leaving directory
`/home/abuild/rpmbuild/BUILD/yast2-installation-3.1.5/startup/hooks/preSecondCall'
[ 21s] Making check in preSecondStage
[ 21s] make[3]: Entering directory
`/home/abuild/rpmbuild/BUILD/yast2-installation-3.1.5/startup/hooks/preSecondStage'
[ 21s] make[3]: Nothing to be done for `check'.
[ 21s] make[3]: Leaving directory
`/home/abuild/rpmbuild/BUILD/yast2-installation-3.1.5/startup/hooks/preSecondStage'
[ 21s] make[3]: Entering directory
`/home/abuild/rpmbuild/BUILD/yast2-installation-3.1.5/startup/hooks'
[ 21s] make[3]: Nothing to be done for `check-am'.
[ 21s] make[3]: Leaving directory
`/home/abuild/rpmbuild/BUILD/yast2-installation-3.1.5/startup/hooks'
[ 21s] make[2]: Leaving directory
`/home/abuild/rpmbuild/BUILD/yast2-installation-3.1.5/startup/hooks'
[ 21s] make[2]: Entering directory
`/home/abuild/rpmbuild/BUILD/yast2-installation-3.1.5/startup'
[ 21s] make[2]: Nothing to be done for `check-am'.
[ 21s] make[2]: Leaving directory
`/home/abuild/rpmbuild/BUILD/yast2-installation-3.1.5/startup'
[ 21s] make[1]: Leaving directory
`/home/abuild/rpmbuild/BUILD/yast2-installation-3.1.5/startup'
[ 21s] Making check in control
[ 21s] make[1]: Entering directory
`/home/abuild/rpmbuild/BUILD/yast2-installation-3.1.5/control'
[ 21s] Making check in .
[ 21s] make[2]: Entering directory
`/home/abuild/rpmbuild/BUILD/yast2-installation-3.1.5/control'
[ 21s] make check-local
[ 21s] make[3]: Entering directory
`/home/abuild/rpmbuild/BUILD/yast2-installation-3.1.5/control'
[ 21s] xmllint --relaxng control.rng --noout control.SLED.xml
control.SLES.xml control.openSUSE.xml add-on-template_installation.xml
[ 21s] control.SLED.xml validates
[ 21s] control.SLES.xml validates
[ 21s] control.openSUSE.xml validates
[ 21s] add-on-template_installation.xml validates
[ 21s] make[3]: Leaving directory
`/home/abuild/rpmbuild/BUILD/yast2-installation-3.1.5/control'
[ 21s] make[2]: Leaving directory
`/home/abuild/rpmbuild/BUILD/yast2-installation-3.1.5/control'
[ 21s] Making check in docs
[ 21s] make[2]: Entering directory
`/home/abuild/rpmbuild/BUILD/yast2-installation-3.1.5/control/docs'
[ 21s] Making check in examples
[ 21s] make[3]: Entering directory
`/home/abuild/rpmbuild/BUILD/yast2-installation-3.1.5/control/docs/examples'
[ 21s] make[3]: Nothing to be done for `check'.
[ 21s] make[3]: Leaving directory
`/home/abuild/rpmbuild/BUILD/yast2-installation-3.1.5/control/docs/examples'
[ 21s] make[3]: Entering directory
`/home/abuild/rpmbuild/BUILD/yast2-installation-3.1.5/control/docs'
[ 21s] make[3]: Nothing to be done for `check-am'.
[ 21s] make[3]: Leaving directory
`/home/abuild/rpmbuild/BUILD/yast2-installation-3.1.5/control/docs'
[ 21s] make[2]: Leaving directory
`/home/abuild/rpmbuild/BUILD/yast2-installation-3.1.5/control/docs'
[ 21s] Making check in tests
[ 21s] make[2]: Entering directory
`/home/abuild/rpmbuild/BUILD/yast2-installation-3.1.5/control/tests'
[ 21s] make[2]: Nothing to be done for `check'.
[ 21s] make[2]: Leaving directory
`/home/abuild/rpmbuild/BUILD/yast2-installation-3.1.5/control/tests'
[ 21s] Making check in examples
[ 21s] make[2]: Entering directory
`/home/abuild/rpmbuild/BUILD/yast2-installation-3.1.5/control/examples'
[ 21s] make check-local
[ 21s] make[3]: Entering directory
`/home/abuild/rpmbuild/BUILD/yast2-installation-3.1.5/control/examples'
[ 21s] xmllint --relaxng ../control.rng --noout control_default.xml
add-on-2.xml control_flex_part.xml custom.xml add-on-1.xml
[ 21s] control_default.xml validates
[ 21s] add-on-2.xml validates
[ 21s] control_flex_part.xml validates
[ 21s] custom.xml:16: element default_target: Relax-NG validity error :
Expecting element incomplete_translation_treshold, got default_target
[ 21s] custom.xml:13: element enable_autologin: Relax-NG validity error :
Element globals has extra content: enable_autologin
[ 21s] custom.xml fails to validate
[ 21s] add-on-1.xml validates
[ 21s] make[3]: *** [check-local] Error 3
[ 21s] make[3]: Leaving directory
`/home/abuild/rpmbuild/BUILD/yast2-installation-3.1.5/control/examples'
[ 21s] make[2]: *** [check-am] Error 2
[ 21s] make[2]: Leaving directory
`/home/abuild/rpmbuild/BUILD/yast2-installation-3.1.5/control/examples'
[ 21s] make[1]: *** [check-recursive] Error 1
[ 21s] make[1]: Leaving directory
`/home/abuild/rpmbuild/BUILD/yast2-installation-3.1.5/control'
[ 21s] make: *** [check-recursive] Error 1
[ 21s] error: Bad exit status from /var/tmp/rpm-tmp.3Qv7sq (%install)
[ 21s]
[ 21s]
[ 21s] RPM build errors:
[ 21s] Bad exit status from /var/tmp/rpm-tmp.3Qv7sq (%install)
Run source service: /usr/lib/obs/service/format_spec_file --outdir
/tmp/tmpQdQ3k_
Run source service: /usr/lib/obs/service/source_validator --outdir
/tmp/tmpWTDpjq
Building yast2-installation.spec for openSUSE_Factory/x86_64
Getting buildinfo from server and store to
<http://ci.opensuse.org/job/yast-installation-master/ws/YaST>:Head/yast2-installation/.osc/_buildinfo-openSUSE_Factory-x86_64.xml
Getting buildconfig from server and store to
<http://ci.opensuse.org/job/yast-installation-master/ws/YaST>:Head/yast2-installation/.osc/_buildconfig-openSUSE_Factory-x86_64
Updating cache of required packages
0.0% cache miss. 281/281 dependencies cached.

Skipping verification of package signatures
Writing build configuration
Running build

The buildroot was: /var/tmp/build-root-openSUSE_Factory
rm -rf YaST:Head
rake aborted!
Command failed with status (1): [osc build --no-verify --release=1 --root=/...]

Tasks: TOP => osc:sr => osc:commit => osc:build
(See full trace by running task with --trace)
cleaning
Build step 'Execute shell' marked build as failure
--
To unsubscribe, e-mail: yast-commit+unsubscribe@xxxxxxxxxxxx
For additional commands, e-mail: yast-commit+help@xxxxxxxxxxxx

< Previous Next >
This Thread
Follow Ups
References