Mailinglist Archive: yast-commit (5667 mails)

< Previous Next >
[yast-commit] Build failed in Jenkins: yast-yast2-master #19
  • From: admin@xxxxxxxxxxxx
  • Date: Mon, 11 Nov 2013 14:23:59 +0100 (CET)
  • Message-id: <334042089.0.1384176239305.JavaMail.jenkins@ci-opensuse>
See <http://ci.opensuse.org/job/yast-yast2-master/19/changes>

Changes:

[vmoravec] Replace runlevel with default target in public API

------------------------------------------
[...truncated 7108 lines...]
[ 119s] Running command3 ...
[ 120s] Running command4 ...
[ 120s] Running command5 ...
[ 120s] Running command6 ...
[ 121s] Running command7 ...
[ 121s] Running help ...
[ 121s] Running help1 ...
[ 122s] Running interactive1 ...
[ 122s] Running interactive2 ...
[ 122s] Running interactive3 ...
[ 123s] Running interactive4 ...
[ 123s] Running interactive5 ...
[ 124s] Running longhelp ...
[ 124s] Running startgui1 ...
[ 124s] Running startgui2 ...
[ 125s] Skipping file testsuitedata.rb ...
[ 125s] Running unique1 ...
[ 125s]
[ 125s] Checking finished
[ 125s]
[ 125s]
[ 125s] === yast2 Summary ===
[ 125s]
[ 125s] # of expected passes 24
[ 125s] make -f /usr/share/YaST2/data/testsuite/Makefile.testsuite
RPMNAME=yast2 srcdir=. check
[ 125s] make[5]: Entering directory
`/home/abuild/rpmbuild/BUILD/yast2-3.1.3/library/commandline/testsuite'
[ 125s]
[ 125s] Parse YCP
[ 125s] NOT RUNNING
[ 125s]
[ 125s] make[5]: Leaving directory
`/home/abuild/rpmbuild/BUILD/yast2-3.1.3/library/commandline/testsuite'
[ 125s] make[4]: Leaving directory
`/home/abuild/rpmbuild/BUILD/yast2-3.1.3/library/commandline/testsuite'
[ 125s] make[3]: Leaving directory
`/home/abuild/rpmbuild/BUILD/yast2-3.1.3/library/commandline/testsuite'
[ 125s] make[3]: Entering directory
`/home/abuild/rpmbuild/BUILD/yast2-3.1.3/library/commandline'
[ 125s] make[3]: Nothing to be done for `check-am'.
[ 125s] make[3]: Leaving directory
`/home/abuild/rpmbuild/BUILD/yast2-3.1.3/library/commandline'
[ 125s] make[2]: Leaving directory
`/home/abuild/rpmbuild/BUILD/yast2-3.1.3/library/commandline'
[ 125s] Making check in desktop
[ 125s] make[2]: Entering directory
`/home/abuild/rpmbuild/BUILD/yast2-3.1.3/library/desktop'
[ 125s] Making check in doc
[ 125s] make[3]: Entering directory
`/home/abuild/rpmbuild/BUILD/yast2-3.1.3/library/desktop/doc'
[ 125s] Making check in autodocs
[ 125s] make[4]: Entering directory
`/home/abuild/rpmbuild/BUILD/yast2-3.1.3/library/desktop/doc/autodocs'
[ 125s] make[4]: Nothing to be done for `check'.
[ 125s] make[4]: Leaving directory
`/home/abuild/rpmbuild/BUILD/yast2-3.1.3/library/desktop/doc/autodocs'
[ 125s] make[4]: Entering directory
`/home/abuild/rpmbuild/BUILD/yast2-3.1.3/library/desktop/doc'
[ 125s] make[4]: Nothing to be done for `check-am'.
[ 125s] make[4]: Leaving directory
`/home/abuild/rpmbuild/BUILD/yast2-3.1.3/library/desktop/doc'
[ 125s] make[3]: Leaving directory
`/home/abuild/rpmbuild/BUILD/yast2-3.1.3/library/desktop/doc'
[ 125s] Making check in groups
[ 125s] make[3]: Entering directory
`/home/abuild/rpmbuild/BUILD/yast2-3.1.3/library/desktop/groups'
[ 125s] make[3]: Nothing to be done for `check'.
[ 125s] make[3]: Leaving directory
`/home/abuild/rpmbuild/BUILD/yast2-3.1.3/library/desktop/groups'
[ 125s] Making check in src
[ 125s] make[3]: Entering directory
`/home/abuild/rpmbuild/BUILD/yast2-3.1.3/library/desktop/src'
[ 125s] make[3]: Nothing to be done for `check'.
[ 125s] make[3]: Leaving directory
`/home/abuild/rpmbuild/BUILD/yast2-3.1.3/library/desktop/src'
[ 125s] make[3]: Entering directory
`/home/abuild/rpmbuild/BUILD/yast2-3.1.3/library/desktop'
[ 125s] make[3]: Nothing to be done for `check-am'.
[ 125s] make[3]: Leaving directory
`/home/abuild/rpmbuild/BUILD/yast2-3.1.3/library/desktop'
[ 125s] make[2]: Leaving directory
`/home/abuild/rpmbuild/BUILD/yast2-3.1.3/library/desktop'
[ 125s] Making check in wizard
[ 125s] make[2]: Entering directory
`/home/abuild/rpmbuild/BUILD/yast2-3.1.3/library/wizard'
[ 125s] Making check in doc
[ 125s] make[3]: Entering directory
`/home/abuild/rpmbuild/BUILD/yast2-3.1.3/library/wizard/doc'
[ 125s] Making check in autodocs
[ 125s] make[4]: Entering directory
`/home/abuild/rpmbuild/BUILD/yast2-3.1.3/library/wizard/doc/autodocs'
[ 125s] make[4]: Nothing to be done for `check'.
[ 125s] make[4]: Leaving directory
`/home/abuild/rpmbuild/BUILD/yast2-3.1.3/library/wizard/doc/autodocs'
[ 125s] Making check in examples
[ 125s] make[4]: Entering directory
`/home/abuild/rpmbuild/BUILD/yast2-3.1.3/library/wizard/doc/examples'
[ 125s] make[4]: Nothing to be done for `check'.
[ 125s] make[4]: Leaving directory
`/home/abuild/rpmbuild/BUILD/yast2-3.1.3/library/wizard/doc/examples'
[ 125s] Making check in screenshots
[ 125s] make[4]: Entering directory
`/home/abuild/rpmbuild/BUILD/yast2-3.1.3/library/wizard/doc/screenshots'
[ 125s] make[4]: Nothing to be done for `check'.
[ 125s] make[4]: Leaving directory
`/home/abuild/rpmbuild/BUILD/yast2-3.1.3/library/wizard/doc/screenshots'
[ 125s] make[4]: Entering directory
`/home/abuild/rpmbuild/BUILD/yast2-3.1.3/library/wizard/doc'
[ 125s] make[4]: Nothing to be done for `check-am'.
[ 125s] make[4]: Leaving directory
`/home/abuild/rpmbuild/BUILD/yast2-3.1.3/library/wizard/doc'
[ 125s] make[3]: Leaving directory
`/home/abuild/rpmbuild/BUILD/yast2-3.1.3/library/wizard/doc'
[ 125s] Making check in src
[ 125s] make[3]: Entering directory
`/home/abuild/rpmbuild/BUILD/yast2-3.1.3/library/wizard/src'
[ 125s] make[3]: Nothing to be done for `check'.
[ 125s] make[3]: Leaving directory
`/home/abuild/rpmbuild/BUILD/yast2-3.1.3/library/wizard/src'
[ 125s] Making check in testsuite
[ 125s] make[3]: Entering directory
`/home/abuild/rpmbuild/BUILD/yast2-3.1.3/library/wizard/testsuite'
[ 125s] make check-DEJAGNU
[ 125s] make[4]: Entering directory
`/home/abuild/rpmbuild/BUILD/yast2-3.1.3/library/wizard/testsuite'
[ 125s] Making a new site.exp file ...
[ 125s] srcdir='.'; export srcdir; \
[ 125s] EXPECT=expect; export EXPECT; \
[ 125s] if /bin/sh -c "runtest --version" > /dev/null 2>&1; then \
[ 125s] exit_status=0; l='wizard'; for tool in $l; do \
[ 125s] if runtest --tool $tool --srcdir $srcdir ; \
[ 125s] then :; else exit_status=1; fi; \
[ 125s] done; \
[ 125s] else echo "WARNING: could not find 'runtest'" 1>&2; :;\
[ 125s] fi; \
[ 125s] exit $exit_status
[ 125s] WARNING: Couldn't find tool init file
[ 125s] Test Run By abuild on Mon Nov 11 13:23:56 2013
[ 125s] Native configuration is x86_64-suse-linux-gnu
[ 125s]
[ 125s] === wizard tests ===
[ 125s]
[ 125s] Schedule of variations:
[ 125s] unix
[ 125s]
[ 125s] Running target unix
[ 125s] Using /usr/share/dejagnu/baseboards/unix.exp as board description file
for target.
[ 125s] Using /usr/share/dejagnu/config/unix.exp as generic interface file for
target.
[ 125s] Using ./config/unix.exp as tool-and-target-specific interface file.
[ 125s]
[ 125s] === wizard Summary ===
[ 125s]
[ 125s] make[4]: Leaving directory
`/home/abuild/rpmbuild/BUILD/yast2-3.1.3/library/wizard/testsuite'
[ 125s] make[3]: Leaving directory
`/home/abuild/rpmbuild/BUILD/yast2-3.1.3/library/wizard/testsuite'
[ 125s] make[3]: Entering directory
`/home/abuild/rpmbuild/BUILD/yast2-3.1.3/library/wizard'
[ 125s] make[3]: Nothing to be done for `check-am'.
[ 125s] make[3]: Leaving directory
`/home/abuild/rpmbuild/BUILD/yast2-3.1.3/library/wizard'
[ 125s] make[2]: Leaving directory
`/home/abuild/rpmbuild/BUILD/yast2-3.1.3/library/wizard'
[ 125s] Making check in control
[ 125s] make[2]: Entering directory
`/home/abuild/rpmbuild/BUILD/yast2-3.1.3/library/control'
[ 125s] Making check in doc
[ 125s] make[3]: Entering directory
`/home/abuild/rpmbuild/BUILD/yast2-3.1.3/library/control/doc'
[ 125s] Making check in autodocs
[ 125s] make[4]: Entering directory
`/home/abuild/rpmbuild/BUILD/yast2-3.1.3/library/control/doc/autodocs'
[ 125s] make[4]: Nothing to be done for `check'.
[ 125s] make[4]: Leaving directory
`/home/abuild/rpmbuild/BUILD/yast2-3.1.3/library/control/doc/autodocs'
[ 125s] make[4]: Entering directory
`/home/abuild/rpmbuild/BUILD/yast2-3.1.3/library/control/doc'
[ 125s] make[4]: Nothing to be done for `check-am'.
[ 125s] make[4]: Leaving directory
`/home/abuild/rpmbuild/BUILD/yast2-3.1.3/library/control/doc'
[ 125s] make[3]: Leaving directory
`/home/abuild/rpmbuild/BUILD/yast2-3.1.3/library/control/doc'
[ 125s] Making check in src
[ 125s] make[3]: Entering directory
`/home/abuild/rpmbuild/BUILD/yast2-3.1.3/library/control/src'
[ 125s] make[3]: Nothing to be done for `check'.
[ 125s] make[3]: Leaving directory
`/home/abuild/rpmbuild/BUILD/yast2-3.1.3/library/control/src'
[ 125s] Making check in testsuite
[ 125s] make[3]: Entering directory
`/home/abuild/rpmbuild/BUILD/yast2-3.1.3/library/control/testsuite'
[ 125s] make -f /usr/share/YaST2/data/testsuite/Makefile.testsuite
RPMNAME=yast2 srcdir=.
[ 125s] make[4]: Entering directory
`/home/abuild/rpmbuild/BUILD/yast2-3.1.3/library/control/testsuite'
[ 125s] make[4]: Nothing to be done for `all'.
[ 125s] make[4]: Leaving directory
`/home/abuild/rpmbuild/BUILD/yast2-3.1.3/library/control/testsuite'
[ 125s] make check-DEJAGNU check-local
[ 125s] make[4]: Entering directory
`/home/abuild/rpmbuild/BUILD/yast2-3.1.3/library/control/testsuite'
[ 125s] Making a new site.exp file ...
[ 125s] srcdir='.'; export srcdir; \
[ 125s] EXPECT=expect; export EXPECT; \
[ 125s] if /bin/sh -c "runtest --version" > /dev/null 2>&1; then \
[ 125s] exit_status=0; l='yast2'; for tool in $l; do \
[ 125s] if runtest --tool $tool --srcdir $srcdir ; \
[ 125s] then :; else exit_status=1; fi; \
[ 125s] done; \
[ 125s] else echo "WARNING: could not find 'runtest'" 1>&2; :;\
[ 125s] fi; \
[ 125s] exit $exit_status
[ 125s] WARNING: Couldn't find tool init file
[ 125s] Test Run By abuild on Mon Nov 11 13:23:56 2013
[ 125s] Native configuration is x86_64-suse-linux-gnu
[ 125s]
[ 125s] === yast2 tests ===
[ 125s]
[ 125s] Schedule of variations:
[ 125s] unix
[ 125s]
[ 125s] Running target unix
[ 125s] Using /usr/share/dejagnu/baseboards/unix.exp as board description file
for target.
[ 125s] Using /usr/share/dejagnu/config/unix.exp as generic interface file for
target.
[ 125s] Using ./config/unix.exp as tool-and-target-specific interface file.
[ 125s] Running ./yast2.test/testsuite.exp ...
[ 125s]
[ 125s] Checking started
[ 125s]
[ 125s] Running PrepareProposals ...
[ 126s] FAIL: Wrong stdout for PrepareProposals
[ 126s]
[ 126s] The diff follows...
[ 126s]
[ 126s] --- tests/PrepareProposals.out 2013-11-11 13:21:43.588000000 +0000
[ 126s] +++ tmp.out.PrepareProposals 2013-11-11 13:23:57.192000000 +0000
[ 126s] @@ -1 +1 @@
[ 126s] -Return [$["archs":"", "mode":"installation", "name":"initial",
"proposal_modules":["hwinfo", "keyboard", "mouse", "partitions", "software",
"bootloader", "timezone", "language", "runlevel"],
"proposal_tabs":[$["label":"Overview", "proposal_modules":["partitions",
"software_simple", "language_simple"]], $["label":"Expert",
"proposal_modules":["hwinfo", "keyboard", "mouse", "partitions", "software",
"bootloader", "timezone", "language", "runlevel"]]], "stage":"initial"],
$["archs":"", "mode":"demo", "name":"initial", "proposal_modules":["hwinfo",
"keyboard", "mouse", "partitions", "software", "bootloader", "timezone",
"language", "runlevel"], "proposal_tabs":[$["label":"Overview",
"proposal_modules":["partitions", "software_simple", "language_simple"]],
$["label":"Expert", "proposal_modules":["hwinfo", "keyboard", "mouse",
"partitions", "software", "bootloader", "timezone", "language", "runlevel"]]],
"stage":"initial"], $["archs":"", "mode":"autoinstallation", "name":"initial",
"proposal_modules":["hwinfo", "keyboard", "mouse", "partitions", "software",
"bootloader", "timezone", "language", "runlevel"],
"proposal_tabs":[$["label":"Overview", "proposal_modules":["partitions",
"software_simple", "language_simple"]], $["label":"Expert",
"proposal_modules":["hwinfo", "keyboard", "mouse", "partitions", "software",
"bootloader", "timezone", "language", "runlevel"]]], "stage":"initial"],
$["archs":"", "mode":"", "name":"network", "proposal_modules":[$["name":"lan",
"presentation_order":"20"], $["name":"dsl", "presentation_order":"30"],
$["name":"isdn", "presentation_order":"40"], $["name":"modem",
"presentation_order":"50"], $["name":"remote", "presentation_order":"60"],
$["name":"firewall", "presentation_order":"10"], $["name":"proxy",
"presentation_order":"70"]], "stage":"continue"], $["archs":"", "mode":"",
"name":"network", "proposal_modules":[$["name":"lan",
"presentation_order":"20"], $["name":"dsl", "presentation_order":"30"],
$["name":"isdn", "presentation_order":"40"], $["name":"modem",
"presentation_order":"50"], $["name":"remote", "presentation_order":"60"],
$["name":"firewall", "presentation_order":"10"], $["name":"proxy",
"presentation_order":"70"]], "stage":"normal"]]
[ 126s] +Return [$["archs":"", "mode":"installation", "name":"initial",
"proposal_modules":["hwinfo", "keyboard", "mouse", "partitions", "software",
"bootloader", "timezone", "language", "default_target"],
"proposal_tabs":[$["label":"Overview", "proposal_modules":["partitions",
"software_simple", "language_simple"]], $["label":"Expert",
"proposal_modules":["hwinfo", "keyboard", "mouse", "partitions", "software",
"bootloader", "timezone", "language", "default_target"]]], "stage":"initial"],
$["archs":"", "mode":"demo", "name":"initial", "proposal_modules":["hwinfo",
"keyboard", "mouse", "partitions", "software", "bootloader", "timezone",
"language", "default_target"], "proposal_tabs":[$["label":"Overview",
"proposal_modules":["partitions", "software_simple", "language_simple"]],
$["label":"Expert", "proposal_modules":["hwinfo", "keyboard", "mouse",
"partitions", "software", "bootloader", "timezone", "language",
"default_target"]]], "stage":"initial"], $["archs":"",
"mode":"autoinstallation", "name":"initial", "proposal_modules":["hwinfo",
"keyboard", "mouse", "partitions", "software", "bootloader", "timezone",
"language", "default_target"], "proposal_tabs":[$["label":"Overview",
"proposal_modules":["partitions", "software_simple", "language_simple"]],
$["label":"Expert", "proposal_modules":["hwinfo", "keyboard", "mouse",
"partitions", "software", "bootloader", "timezone", "language",
"default_target"]]], "stage":"initial"], $["archs":"", "mode":"",
"name":"network", "proposal_modules":[$["name":"lan",
"presentation_order":"20"], $["name":"dsl", "presentation_order":"30"],
$["name":"isdn", "presentation_order":"40"], $["name":"modem",
"presentation_order":"50"], $["name":"remote", "presentation_order":"60"],
$["name":"firewall", "presentation_order":"10"], $["name":"proxy",
"presentation_order":"70"]], "stage":"continue"], $["archs":"", "mode":"",
"name":"network", "proposal_modules":[$["name":"lan",
"presentation_order":"20"], $["name":"dsl", "presentation_order":"30"],
$["name":"isdn", "presentation_order":"40"], $["name":"modem",
"presentation_order":"50"], $["name":"remote", "presentation_order":"60"],
$["name":"firewall", "presentation_order":"10"], $["name":"proxy",
"presentation_order":"70"]], "stage":"normal"]]
[ 126s]
[ 126s] FAIL: Wrong stdout for PrepareProposals
[ 126s] See the diff above.
[ 126s] Running PrepareWorkflows ...
[ 126s] Running ProductProfile ...
[ 126s] Running WorkflowManager ...
[ 126s] FAIL: Wrong stdout for WorkflowManager
[ 126s]
[ 126s] The diff follows...
[ 126s]
[ 126s] --- tests/WorkflowManager.out 2013-11-11 13:21:43.588000000 +0000
[ 126s] +++ tmp.out.WorkflowManager 2013-11-11 13:23:57.896000000 +0000
[ 126s] @@ -19,4 +19,4 @@
[ 126s] Return true
[ 126s] Dump
[ 126s] Dump Current Settings
[ 126s] -Return $["clone_modules":[], "inst_finish":[],
"proposals":[$["archs":"", "mode":"installation", "name":"initial",
"proposal_modules":["hwinfo", "keyboard", "mouse", "partitions", "software",
"bootloader", "timezone", "language", "runlevel"],
"proposal_tabs":[$["label":"Overview", "proposal_modules":["partitions",
"software_simple", "language_simple"]], $["label":"Expert",
"proposal_modules":["hwinfo", "keyboard", "mouse", "partitions", "software",
"bootloader", "timezone", "language", "runlevel"]]], "stage":"initial"],
$["archs":"", "mode":"demo", "name":"initial", "proposal_modules":["hwinfo",
"keyboard", "mouse", "partitions", "software", "bootloader", "timezone",
"language", "runlevel"], "proposal_tabs":[$["label":"Overview",
"proposal_modules":["partitions", "software_simple", "language_simple"]],
$["label":"Expert", "proposal_modules":["hwinfo", "keyboard", "mouse",
"partitions", "software", "bootloader", "timezone", "language", "runlevel"]]],
"stage":"initial"], $["archs":"", "mode":"autoinstallation", "name":"initial",
"proposal_modules":["hwinfo", "keyboard", "mouse", "partitions", "software",
"bootloader", "timezone", "language", "runlevel"],
"proposal_tabs":[$["label":"Overview", "proposal_modules":["partitions",
"software_simple", "language_simple"]], $["label":"Expert",
"proposal_modules":["hwinfo", "keyboard", "mouse", "partitions", "software",
"bootloader", "timezone", "language", "runlevel"]]], "stage":"initial"],
$["archs":"", "mode":"", "name":"network", "proposal_modules":[$["name":"lan",
"presentation_order":"20"], $["name":"dsl", "presentation_order":"30"],
$["name":"isdn", "presentation_order":"40"], $["name":"modem",
"presentation_order":"50"], $["name":"remote", "presentation_order":"60"],
$["name":"firewall", "presentation_order":"10"], $["name":"proxy",
"presentation_order":"70"]], "stage":"continue"], $["archs":"", "mode":"",
"name":"network", "proposal_modules":[$["name":"lan",
"presentation_order":"20"], $["name":"dsl", "presentation_order":"30"],
$["name":"isdn", "presentation_order":"40"], $["name":"modem",
"presentation_order":"50"], $["name":"remote", "presentation_order":"60"],
$["name":"firewall", "presentation_order":"10"], $["name":"proxy",
"presentation_order":"70"]], "stage":"normal"]], "unmerged_changes":false,
"workflows":[$["defaults":$["archs":"i386"], "label":"Preparation",
"mode":"installation", "modules":[$["arguments":$["first_run":"yes"],
"enable_back":"no", "enable_next":"yes", "label":"Language", "name":"language",
"retranslate":true], $["label":"Perform Installation", "name":"finish"]],
"stage":"initial"], $["defaults":$["archs":"x86_64"], "label":"Preparation",
"mode":"installation", "modules":[$["arguments":$["first_run":"yes"],
"enable_back":"no", "enable_next":"yes", "label":"Language", "name":"language",
"retranslate":true], $["label":"Perform Installation", "name":"finish"]],
"stage":"initial"], $["defaults":$["archs":"i386"], "label":"Preparation",
"mode":"update", "modules":[$["arguments":$["first_run":"yes"],
"enable_back":"no", "enable_next":"yes", "label":"Language", "name":"language",
"retranslate":true], $["label":"Perform Installation", "name":"finish"]],
"stage":"initial"], $["defaults":$["archs":"x86_64"], "label":"Preparation",
"mode":"update", "modules":[$["arguments":$["first_run":"yes"],
"enable_back":"no", "enable_next":"yes", "label":"Language", "name":"language",
"retranslate":true], $["label":"Perform Installation", "name":"finish"]],
"stage":"initial"]]]
[ 126s] +Return $["clone_modules":[], "inst_finish":[],
"proposals":[$["archs":"", "mode":"installation", "name":"initial",
"proposal_modules":["hwinfo", "keyboard", "mouse", "partitions", "software",
"bootloader", "timezone", "language", "default_target"],
"proposal_tabs":[$["label":"Overview", "proposal_modules":["partitions",
"software_simple", "language_simple"]], $["label":"Expert",
"proposal_modules":["hwinfo", "keyboard", "mouse", "partitions", "software",
"bootloader", "timezone", "language", "default_target"]]], "stage":"initial"],
$["archs":"", "mode":"demo", "name":"initial", "proposal_modules":["hwinfo",
"keyboard", "mouse", "partitions", "software", "bootloader", "timezone",
"language", "default_target"], "proposal_tabs":[$["label":"Overview",
"proposal_modules":["partitions", "software_simple", "language_simple"]],
$["label":"Expert", "proposal_modules":["hwinfo", "keyboard", "mouse",
"partitions", "software", "bootloader", "timezone", "language",
"default_target"]]], "stage":"initial"], $["archs":"",
"mode":"autoinstallation", "name":"initial", "proposal_modules":["hwinfo",
"keyboard", "mouse", "partitions", "software", "bootloader", "timezone",
"language", "default_target"], "proposal_tabs":[$["label":"Overview",
"proposal_modules":["partitions", "software_simple", "language_simple"]],
$["label":"Expert", "proposal_modules":["hwinfo", "keyboard", "mouse",
"partitions", "software", "bootloader", "timezone", "language",
"default_target"]]], "stage":"initial"], $["archs":"", "mode":"",
"name":"network", "proposal_modules":[$["name":"lan",
"presentation_order":"20"], $["name":"dsl", "presentation_order":"30"],
$["name":"isdn", "presentation_order":"40"], $["name":"modem",
"presentation_order":"50"], $["name":"remote", "presentation_order":"60"],
$["name":"firewall", "presentation_order":"10"], $["name":"proxy",
"presentation_order":"70"]], "stage":"continue"], $["archs":"", "mode":"",
"name":"network", "proposal_modules":[$["name":"lan",
"presentation_order":"20"], $["name":"dsl", "presentation_order":"30"],
$["name":"isdn", "presentation_order":"40"], $["name":"modem",
"presentation_order":"50"], $["name":"remote", "presentation_order":"60"],
$["name":"firewall", "presentation_order":"10"], $["name":"proxy",
"presentation_order":"70"]], "stage":"normal"]], "unmerged_changes":false,
"workflows":[$["defaults":$["archs":"i386"], "label":"Preparation",
"mode":"installation", "modules":[$["arguments":$["first_run":"yes"],
"enable_back":"no", "enable_next":"yes", "label":"Language", "name":"language",
"retranslate":true], $["label":"Perform Installation", "name":"finish"]],
"stage":"initial"], $["defaults":$["archs":"x86_64"], "label":"Preparation",
"mode":"installation", "modules":[$["arguments":$["first_run":"yes"],
"enable_back":"no", "enable_next":"yes", "label":"Language", "name":"language",
"retranslate":true], $["label":"Perform Installation", "name":"finish"]],
"stage":"initial"], $["defaults":$["archs":"i386"], "label":"Preparation",
"mode":"update", "modules":[$["arguments":$["first_run":"yes"],
"enable_back":"no", "enable_next":"yes", "label":"Language", "name":"language",
"retranslate":true], $["label":"Perform Installation", "name":"finish"]],
"stage":"initial"], $["defaults":$["archs":"x86_64"], "label":"Preparation",
"mode":"update", "modules":[$["arguments":$["first_run":"yes"],
"enable_back":"no", "enable_next":"yes", "label":"Language", "name":"language",
"retranslate":true], $["label":"Perform Installation", "name":"finish"]],
"stage":"initial"]]]
[ 126s]
[ 126s] FAIL: Wrong stdout for WorkflowManager
[ 126s] See the diff above.
[ 126s] Running restore ...
[ 127s]
[ 127s] Checking finished
[ 127s]
[ 127s]
[ 127s] === yast2 Summary ===
[ 127s]
[ 127s] # of expected passes 3
[ 127s] # of unexpected failures 4
[ 127s] make[4]: *** [check-DEJAGNU] Error 1
[ 127s] make[4]: Leaving directory
`/home/abuild/rpmbuild/BUILD/yast2-3.1.3/library/control/testsuite'
[ 127s] make[3]: *** [check-am] Error 2
[ 127s] make[3]: Leaving directory
`/home/abuild/rpmbuild/BUILD/yast2-3.1.3/library/control/testsuite'
[ 127s] make[2]: *** [check-recursive] Error 1
[ 127s] make[2]: Leaving directory
`/home/abuild/rpmbuild/BUILD/yast2-3.1.3/library/control'
[ 127s] make[1]: *** [check-recursive] Error 1
[ 127s] make[1]: Leaving directory
`/home/abuild/rpmbuild/BUILD/yast2-3.1.3/library'
[ 127s] make: *** [check-recursive] Error 1
[ 127s] error: Bad exit status from /var/tmp/rpm-tmp.TlytU2 (%install)
[ 127s]
[ 127s]
[ 127s] RPM build errors:
[ 127s] Bad exit status from /var/tmp/rpm-tmp.TlytU2 (%install)
Run source service: /usr/lib/obs/service/format_spec_file --outdir
/tmp/tmpZ84wHy
Run source service: /usr/lib/obs/service/source_validator --outdir
/tmp/tmpX5PuhF
Building yast2.spec for openSUSE_Factory/x86_64
Getting buildinfo from server and store to
<http://ci.opensuse.org/job/yast-yast2-master/ws/YaST>:Head/yast2/.osc/_buildinfo-openSUSE_Factory-x86_64.xml
Getting buildconfig from server and store to
<http://ci.opensuse.org/job/yast-yast2-master/ws/YaST>:Head/yast2/.osc/_buildconfig-openSUSE_Factory-x86_64
Updating cache of required packages
0.0% cache miss. 159/159 dependencies cached.

Skipping verification of package signatures
Writing build configuration
Running build

The buildroot was: /var/tmp/build-root-openSUSE_Factory
rm -rf YaST:Head
rake aborted!
Command failed with status (1): [osc build --no-verify --release=1 --root=/...]

Tasks: TOP => osc:sr => osc:commit => osc:build
(See full trace by running task with --trace)
cleaning
Build step 'Execute shell' marked build as failure
--
To unsubscribe, e-mail: yast-commit+unsubscribe@xxxxxxxxxxxx
For additional commands, e-mail: yast-commit+help@xxxxxxxxxxxx

< Previous Next >
This Thread
Follow Ups