Mailinglist Archive: yast-commit (306 mails)

< Previous Next >
[yast-commit] Build failed in Jenkins: yast-sysconfig-HEAD #158
  • From: hudson@xxxxxxx
  • Date: Fri, 30 Aug 2013 15:21:52 +0200 (CEST)
  • Message-id: <1204086937.806.1377868912281.JavaMail.jenkins@river>
See <http://river.suse.de/job/yast-sysconfig-HEAD/158/>

------------------------------------------
[...truncated 134 lines...]
checking for a BSD-compatible install... /usr/bin/install -c
checking whether build environment is sane... yes
checking for a thread-safe mkdir -p... /usr/bin/mkdir -p
checking for gawk... gawk
checking whether make sets $(MAKE)... yes
checking how to create a ustar tar archive... gnutar
checking whether ln -s works... yes
checking whether make sets $(MAKE)... (cached) yes
checking for xgettext... /usr/bin/xgettext
checking for ycpdoc... /usr/lib/YaST2/bin/ycpdoc
checking for ycpmakedep... /usr/lib/YaST2/bin/ycpmakedep
checking for ycpc... /usr/bin/ycpc
checking for /usr/share/YaST2/data/testsuite/Makefile.testsuite... yes
checking for YCP modules... not found
checking that generated files are newer than configure... done
configure: creating ./config.status
config.status: creating Makefile
config.status: creating doc/autodocs/Makefile
config.status: creating doc/Makefile
config.status: creating src/Makefile
config.status: creating test/Makefile
config.status: creating testsuite/Makefile
+ make
Making all in doc
make[1]: Entering directory
`<http://river.suse.de/job/yast-sysconfig-HEAD/ws/checkout/doc'>
Making all in autodocs
make[2]: Entering directory
`<http://river.suse.de/job/yast-sysconfig-HEAD/ws/checkout/doc/autodocs'>
make[2]: Nothing to be done for `all'.
make[2]: Leaving directory
`<http://river.suse.de/job/yast-sysconfig-HEAD/ws/checkout/doc/autodocs'>
make[2]: Entering directory
`<http://river.suse.de/job/yast-sysconfig-HEAD/ws/checkout/doc'>
make[2]: Nothing to be done for `all-am'.
make[2]: Leaving directory
`<http://river.suse.de/job/yast-sysconfig-HEAD/ws/checkout/doc'>
make[1]: Leaving directory
`<http://river.suse.de/job/yast-sysconfig-HEAD/ws/checkout/doc'>
Making all in src
make[1]: Entering directory
`<http://river.suse.de/job/yast-sysconfig-HEAD/ws/checkout/src'>
make[1]: Nothing to be done for `all'.
make[1]: Leaving directory
`<http://river.suse.de/job/yast-sysconfig-HEAD/ws/checkout/src'>
Making all in test
make[1]: Entering directory
`<http://river.suse.de/job/yast-sysconfig-HEAD/ws/checkout/test'>
make[1]: Nothing to be done for `all'.
make[1]: Leaving directory
`<http://river.suse.de/job/yast-sysconfig-HEAD/ws/checkout/test'>
Making all in testsuite
make[1]: Entering directory
`<http://river.suse.de/job/yast-sysconfig-HEAD/ws/checkout/testsuite'>
make -f /usr/share/YaST2/data/testsuite/Makefile.testsuite
RPMNAME=yast2-sysconfig srcdir=.
make[2]: Entering directory
`<http://river.suse.de/job/yast-sysconfig-HEAD/ws/checkout/testsuite'>
make[2]: Nothing to be done for `all'.
make[2]: Leaving directory
`<http://river.suse.de/job/yast-sysconfig-HEAD/ws/checkout/testsuite'>
make[1]: Leaving directory
`<http://river.suse.de/job/yast-sysconfig-HEAD/ws/checkout/testsuite'>
make[1]: Entering directory
`<http://river.suse.de/job/yast-sysconfig-HEAD/ws/checkout'>
make[1]: Nothing to be done for `all-am'.
make[1]: Leaving directory
`<http://river.suse.de/job/yast-sysconfig-HEAD/ws/checkout'>
+ make install
Making install in doc
make[1]: Entering directory
`<http://river.suse.de/job/yast-sysconfig-HEAD/ws/checkout/doc'>
Making install in autodocs
make[2]: Entering directory
`<http://river.suse.de/job/yast-sysconfig-HEAD/ws/checkout/doc/autodocs'>
make[3]: Entering directory
`<http://river.suse.de/job/yast-sysconfig-HEAD/ws/checkout/doc/autodocs'>
make[3]: Nothing to be done for `install-exec-am'.
/usr/bin/mkdir -p '/usr/share/doc/packages/yast2-sysconfig//autodocs'
/usr/bin/mkdir -p '/usr/share/doc/packages/yast2-sysconfig//autodocs/js'
/usr/bin/install -c -p -m 644 js/full_list.js js/jquery.js js/app.js
'/usr/share/doc/packages/yast2-sysconfig//autodocs/js'
/usr/bin/install -c -p -m 644 index.html file_list.html class_list.html
Yast.html _index.html method_list.html top-level-namespace.html frames.html
'/usr/share/doc/packages/yast2-sysconfig//autodocs/.'
/usr/bin/mkdir -p '/usr/share/doc/packages/yast2-sysconfig//autodocs/Yast'
/usr/bin/install -c -p -m 644 Yast/SysconfigComplexInclude.html
Yast/SysconfigDialogsInclude.html Yast/SysconfigHelpsInclude.html
Yast/SysconfigRoutinesInclude.html Yast/SysconfigClass.html
Yast/SysconfigCmdlineInclude.html Yast/SysconfigWizardsInclude.html
'/usr/share/doc/packages/yast2-sysconfig//autodocs/Yast'
/usr/bin/mkdir -p '/usr/share/doc/packages/yast2-sysconfig//autodocs/css'
/usr/bin/install -c -p -m 644 css/full_list.css css/style.css css/common.css
'/usr/share/doc/packages/yast2-sysconfig//autodocs/css'
make[3]: Leaving directory
`<http://river.suse.de/job/yast-sysconfig-HEAD/ws/checkout/doc/autodocs'>
make[2]: Leaving directory
`<http://river.suse.de/job/yast-sysconfig-HEAD/ws/checkout/doc/autodocs'>
make[2]: Entering directory
`<http://river.suse.de/job/yast-sysconfig-HEAD/ws/checkout/doc'>
make[3]: Entering directory
`<http://river.suse.de/job/yast-sysconfig-HEAD/ws/checkout/doc'>
make[3]: Nothing to be done for `install-exec-am'.
/usr/bin/mkdir -p '/usr/share/doc/packages/yast2-sysconfig'
/usr/bin/install -c -p -m 644 metadata.txt
'/usr/share/doc/packages/yast2-sysconfig'
make[3]: Leaving directory
`<http://river.suse.de/job/yast-sysconfig-HEAD/ws/checkout/doc'>
make[2]: Leaving directory
`<http://river.suse.de/job/yast-sysconfig-HEAD/ws/checkout/doc'>
make[1]: Leaving directory
`<http://river.suse.de/job/yast-sysconfig-HEAD/ws/checkout/doc'>
Making install in src
make[1]: Entering directory
`<http://river.suse.de/job/yast-sysconfig-HEAD/ws/checkout/src'>
make[2]: Entering directory
`<http://river.suse.de/job/yast-sysconfig-HEAD/ws/checkout/src'>
make[2]: Nothing to be done for `install-exec-am'.
/usr/bin/mkdir -p '/usr/share/YaST2/clients'
/usr/bin/install -c -p -m 644 clients/sysconfig_auto.rb clients/sysconfig.rb
'/usr/share/YaST2/clients'
/usr/bin/mkdir -p '/usr/share/applications/YaST2'
/usr/bin/install -c -p -m 644 desktop/sysconfig.desktop
'/usr/share/applications/YaST2'
/usr/bin/mkdir -p '/usr/share/YaST2/modules'
/usr/bin/install -c -p -m 644 modules/Sysconfig.rb '/usr/share/YaST2/modules'
/usr/bin/mkdir -p '/usr/share/YaST2/modules'
/usr/bin/install -c -p -m 644 modules/Sysconfig.rb '/usr/share/YaST2/modules'
/usr/bin/mkdir -p '/usr/share/YaST2/schema/autoyast/rnc'
/usr/bin/install -c -p -m 644 autoyast-rnc/sysconfig.rnc
'/usr/share/YaST2/schema/autoyast/rnc'
/usr/bin/mkdir -p '/usr/lib/YaST2/bin'
/usr/bin/install -c -p bin/parse_configs.pl '/usr/lib/YaST2/bin'
/usr/bin/mkdir -p '/usr/share/YaST2/data'
/usr/bin/install -c -p -m 644 data/descriptions data/sysedit.agent
'/usr/share/YaST2/data'
/usr/bin/mkdir -p '/usr/share/YaST2/include/sysconfig'
/usr/bin/install -c -p -m 644 include/sysconfig/wizards.rb
include/sysconfig/dialogs.rb include/sysconfig/complex.rb
include/sysconfig/routines.rb include/sysconfig/cmdline.rb
include/sysconfig/helps.rb '/usr/share/YaST2/include/sysconfig'
make[2]: Leaving directory
`<http://river.suse.de/job/yast-sysconfig-HEAD/ws/checkout/src'>
make[1]: Leaving directory
`<http://river.suse.de/job/yast-sysconfig-HEAD/ws/checkout/src'>
Making install in test
make[1]: Entering directory
`<http://river.suse.de/job/yast-sysconfig-HEAD/ws/checkout/test'>
make[2]: Entering directory
`<http://river.suse.de/job/yast-sysconfig-HEAD/ws/checkout/test'>
make[2]: Nothing to be done for `install-exec-am'.
make[2]: Nothing to be done for `install-data-am'.
make[2]: Leaving directory
`<http://river.suse.de/job/yast-sysconfig-HEAD/ws/checkout/test'>
make[1]: Leaving directory
`<http://river.suse.de/job/yast-sysconfig-HEAD/ws/checkout/test'>
Making install in testsuite
make[1]: Entering directory
`<http://river.suse.de/job/yast-sysconfig-HEAD/ws/checkout/testsuite'>
make -f /usr/share/YaST2/data/testsuite/Makefile.testsuite
RPMNAME=yast2-sysconfig srcdir=.
make[2]: Entering directory
`<http://river.suse.de/job/yast-sysconfig-HEAD/ws/checkout/testsuite'>
make[2]: Nothing to be done for `all'.
make[2]: Leaving directory
`<http://river.suse.de/job/yast-sysconfig-HEAD/ws/checkout/testsuite'>
make[2]: Entering directory
`<http://river.suse.de/job/yast-sysconfig-HEAD/ws/checkout/testsuite'>
make[2]: Nothing to be done for `install-exec-am'.
make[2]: Nothing to be done for `install-data-am'.
make[2]: Leaving directory
`<http://river.suse.de/job/yast-sysconfig-HEAD/ws/checkout/testsuite'>
make[1]: Leaving directory
`<http://river.suse.de/job/yast-sysconfig-HEAD/ws/checkout/testsuite'>
make[1]: Entering directory
`<http://river.suse.de/job/yast-sysconfig-HEAD/ws/checkout'>
make[2]: Entering directory
`<http://river.suse.de/job/yast-sysconfig-HEAD/ws/checkout'>
make[2]: Nothing to be done for `install-exec-am'.
mkdir -p /usr/share/doc/packages/yast2-sysconfig
/usr/bin/install -c -p -m 644
/usr/share/YaST2/data/devtools/admin/copyright/gpl/README
/usr/share/doc/packages/yast2-sysconfig
/usr/bin/install -c -p -m 644
/usr/share/YaST2/data/devtools/admin/copyright/gpl/COPYING
/usr/share/doc/packages/yast2-sysconfig
make[2]: Leaving directory
`<http://river.suse.de/job/yast-sysconfig-HEAD/ws/checkout'>
make[1]: Leaving directory
`<http://river.suse.de/job/yast-sysconfig-HEAD/ws/checkout'>
+ make check
Making check in doc
make[1]: Entering directory
`<http://river.suse.de/job/yast-sysconfig-HEAD/ws/checkout/doc'>
Making check in autodocs
make[2]: Entering directory
`<http://river.suse.de/job/yast-sysconfig-HEAD/ws/checkout/doc/autodocs'>
make[2]: Nothing to be done for `check'.
make[2]: Leaving directory
`<http://river.suse.de/job/yast-sysconfig-HEAD/ws/checkout/doc/autodocs'>
make[2]: Entering directory
`<http://river.suse.de/job/yast-sysconfig-HEAD/ws/checkout/doc'>
make[2]: Nothing to be done for `check-am'.
make[2]: Leaving directory
`<http://river.suse.de/job/yast-sysconfig-HEAD/ws/checkout/doc'>
make[1]: Leaving directory
`<http://river.suse.de/job/yast-sysconfig-HEAD/ws/checkout/doc'>
Making check in src
make[1]: Entering directory
`<http://river.suse.de/job/yast-sysconfig-HEAD/ws/checkout/src'>
make[1]: Nothing to be done for `check'.
make[1]: Leaving directory
`<http://river.suse.de/job/yast-sysconfig-HEAD/ws/checkout/src'>
Making check in test
make[1]: Entering directory
`<http://river.suse.de/job/yast-sysconfig-HEAD/ws/checkout/test'>
make check-TESTS
make[2]: Entering directory
`<http://river.suse.de/job/yast-sysconfig-HEAD/ws/checkout/test'>
<internal:prelude>:18: warning: already initialized constant
MUTEX_FOR_THREAD_EXCLUSIVE
Run options: --seed 35037

# Running tests:



Finished tests in 0.000291s, 0.0000 tests/s, 0.0000 assertions/s.

0 tests, 0 assertions, 0 failures, 0 errors, 0 skips
PASS: test_helper.rb
<internal:prelude>:18: warning: already initialized constant
MUTEX_FOR_THREAD_EXCLUSIVE
Run options: --seed 35750

# Running tests:

..

Finished tests in 0.521512s, 3.8350 tests/s, 19.1750 assertions/s.

2 tests, 10 assertions, 0 failures, 0 errors, 0 skips
PASS: read_test.rb
<internal:prelude>:18: warning: already initialized constant
MUTEX_FOR_THREAD_EXCLUSIVE
Run options: --seed 11758

# Running tests:

EEEE

Finished tests in 0.880892s, 4.5409 tests/s, 13.6226 assertions/s.

1) Error:
test_0001_should_save_the_changed_postfix_variable_value(Change variables in
config files):
NoMethodError: undefined method `stub' for
#<Yast::SysconfigClass:0x000000029dc158>
./write_test.rb:22:in `block (3 levels) in <main>'

<http://river.suse.de/job/yast-sysconfig-HEAD/ws/checkout/test/test_helper.rb>:60:in
`load_sample'
./write_test.rb:13:in `block (2 levels) in <main>'

2) Error:
test_0003_should_ignore_the_unknown_variable_name(Change variables in config
files):
NoMethodError: undefined method `stub' for
#<Yast::SysconfigClass:0x00000002266158>
./write_test.rb:55:in `block (3 levels) in <main>'

<http://river.suse.de/job/yast-sysconfig-HEAD/ws/checkout/test/test_helper.rb>:60:in
`load_sample'
./write_test.rb:47:in `block (2 levels) in <main>'

3) Error:
test_0004_should_successfully_change_network_client_hostname_settings(Change
variables in config files):
NoMethodError: undefined method `stub' for
#<Yast::SysconfigClass:0x000000022a0bc8>
./write_test.rb:72:in `block (3 levels) in <main>'

<http://river.suse.de/job/yast-sysconfig-HEAD/ws/checkout/test/test_helper.rb>:60:in
`load_sample'
./write_test.rb:63:in `block (2 levels) in <main>'

4) Error:
test_0002_should_not_change_configuration_due_to_incorrect_variable_value(Change
variables in config files):
NoMethodError: undefined method `stub' for
#<Yast::SysconfigClass:0x000000023491b0>
./write_test.rb:39:in `block (3 levels) in <main>'

<http://river.suse.de/job/yast-sysconfig-HEAD/ws/checkout/test/test_helper.rb>:60:in
`load_sample'
./write_test.rb:32:in `block (2 levels) in <main>'

4 tests, 12 assertions, 0 failures, 4 errors, 0 skips
FAIL: write_test.rb
<internal:prelude>:18: warning: already initialized constant
MUTEX_FOR_THREAD_EXCLUSIVE
Run options: --seed 23644

# Running tests:

......

Finished tests in 0.049637s, 120.8784 tests/s, 826.0023 assertions/s.

6 tests, 41 assertions, 0 failures, 0 errors, 0 skips
PASS: autoyast_test.rb
==========================================
1 of 4 tests failed
Please report to http://bugs.opensuse.org/
==========================================
make[2]: *** [check-TESTS] Error 1
make[2]: Leaving directory
`<http://river.suse.de/job/yast-sysconfig-HEAD/ws/checkout/test'>
make[1]: *** [check-am] Error 2
make[1]: Leaving directory
`<http://river.suse.de/job/yast-sysconfig-HEAD/ws/checkout/test'>
make: *** [check-recursive] Error 1
++ error_exit 2
++ echo 'ERROR: detected exitcode 2'
ERROR: detected exitcode 2
++ cleanup
++ echo '==> Running cleanup'
==> Running cleanup
++ rm -f
<http://river.suse.de/job/yast-sysconfig-HEAD/ws/ICECC/40c0ab7e54f59a1e4e493c1ea90a882a.tar.gz>
++ footer_and_exit 1
++ '[' -z 1 ']'
++ MYEXIT=1
++ '[' 1 == 0 ']'
++ ascii_failed
++ cat

( )
( ) (
) _ )
( \_
_(_\ \)__
(____\___))

build failed

++ exit 1
Build step 'Execute shell' marked build as failure
--
To unsubscribe, e-mail: yast-commit+unsubscribe@xxxxxxxxxxxx
For additional commands, e-mail: yast-commit+help@xxxxxxxxxxxx

< Previous Next >
References