Mailinglist Archive: yast-commit (306 mails)

< Previous Next >
[yast-commit] Build failed in Jenkins: yast-sysconfig-HEAD #153
  • From: hudson@xxxxxxx
  • Date: Tue, 27 Aug 2013 16:32:02 +0200 (CEST)
  • Message-id: <745811162.758.1377613922601.JavaMail.jenkins@river>
See <http://river.suse.de/job/yast-sysconfig-HEAD/153/changes>

Changes:

[Vladimir Moravec] Chmod +x test/* , otherwise jenkins fails

------------------------------------------
[...truncated 106 lines...]
++ [[ 1 == 1 ]]
++ echo 'Using autotools for building'
Using autotools for building
++ export BUILDDIR=<http://river.suse.de/job/yast-sysconfig-HEAD/ws/checkout>
++ BUILDDIR=<http://river.suse.de/job/yast-sysconfig-HEAD/ws/checkout>
++ export
PACKAGEDIR=<http://river.suse.de/job/yast-sysconfig-HEAD/ws/checkout/package>
++ PACKAGEDIR=<http://river.suse.de/job/yast-sysconfig-HEAD/ws/checkout/package>
++ mkdir -p <http://river.suse.de/job/yast-sysconfig-HEAD/ws/rpm>
++ mkdir -p <http://river.suse.de/job/yast-sysconfig-HEAD/ws/rpm/rpms>
++ mkdir -p <http://river.suse.de/job/yast-sysconfig-HEAD/ws/rpm/rpmbuild>
++ mkdir -p <http://river.suse.de/job/yast-sysconfig-HEAD/ws/rpm/rpmbuildroot>
++ mkdir -p <http://river.suse.de/job/yast-sysconfig-HEAD/ws/.artifacts>
++ mkdir -p <http://river.suse.de/job/yast-sysconfig-HEAD/ws/OBS>
++ cat
+ PACKAGENAME=yast-sysconfig
+ PACKAGENAME=yast2-sysconfig
+ cd <http://river.suse.de/job/yast-sysconfig-HEAD/ws/checkout>
+ make -f Makefile.cvs
y2tool y2autoconf
y2autoconf: Generating toplevel configure.ac
y2tool y2automake
y2automake: Copying automakefiles for inclusion
y2automake: Generating toplevel Makefile.am
autoreconf --force --install
./configure --prefix=/usr --libdir=/usr/lib64
checking build system type... x86_64-suse-linux-gnu
checking host system type... x86_64-suse-linux-gnu
checking target system type... x86_64-suse-linux-gnu
checking for a BSD-compatible install... /usr/bin/install -c
checking whether build environment is sane... yes
checking for a thread-safe mkdir -p... /usr/bin/mkdir -p
checking for gawk... gawk
checking whether make sets $(MAKE)... yes
checking how to create a ustar tar archive... gnutar
checking whether ln -s works... yes
checking whether make sets $(MAKE)... (cached) yes
checking for xgettext... /usr/bin/xgettext
checking for ycpdoc... /usr/lib/YaST2/bin/ycpdoc
checking for ycpmakedep... /usr/lib/YaST2/bin/ycpmakedep
checking for ycpc... /usr/bin/ycpc
checking for /usr/share/YaST2/data/testsuite/Makefile.testsuite... yes
checking for YCP modules... not found
checking that generated files are newer than configure... done
configure: creating ./config.status
config.status: creating Makefile
config.status: creating doc/autodocs/Makefile
config.status: creating doc/Makefile
config.status: creating src/Makefile
config.status: creating test/Makefile
config.status: creating testsuite/Makefile
+ make
Making all in doc
make[1]: Entering directory
`<http://river.suse.de/job/yast-sysconfig-HEAD/ws/checkout/doc'>
Making all in autodocs
make[2]: Entering directory
`<http://river.suse.de/job/yast-sysconfig-HEAD/ws/checkout/doc/autodocs'>
make[2]: Nothing to be done for `all'.
make[2]: Leaving directory
`<http://river.suse.de/job/yast-sysconfig-HEAD/ws/checkout/doc/autodocs'>
make[2]: Entering directory
`<http://river.suse.de/job/yast-sysconfig-HEAD/ws/checkout/doc'>
make[2]: Nothing to be done for `all-am'.
make[2]: Leaving directory
`<http://river.suse.de/job/yast-sysconfig-HEAD/ws/checkout/doc'>
make[1]: Leaving directory
`<http://river.suse.de/job/yast-sysconfig-HEAD/ws/checkout/doc'>
Making all in src
make[1]: Entering directory
`<http://river.suse.de/job/yast-sysconfig-HEAD/ws/checkout/src'>
make[1]: Nothing to be done for `all'.
make[1]: Leaving directory
`<http://river.suse.de/job/yast-sysconfig-HEAD/ws/checkout/src'>
Making all in test
make[1]: Entering directory
`<http://river.suse.de/job/yast-sysconfig-HEAD/ws/checkout/test'>
make[1]: Nothing to be done for `all'.
make[1]: Leaving directory
`<http://river.suse.de/job/yast-sysconfig-HEAD/ws/checkout/test'>
Making all in testsuite
make[1]: Entering directory
`<http://river.suse.de/job/yast-sysconfig-HEAD/ws/checkout/testsuite'>
make -f /usr/share/YaST2/data/testsuite/Makefile.testsuite
RPMNAME=yast2-sysconfig srcdir=.
make[2]: Entering directory
`<http://river.suse.de/job/yast-sysconfig-HEAD/ws/checkout/testsuite'>
make[2]: Nothing to be done for `all'.
make[2]: Leaving directory
`<http://river.suse.de/job/yast-sysconfig-HEAD/ws/checkout/testsuite'>
make[1]: Leaving directory
`<http://river.suse.de/job/yast-sysconfig-HEAD/ws/checkout/testsuite'>
make[1]: Entering directory
`<http://river.suse.de/job/yast-sysconfig-HEAD/ws/checkout'>
make[1]: Nothing to be done for `all-am'.
make[1]: Leaving directory
`<http://river.suse.de/job/yast-sysconfig-HEAD/ws/checkout'>
+ make install
Making install in doc
make[1]: Entering directory
`<http://river.suse.de/job/yast-sysconfig-HEAD/ws/checkout/doc'>
Making install in autodocs
make[2]: Entering directory
`<http://river.suse.de/job/yast-sysconfig-HEAD/ws/checkout/doc/autodocs'>
make[3]: Entering directory
`<http://river.suse.de/job/yast-sysconfig-HEAD/ws/checkout/doc/autodocs'>
make[3]: Nothing to be done for `install-exec-am'.
/usr/bin/mkdir -p '/usr/share/doc/packages/yast2-sysconfig//autodocs'
/usr/bin/mkdir -p '/usr/share/doc/packages/yast2-sysconfig//autodocs/js'
/usr/bin/install -c -p -m 644 js/full_list.js js/jquery.js js/app.js
'/usr/share/doc/packages/yast2-sysconfig//autodocs/js'
/usr/bin/install -c -p -m 644 index.html file_list.html class_list.html
Yast.html _index.html method_list.html top-level-namespace.html frames.html
'/usr/share/doc/packages/yast2-sysconfig//autodocs/.'
/usr/bin/mkdir -p '/usr/share/doc/packages/yast2-sysconfig//autodocs/Yast'
/usr/bin/install -c -p -m 644 Yast/SysconfigComplexInclude.html
Yast/SysconfigDialogsInclude.html Yast/SysconfigHelpsInclude.html
Yast/SysconfigRoutinesInclude.html Yast/SysconfigClass.html
Yast/SysconfigCmdlineInclude.html Yast/SysconfigWizardsInclude.html
'/usr/share/doc/packages/yast2-sysconfig//autodocs/Yast'
/usr/bin/mkdir -p '/usr/share/doc/packages/yast2-sysconfig//autodocs/css'
/usr/bin/install -c -p -m 644 css/full_list.css css/style.css css/common.css
'/usr/share/doc/packages/yast2-sysconfig//autodocs/css'
make[3]: Leaving directory
`<http://river.suse.de/job/yast-sysconfig-HEAD/ws/checkout/doc/autodocs'>
make[2]: Leaving directory
`<http://river.suse.de/job/yast-sysconfig-HEAD/ws/checkout/doc/autodocs'>
make[2]: Entering directory
`<http://river.suse.de/job/yast-sysconfig-HEAD/ws/checkout/doc'>
make[3]: Entering directory
`<http://river.suse.de/job/yast-sysconfig-HEAD/ws/checkout/doc'>
make[3]: Nothing to be done for `install-exec-am'.
/usr/bin/mkdir -p '/usr/share/doc/packages/yast2-sysconfig'
/usr/bin/install -c -p -m 644 metadata.txt
'/usr/share/doc/packages/yast2-sysconfig'
make[3]: Leaving directory
`<http://river.suse.de/job/yast-sysconfig-HEAD/ws/checkout/doc'>
make[2]: Leaving directory
`<http://river.suse.de/job/yast-sysconfig-HEAD/ws/checkout/doc'>
make[1]: Leaving directory
`<http://river.suse.de/job/yast-sysconfig-HEAD/ws/checkout/doc'>
Making install in src
make[1]: Entering directory
`<http://river.suse.de/job/yast-sysconfig-HEAD/ws/checkout/src'>
make[2]: Entering directory
`<http://river.suse.de/job/yast-sysconfig-HEAD/ws/checkout/src'>
make[2]: Nothing to be done for `install-exec-am'.
/usr/bin/mkdir -p '/usr/share/YaST2/clients'
/usr/bin/install -c -p -m 644 clients/sysconfig_auto.rb clients/sysconfig.rb
'/usr/share/YaST2/clients'
/usr/bin/mkdir -p '/usr/share/applications/YaST2'
/usr/bin/install -c -p -m 644 desktop/sysconfig.desktop
'/usr/share/applications/YaST2'
/usr/bin/mkdir -p '/usr/share/YaST2/modules'
/usr/bin/install -c -p -m 644 modules/Sysconfig.rb '/usr/share/YaST2/modules'
/usr/bin/mkdir -p '/usr/share/YaST2/modules'
/usr/bin/install -c -p -m 644 modules/Sysconfig.rb '/usr/share/YaST2/modules'
/usr/bin/mkdir -p '/usr/share/YaST2/schema/autoyast/rnc'
/usr/bin/install -c -p -m 644 autoyast-rnc/sysconfig.rnc
'/usr/share/YaST2/schema/autoyast/rnc'
/usr/bin/mkdir -p '/usr/lib/YaST2/bin'
/usr/bin/install -c -p bin/parse_configs.pl '/usr/lib/YaST2/bin'
/usr/bin/mkdir -p '/usr/share/YaST2/data'
/usr/bin/install -c -p -m 644 data/descriptions data/sysedit.agent
'/usr/share/YaST2/data'
/usr/bin/mkdir -p '/usr/share/YaST2/include/sysconfig'
/usr/bin/install -c -p -m 644 include/sysconfig/wizards.rb
include/sysconfig/dialogs.rb include/sysconfig/complex.rb
include/sysconfig/routines.rb include/sysconfig/cmdline.rb
include/sysconfig/helps.rb '/usr/share/YaST2/include/sysconfig'
make[2]: Leaving directory
`<http://river.suse.de/job/yast-sysconfig-HEAD/ws/checkout/src'>
make[1]: Leaving directory
`<http://river.suse.de/job/yast-sysconfig-HEAD/ws/checkout/src'>
Making install in test
make[1]: Entering directory
`<http://river.suse.de/job/yast-sysconfig-HEAD/ws/checkout/test'>
make[2]: Entering directory
`<http://river.suse.de/job/yast-sysconfig-HEAD/ws/checkout/test'>
make[2]: Nothing to be done for `install-exec-am'.
make[2]: Nothing to be done for `install-data-am'.
make[2]: Leaving directory
`<http://river.suse.de/job/yast-sysconfig-HEAD/ws/checkout/test'>
make[1]: Leaving directory
`<http://river.suse.de/job/yast-sysconfig-HEAD/ws/checkout/test'>
Making install in testsuite
make[1]: Entering directory
`<http://river.suse.de/job/yast-sysconfig-HEAD/ws/checkout/testsuite'>
make -f /usr/share/YaST2/data/testsuite/Makefile.testsuite
RPMNAME=yast2-sysconfig srcdir=.
make[2]: Entering directory
`<http://river.suse.de/job/yast-sysconfig-HEAD/ws/checkout/testsuite'>
make[2]: Nothing to be done for `all'.
make[2]: Leaving directory
`<http://river.suse.de/job/yast-sysconfig-HEAD/ws/checkout/testsuite'>
make[2]: Entering directory
`<http://river.suse.de/job/yast-sysconfig-HEAD/ws/checkout/testsuite'>
make[2]: Nothing to be done for `install-exec-am'.
make[2]: Nothing to be done for `install-data-am'.
make[2]: Leaving directory
`<http://river.suse.de/job/yast-sysconfig-HEAD/ws/checkout/testsuite'>
make[1]: Leaving directory
`<http://river.suse.de/job/yast-sysconfig-HEAD/ws/checkout/testsuite'>
make[1]: Entering directory
`<http://river.suse.de/job/yast-sysconfig-HEAD/ws/checkout'>
make[2]: Entering directory
`<http://river.suse.de/job/yast-sysconfig-HEAD/ws/checkout'>
make[2]: Nothing to be done for `install-exec-am'.
mkdir -p /usr/share/doc/packages/yast2-sysconfig
/usr/bin/install -c -p -m 644
/usr/share/YaST2/data/devtools/admin/copyright/gpl/README
/usr/share/doc/packages/yast2-sysconfig
/usr/bin/install -c -p -m 644
/usr/share/YaST2/data/devtools/admin/copyright/gpl/COPYING
/usr/share/doc/packages/yast2-sysconfig
make[2]: Leaving directory
`<http://river.suse.de/job/yast-sysconfig-HEAD/ws/checkout'>
make[1]: Leaving directory
`<http://river.suse.de/job/yast-sysconfig-HEAD/ws/checkout'>
+ make check
Making check in doc
make[1]: Entering directory
`<http://river.suse.de/job/yast-sysconfig-HEAD/ws/checkout/doc'>
Making check in autodocs
make[2]: Entering directory
`<http://river.suse.de/job/yast-sysconfig-HEAD/ws/checkout/doc/autodocs'>
make[2]: Nothing to be done for `check'.
make[2]: Leaving directory
`<http://river.suse.de/job/yast-sysconfig-HEAD/ws/checkout/doc/autodocs'>
make[2]: Entering directory
`<http://river.suse.de/job/yast-sysconfig-HEAD/ws/checkout/doc'>
make[2]: Nothing to be done for `check-am'.
make[2]: Leaving directory
`<http://river.suse.de/job/yast-sysconfig-HEAD/ws/checkout/doc'>
make[1]: Leaving directory
`<http://river.suse.de/job/yast-sysconfig-HEAD/ws/checkout/doc'>
Making check in src
make[1]: Entering directory
`<http://river.suse.de/job/yast-sysconfig-HEAD/ws/checkout/src'>
make[1]: Nothing to be done for `check'.
make[1]: Leaving directory
`<http://river.suse.de/job/yast-sysconfig-HEAD/ws/checkout/src'>
Making check in test
make[1]: Entering directory
`<http://river.suse.de/job/yast-sysconfig-HEAD/ws/checkout/test'>
make check-TESTS
make[2]: Entering directory
`<http://river.suse.de/job/yast-sysconfig-HEAD/ws/checkout/test'>
./test_helper.rb: line 1: require: command not found
./test_helper.rb: line 2: require: command not found
./test_helper.rb: line 3: require: command not found
./test_helper.rb: line 4: require: command not found
./test_helper.rb: line 10: syntax error near unexpected token `('
./test_helper.rb: line 10: `ENV["Y2DIR"] = File.expand_path("../../src",
__FILE__)'
FAIL: test_helper.rb
./read_test.rb: line 1: require_relative: command not found
./read_test.rb: line 3: include: command not found
./read_test.rb: line 5: describe: command not found
./read_test.rb: line 6: before: command not found
./read_test.rb: line 7: initialize_sysconfig: command not found
./read_test.rb: line 8: end: command not found
./read_test.rb: line 10: it: command not found
./read_test.rb: line 11: sysconfig.configfiles.must_be_empty: command not found
./read_test.rb: line 12: syntax error near unexpected token `:all'
./read_test.rb: line 12: ` load_sample_file(:all)'
FAIL: read_test.rb
./write_test.rb: line 1: require_relative: command not found
./write_test.rb: line 3: include: command not found
./write_test.rb: line 5: describe: command not found
./write_test.rb: line 6: before: command not found
./write_test.rb: line 7: initialize_sysconfig: command not found
./write_test.rb: line 8: end: command not found
./write_test.rb: line 10: it: command not found
./write_test.rb: line 11: load_sample: command not found
./write_test.rb: line 12: var_name: command not found
./write_test.rb: line 13: new_value: command not found
./write_test.rb: line 14: sysconfig.Read: command not found
./write_test.rb: line 15: syntax error near unexpected token `('
./write_test.rb: line 15: ` original_value = get_value(var_name)'
FAIL: write_test.rb
./autoyast_test.rb: line 1: require_relative: command not found
./autoyast_test.rb: line 3: include: command not found
./autoyast_test.rb: line 5: describe: command not found
./autoyast_test.rb: line 6: describe: command not found
./autoyast_test.rb: line 8: before: command not found
./autoyast_test.rb: line 9: initialize_sysconfig: command not found
./autoyast_test.rb: line 10: end: command not found
./autoyast_test.rb: line 12: it: command not found
./autoyast_test.rb: line 13: load_sample: command not found
./autoyast_test.rb: line 14: syntax error near unexpected token
`autoyast_profile'
./autoyast_test.rb: line 14: ` sysconfig.Import(autoyast_profile(:name
=> 'FIREWALL', :value => 'no'))'
FAIL: autoyast_test.rb
==========================================
4 of 4 tests failed
Please report to http://bugs.opensuse.org/
==========================================
make[2]: *** [check-TESTS] Error 1
make[2]: Leaving directory
`<http://river.suse.de/job/yast-sysconfig-HEAD/ws/checkout/test'>
make[1]: *** [check-am] Error 2
make[1]: Leaving directory
`<http://river.suse.de/job/yast-sysconfig-HEAD/ws/checkout/test'>
make: *** [check-recursive] Error 1
++ error_exit 2
++ echo 'ERROR: detected exitcode 2'
ERROR: detected exitcode 2
++ cleanup
++ echo '==> Running cleanup'
==> Running cleanup
++ rm -f
<http://river.suse.de/job/yast-sysconfig-HEAD/ws/ICECC/40c0ab7e54f59a1e4e493c1ea90a882a.tar.gz>
++ footer_and_exit 1
++ '[' -z 1 ']'
++ MYEXIT=1
++ '[' 1 == 0 ']'
++ ascii_failed
++ cat

( )
( ) (
) _ )
( \_
_(_\ \)__
(____\___))

build failed

++ exit 1
Build step 'Execute shell' marked build as failure
--
To unsubscribe, e-mail: yast-commit+unsubscribe@xxxxxxxxxxxx
For additional commands, e-mail: yast-commit+help@xxxxxxxxxxxx

< Previous Next >
Follow Ups
References