Mailinglist Archive: yast-commit (306 mails)

< Previous Next >
[yast-commit] Build failed in Jenkins: yast-sysconfig-HEAD #152
  • From: hudson@xxxxxxx
  • Date: Tue, 27 Aug 2013 16:02:10 +0200 (CEST)
  • Message-id: <97887747.757.1377612130244.JavaMail.jenkins@river>
See <http://river.suse.de/job/yast-sysconfig-HEAD/152/changes>

Changes:

[Vladimir Moravec] Add rakefile and test files

[Vladimir Moravec] Add generated spec dir with spec file

[Vladimir Moravec] Add custom console config

[Vladimir Moravec] Vim auto space removal

[Vladimir Moravec] Add first drafts of spec

[Vladimir Moravec] Change test files and naming

[Vladimir Moravec] Add inspect method; remove unused instance var

[Vladimir Moravec] Add tests for reading and writing of config files

[Vladimir Moravec] Fix tests to pass

[Vladimir Moravec] Add autoyast test; update test helper

[Vladimir Moravec] Add test for wrong format of variable value

[Vladimir Moravec] Improve test examples

[Vladimir Moravec] Remove Rakefile as the time for it has not come yet

[Vladimir Moravec] Improve autoyast tests

[Vladimir Moravec] Add helper method for variable name and value check

[Vladimir Moravec] DRYing of test samples for autoyast test

[Vladimir Moravec] Fix typos

[Vladimir Moravec] Changes for make

[Vladimir Moravec] Mix test helpers into the top

------------------------------------------
[...truncated 88 lines...]
++ export ARTIFACTS=<http://river.suse.de/job/yast-sysconfig-HEAD/ws/.artifacts>
++ ARTIFACTS=<http://river.suse.de/job/yast-sysconfig-HEAD/ws/.artifacts>
++ export OBSDIR=<http://river.suse.de/job/yast-sysconfig-HEAD/ws/OBS>
++ OBSDIR=<http://river.suse.de/job/yast-sysconfig-HEAD/ws/OBS>
++ export RPMTOPDIR=<http://river.suse.de/job/yast-sysconfig-HEAD/ws/rpm>
++ RPMTOPDIR=<http://river.suse.de/job/yast-sysconfig-HEAD/ws/rpm>
++ export RPMOUT=<http://river.suse.de/job/yast-sysconfig-HEAD/ws/rpm/rpms>
++ RPMOUT=<http://river.suse.de/job/yast-sysconfig-HEAD/ws/rpm/rpms>
++ export
RPMBUILDDIR=<http://river.suse.de/job/yast-sysconfig-HEAD/ws/rpm/rpmbuild>
++ RPMBUILDDIR=<http://river.suse.de/job/yast-sysconfig-HEAD/ws/rpm/rpmbuild>
++ export
RPMBUILDROOT=<http://river.suse.de/job/yast-sysconfig-HEAD/ws/rpm/rpmbuildroot>
++
RPMBUILDROOT=<http://river.suse.de/job/yast-sysconfig-HEAD/ws/rpm/rpmbuildroot>
++ rm -rf <http://river.suse.de/job/yast-sysconfig-HEAD/ws/rpm/rpms>
++ rm -rf <http://river.suse.de/job/yast-sysconfig-HEAD/ws/rpm/rpmbuild>
++ rm -rf <http://river.suse.de/job/yast-sysconfig-HEAD/ws/rpm/rpmbuildroot>
++ rm -rf <http://river.suse.de/job/yast-sysconfig-HEAD/ws/.artifacts>
++ rm -rf <http://river.suse.de/job/yast-sysconfig-HEAD/ws/OBS>
++ rm -rf '<http://river.suse.de/job/yast-sysconfig-HEAD/ws/copy-to-slave*.dir'>
++ [[ 1 == 1 ]]
++ echo 'Using autotools for building'
Using autotools for building
++ export BUILDDIR=<http://river.suse.de/job/yast-sysconfig-HEAD/ws/checkout>
++ BUILDDIR=<http://river.suse.de/job/yast-sysconfig-HEAD/ws/checkout>
++ export
PACKAGEDIR=<http://river.suse.de/job/yast-sysconfig-HEAD/ws/checkout/package>
++ PACKAGEDIR=<http://river.suse.de/job/yast-sysconfig-HEAD/ws/checkout/package>
++ mkdir -p <http://river.suse.de/job/yast-sysconfig-HEAD/ws/rpm>
++ mkdir -p <http://river.suse.de/job/yast-sysconfig-HEAD/ws/rpm/rpms>
++ mkdir -p <http://river.suse.de/job/yast-sysconfig-HEAD/ws/rpm/rpmbuild>
++ mkdir -p <http://river.suse.de/job/yast-sysconfig-HEAD/ws/rpm/rpmbuildroot>
++ mkdir -p <http://river.suse.de/job/yast-sysconfig-HEAD/ws/.artifacts>
++ mkdir -p <http://river.suse.de/job/yast-sysconfig-HEAD/ws/OBS>
++ cat
+ PACKAGENAME=yast-sysconfig
+ PACKAGENAME=yast2-sysconfig
+ cd <http://river.suse.de/job/yast-sysconfig-HEAD/ws/checkout>
+ make -f Makefile.cvs
y2tool y2autoconf
y2autoconf: Generating toplevel configure.ac
y2tool y2automake
y2automake: Copying automakefiles for inclusion
y2automake: Generating toplevel Makefile.am
autoreconf --force --install
./configure --prefix=/usr --libdir=/usr/lib64
checking build system type... x86_64-suse-linux-gnu
checking host system type... x86_64-suse-linux-gnu
checking target system type... x86_64-suse-linux-gnu
checking for a BSD-compatible install... /usr/bin/install -c
checking whether build environment is sane... yes
checking for a thread-safe mkdir -p... /usr/bin/mkdir -p
checking for gawk... gawk
checking whether make sets $(MAKE)... yes
checking how to create a ustar tar archive... gnutar
checking whether ln -s works... yes
checking whether make sets $(MAKE)... (cached) yes
checking for xgettext... /usr/bin/xgettext
checking for ycpdoc... /usr/lib/YaST2/bin/ycpdoc
checking for ycpmakedep... /usr/lib/YaST2/bin/ycpmakedep
checking for ycpc... /usr/bin/ycpc
checking for /usr/share/YaST2/data/testsuite/Makefile.testsuite... yes
checking for YCP modules... not found
checking that generated files are newer than configure... done
configure: creating ./config.status
config.status: creating Makefile
config.status: creating doc/autodocs/Makefile
config.status: creating doc/Makefile
config.status: creating src/Makefile
config.status: creating test/Makefile
config.status: creating testsuite/Makefile
+ make
Making all in doc
make[1]: Entering directory
`<http://river.suse.de/job/yast-sysconfig-HEAD/ws/checkout/doc'>
Making all in autodocs
make[2]: Entering directory
`<http://river.suse.de/job/yast-sysconfig-HEAD/ws/checkout/doc/autodocs'>
if [ -n "" ]; then /usr/lib/YaST2/bin/ycpdoc -d. -s./../../src ; fi
for i in ; do \
b=${i##./../../src}; b=${b#/}; b=${b//\//__}; b=${b%.pm}; \
pod2html --title=$b --infile=$i --outfile=$b.html; \
echo "<a href='$b.html'>${b/__/::}</a>" > $b.mod.html; \
done
if [ -n "./../../src/modules/Sysconfig.rb
./../../src/include/sysconfig/routines.rb
./../../src/include/sysconfig/cmdline.rb
./../../src/include/sysconfig/dialogs.rb
./../../src/include/sysconfig/complex.rb ./../../src/include/sysconfig/helps.rb
./../../src/include/sysconfig/wizards.rb" ]; then yard doc --title
"yast2-sysconfig -- Development Documentation" -o . -m markdown
./../../src/modules/Sysconfig.rb ./../../src/include/sysconfig/routines.rb
./../../src/include/sysconfig/cmdline.rb
./../../src/include/sysconfig/dialogs.rb
./../../src/include/sysconfig/complex.rb ./../../src/include/sysconfig/helps.rb
./../../src/include/sysconfig/wizards.rb; fi
Files: 7
Modules: 7 ( 6 undocumented)
Classes: 1 ( 1 undocumented)
Constants: 1 ( 1 undocumented)
Methods: 66 ( 13 undocumented)
72.00% documented
make[2]: Leaving directory
`<http://river.suse.de/job/yast-sysconfig-HEAD/ws/checkout/doc/autodocs'>
make[2]: Entering directory
`<http://river.suse.de/job/yast-sysconfig-HEAD/ws/checkout/doc'>
make[2]: Nothing to be done for `all-am'.
make[2]: Leaving directory
`<http://river.suse.de/job/yast-sysconfig-HEAD/ws/checkout/doc'>
make[1]: Leaving directory
`<http://river.suse.de/job/yast-sysconfig-HEAD/ws/checkout/doc'>
Making all in src
make[1]: Entering directory
`<http://river.suse.de/job/yast-sysconfig-HEAD/ws/checkout/src'>
make[1]: Nothing to be done for `all'.
make[1]: Leaving directory
`<http://river.suse.de/job/yast-sysconfig-HEAD/ws/checkout/src'>
Making all in test
make[1]: Entering directory
`<http://river.suse.de/job/yast-sysconfig-HEAD/ws/checkout/test'>
make[1]: Nothing to be done for `all'.
make[1]: Leaving directory
`<http://river.suse.de/job/yast-sysconfig-HEAD/ws/checkout/test'>
Making all in testsuite
make[1]: Entering directory
`<http://river.suse.de/job/yast-sysconfig-HEAD/ws/checkout/testsuite'>
make -f /usr/share/YaST2/data/testsuite/Makefile.testsuite
RPMNAME=yast2-sysconfig srcdir=.
make[2]: Entering directory
`<http://river.suse.de/job/yast-sysconfig-HEAD/ws/checkout/testsuite'>
mkdir -p ./run ./config ./yast2-sysconfig.test ./tests
cp -f /usr/share/YaST2/data/testsuite/skel/default.exp config/default.exp
cp -f /usr/share/YaST2/data/testsuite/skel/unix.exp config/unix.exp
cp -f /usr/share/YaST2/data/testsuite/skel/unknown.exp config/unknown.exp
cp -f /usr/share/YaST2/data/testsuite/skel/testsuite.exp
yast2-sysconfig.test/testsuite.exp
cp -f /usr/share/YaST2/data/testsuite/skel/runtest.sh run/runtest.sh
chmod +x run/runtest.sh
make[2]: Leaving directory
`<http://river.suse.de/job/yast-sysconfig-HEAD/ws/checkout/testsuite'>
make[1]: Leaving directory
`<http://river.suse.de/job/yast-sysconfig-HEAD/ws/checkout/testsuite'>
make[1]: Entering directory
`<http://river.suse.de/job/yast-sysconfig-HEAD/ws/checkout'>
make[1]: Nothing to be done for `all-am'.
make[1]: Leaving directory
`<http://river.suse.de/job/yast-sysconfig-HEAD/ws/checkout'>
+ make install
Making install in doc
make[1]: Entering directory
`<http://river.suse.de/job/yast-sysconfig-HEAD/ws/checkout/doc'>
Making install in autodocs
make[2]: Entering directory
`<http://river.suse.de/job/yast-sysconfig-HEAD/ws/checkout/doc/autodocs'>
make[3]: Entering directory
`<http://river.suse.de/job/yast-sysconfig-HEAD/ws/checkout/doc/autodocs'>
make[3]: Nothing to be done for `install-exec-am'.
/usr/bin/mkdir -p '/usr/share/doc/packages/yast2-sysconfig//autodocs'
/usr/bin/mkdir -p '/usr/share/doc/packages/yast2-sysconfig//autodocs/js'
/usr/bin/install -c -p -m 644 js/full_list.js js/jquery.js js/app.js
'/usr/share/doc/packages/yast2-sysconfig//autodocs/js'
/usr/bin/install -c -p -m 644 index.html file_list.html class_list.html
Yast.html _index.html method_list.html top-level-namespace.html frames.html
'/usr/share/doc/packages/yast2-sysconfig//autodocs/.'
/usr/bin/mkdir -p '/usr/share/doc/packages/yast2-sysconfig//autodocs/Yast'
/usr/bin/install -c -p -m 644 Yast/SysconfigComplexInclude.html
Yast/SysconfigDialogsInclude.html Yast/SysconfigHelpsInclude.html
Yast/SysconfigRoutinesInclude.html Yast/SysconfigClass.html
Yast/SysconfigCmdlineInclude.html Yast/SysconfigWizardsInclude.html
'/usr/share/doc/packages/yast2-sysconfig//autodocs/Yast'
/usr/bin/mkdir -p '/usr/share/doc/packages/yast2-sysconfig//autodocs/css'
/usr/bin/install -c -p -m 644 css/full_list.css css/style.css css/common.css
'/usr/share/doc/packages/yast2-sysconfig//autodocs/css'
make[3]: Leaving directory
`<http://river.suse.de/job/yast-sysconfig-HEAD/ws/checkout/doc/autodocs'>
make[2]: Leaving directory
`<http://river.suse.de/job/yast-sysconfig-HEAD/ws/checkout/doc/autodocs'>
make[2]: Entering directory
`<http://river.suse.de/job/yast-sysconfig-HEAD/ws/checkout/doc'>
make[3]: Entering directory
`<http://river.suse.de/job/yast-sysconfig-HEAD/ws/checkout/doc'>
make[3]: Nothing to be done for `install-exec-am'.
/usr/bin/mkdir -p '/usr/share/doc/packages/yast2-sysconfig'
/usr/bin/install -c -p -m 644 metadata.txt
'/usr/share/doc/packages/yast2-sysconfig'
make[3]: Leaving directory
`<http://river.suse.de/job/yast-sysconfig-HEAD/ws/checkout/doc'>
make[2]: Leaving directory
`<http://river.suse.de/job/yast-sysconfig-HEAD/ws/checkout/doc'>
make[1]: Leaving directory
`<http://river.suse.de/job/yast-sysconfig-HEAD/ws/checkout/doc'>
Making install in src
make[1]: Entering directory
`<http://river.suse.de/job/yast-sysconfig-HEAD/ws/checkout/src'>
make[2]: Entering directory
`<http://river.suse.de/job/yast-sysconfig-HEAD/ws/checkout/src'>
make[2]: Nothing to be done for `install-exec-am'.
/usr/bin/mkdir -p '/usr/share/YaST2/clients'
/usr/bin/install -c -p -m 644 clients/sysconfig_auto.rb clients/sysconfig.rb
'/usr/share/YaST2/clients'
/usr/bin/mkdir -p '/usr/share/applications/YaST2'
/usr/bin/install -c -p -m 644 desktop/sysconfig.desktop
'/usr/share/applications/YaST2'
/usr/bin/mkdir -p '/usr/share/YaST2/modules'
/usr/bin/install -c -p -m 644 modules/Sysconfig.rb '/usr/share/YaST2/modules'
/usr/bin/mkdir -p '/usr/share/YaST2/modules'
/usr/bin/install -c -p -m 644 modules/Sysconfig.rb '/usr/share/YaST2/modules'
/usr/bin/mkdir -p '/usr/share/YaST2/schema/autoyast/rnc'
/usr/bin/install -c -p -m 644 autoyast-rnc/sysconfig.rnc
'/usr/share/YaST2/schema/autoyast/rnc'
/usr/bin/mkdir -p '/usr/lib/YaST2/bin'
/usr/bin/install -c -p bin/parse_configs.pl '/usr/lib/YaST2/bin'
/usr/bin/mkdir -p '/usr/share/YaST2/data'
/usr/bin/install -c -p -m 644 data/descriptions data/sysedit.agent
'/usr/share/YaST2/data'
/usr/bin/mkdir -p '/usr/share/YaST2/include/sysconfig'
/usr/bin/install -c -p -m 644 include/sysconfig/wizards.rb
include/sysconfig/dialogs.rb include/sysconfig/complex.rb
include/sysconfig/routines.rb include/sysconfig/cmdline.rb
include/sysconfig/helps.rb '/usr/share/YaST2/include/sysconfig'
make[2]: Leaving directory
`<http://river.suse.de/job/yast-sysconfig-HEAD/ws/checkout/src'>
make[1]: Leaving directory
`<http://river.suse.de/job/yast-sysconfig-HEAD/ws/checkout/src'>
Making install in test
make[1]: Entering directory
`<http://river.suse.de/job/yast-sysconfig-HEAD/ws/checkout/test'>
make[2]: Entering directory
`<http://river.suse.de/job/yast-sysconfig-HEAD/ws/checkout/test'>
make[2]: Nothing to be done for `install-exec-am'.
make[2]: Nothing to be done for `install-data-am'.
make[2]: Leaving directory
`<http://river.suse.de/job/yast-sysconfig-HEAD/ws/checkout/test'>
make[1]: Leaving directory
`<http://river.suse.de/job/yast-sysconfig-HEAD/ws/checkout/test'>
Making install in testsuite
make[1]: Entering directory
`<http://river.suse.de/job/yast-sysconfig-HEAD/ws/checkout/testsuite'>
make -f /usr/share/YaST2/data/testsuite/Makefile.testsuite
RPMNAME=yast2-sysconfig srcdir=.
make[2]: Entering directory
`<http://river.suse.de/job/yast-sysconfig-HEAD/ws/checkout/testsuite'>
make[2]: Nothing to be done for `all'.
make[2]: Leaving directory
`<http://river.suse.de/job/yast-sysconfig-HEAD/ws/checkout/testsuite'>
make[2]: Entering directory
`<http://river.suse.de/job/yast-sysconfig-HEAD/ws/checkout/testsuite'>
make[2]: Nothing to be done for `install-exec-am'.
make[2]: Nothing to be done for `install-data-am'.
make[2]: Leaving directory
`<http://river.suse.de/job/yast-sysconfig-HEAD/ws/checkout/testsuite'>
make[1]: Leaving directory
`<http://river.suse.de/job/yast-sysconfig-HEAD/ws/checkout/testsuite'>
make[1]: Entering directory
`<http://river.suse.de/job/yast-sysconfig-HEAD/ws/checkout'>
make[2]: Entering directory
`<http://river.suse.de/job/yast-sysconfig-HEAD/ws/checkout'>
make[2]: Nothing to be done for `install-exec-am'.
mkdir -p /usr/share/doc/packages/yast2-sysconfig
/usr/bin/install -c -p -m 644
/usr/share/YaST2/data/devtools/admin/copyright/gpl/README
/usr/share/doc/packages/yast2-sysconfig
/usr/bin/install -c -p -m 644
/usr/share/YaST2/data/devtools/admin/copyright/gpl/COPYING
/usr/share/doc/packages/yast2-sysconfig
make[2]: Leaving directory
`<http://river.suse.de/job/yast-sysconfig-HEAD/ws/checkout'>
make[1]: Leaving directory
`<http://river.suse.de/job/yast-sysconfig-HEAD/ws/checkout'>
+ make check
Making check in doc
make[1]: Entering directory
`<http://river.suse.de/job/yast-sysconfig-HEAD/ws/checkout/doc'>
Making check in autodocs
make[2]: Entering directory
`<http://river.suse.de/job/yast-sysconfig-HEAD/ws/checkout/doc/autodocs'>
make[2]: Nothing to be done for `check'.
make[2]: Leaving directory
`<http://river.suse.de/job/yast-sysconfig-HEAD/ws/checkout/doc/autodocs'>
make[2]: Entering directory
`<http://river.suse.de/job/yast-sysconfig-HEAD/ws/checkout/doc'>
make[2]: Nothing to be done for `check-am'.
make[2]: Leaving directory
`<http://river.suse.de/job/yast-sysconfig-HEAD/ws/checkout/doc'>
make[1]: Leaving directory
`<http://river.suse.de/job/yast-sysconfig-HEAD/ws/checkout/doc'>
Making check in src
make[1]: Entering directory
`<http://river.suse.de/job/yast-sysconfig-HEAD/ws/checkout/src'>
make[1]: Nothing to be done for `check'.
make[1]: Leaving directory
`<http://river.suse.de/job/yast-sysconfig-HEAD/ws/checkout/src'>
Making check in test
make[1]: Entering directory
`<http://river.suse.de/job/yast-sysconfig-HEAD/ws/checkout/test'>
make check-TESTS
make[2]: Entering directory
`<http://river.suse.de/job/yast-sysconfig-HEAD/ws/checkout/test'>
/bin/sh: line 9: ./test_helper.rb: Permission denied
FAIL: test_helper.rb
/bin/sh: line 9: ./read_test.rb: Permission denied
FAIL: read_test.rb
/bin/sh: line 9: ./write_test.rb: Permission denied
FAIL: write_test.rb
/bin/sh: line 9: ./autoyast_test.rb: Permission denied
FAIL: autoyast_test.rb
==========================================
4 of 4 tests failed
Please report to http://bugs.opensuse.org/
==========================================
make[2]: *** [check-TESTS] Error 1
make[2]: Leaving directory
`<http://river.suse.de/job/yast-sysconfig-HEAD/ws/checkout/test'>
make[1]: *** [check-am] Error 2
make[1]: Leaving directory
`<http://river.suse.de/job/yast-sysconfig-HEAD/ws/checkout/test'>
make: *** [check-recursive] Error 1
++ error_exit 2
++ echo 'ERROR: detected exitcode 2'
ERROR: detected exitcode 2
++ cleanup
++ echo '==> Running cleanup'
==> Running cleanup
++ rm -f
<http://river.suse.de/job/yast-sysconfig-HEAD/ws/ICECC/40c0ab7e54f59a1e4e493c1ea90a882a.tar.gz>
++ footer_and_exit 1
++ '[' -z 1 ']'
++ MYEXIT=1
++ '[' 1 == 0 ']'
++ ascii_failed
++ cat

( )
( ) (
) _ )
( \_
_(_\ \)__
(____\___))

build failed

++ exit 1
Build step 'Execute shell' marked build as failure
--
To unsubscribe, e-mail: yast-commit+unsubscribe@xxxxxxxxxxxx
For additional commands, e-mail: yast-commit+help@xxxxxxxxxxxx

< Previous Next >
Follow Ups