Mailinglist Archive: yast-commit (306 mails)

< Previous Next >
[yast-commit] Build failed in Jenkins: yast-yast2-HEAD #175
  • From: hudson@xxxxxxx
  • Date: Thu, 22 Aug 2013 12:54:33 +0200 (CEST)
  • Message-id: <1928861746.708.1377168873380.JavaMail.jenkins@river>
See <http://river.suse.de/job/yast-yast2-HEAD/175/changes>

Changes:

[Josef Reidinger] update gitignore

[Josef Reidinger] add initial tests

[Josef Reidinger] refactor IPv4 check

[jsuchome] version

------------------------------------------
[...truncated 1761 lines...]
make[3]: Entering directory
`<http://river.suse.de/job/yast-yast2-HEAD/ws/checkout/library/gpg/testsuite'>
make -f /usr/share/YaST2/data/testsuite/Makefile.testsuite RPMNAME=yast2
srcdir=.
make[4]: Entering directory
`<http://river.suse.de/job/yast-yast2-HEAD/ws/checkout/library/gpg/testsuite'>
make[4]: Nothing to be done for `all'.
make[4]: Leaving directory
`<http://river.suse.de/job/yast-yast2-HEAD/ws/checkout/library/gpg/testsuite'>
make[4]: Entering directory
`<http://river.suse.de/job/yast-yast2-HEAD/ws/checkout/library/gpg/testsuite'>
make[4]: Nothing to be done for `install-exec-am'.
make[4]: Nothing to be done for `install-data-am'.
make[4]: Leaving directory
`<http://river.suse.de/job/yast-yast2-HEAD/ws/checkout/library/gpg/testsuite'>
make[3]: Leaving directory
`<http://river.suse.de/job/yast-yast2-HEAD/ws/checkout/library/gpg/testsuite'>
make[3]: Entering directory
`<http://river.suse.de/job/yast-yast2-HEAD/ws/checkout/library/gpg'>
make[4]: Entering directory
`<http://river.suse.de/job/yast-yast2-HEAD/ws/checkout/library/gpg'>
make[4]: Nothing to be done for `install-exec-am'.
make[4]: Nothing to be done for `install-data-am'.
make[4]: Leaving directory
`<http://river.suse.de/job/yast-yast2-HEAD/ws/checkout/library/gpg'>
make[3]: Leaving directory
`<http://river.suse.de/job/yast-yast2-HEAD/ws/checkout/library/gpg'>
make[2]: Leaving directory
`<http://river.suse.de/job/yast-yast2-HEAD/ws/checkout/library/gpg'>
Making install in general
make[2]: Entering directory
`<http://river.suse.de/job/yast-yast2-HEAD/ws/checkout/library/general'>
Making install in src
make[3]: Entering directory
`<http://river.suse.de/job/yast-yast2-HEAD/ws/checkout/library/general/src'>
make[4]: Entering directory
`<http://river.suse.de/job/yast-yast2-HEAD/ws/checkout/library/general/src'>
make[4]: Nothing to be done for `install-exec-am'.
/usr/bin/mkdir -p '/usr/lib/YaST2/servers_non_y2'
/usr/bin/install -c -p servers_non_y2/ag_netd servers_non_y2/ag_anyxml
servers_non_y2/ag_freespace servers_non_y2/ag_content
'/usr/lib/YaST2/servers_non_y2'
/usr/bin/mkdir -p '/usr/share/YaST2/clients'
/usr/bin/install -c -p -m 644 clients/remoteinstall.rb
clients/remotechooser.rb clients/password.rb '/usr/share/YaST2/clients'
/usr/bin/mkdir -p '/var/adm/fillup-templates'
/usr/bin/install -c -p -m 644 fillup/sysconfig.yast2
'/var/adm/fillup-templates'
/usr/bin/mkdir -p '/usr/share/YaST2/modules'
/usr/bin/install -c -p -m 644 modules/Linuxrc.rb modules/ConfigHistory.rb
modules/Message.rb modules/Misc.rb modules/Icon.rb modules/Call.rb
modules/AsciiFile.rb modules/ContextMenu.rb modules/Crash.rb
modules/FileUtils.rb modules/Arch.rb modules/Mode.rb modules/Directory.rb
modules/Encoding.rb modules/CustomDialogs.rb modules/Distro.rb
modules/XVersion.rb modules/Summary.rb modules/Syslog.rb modules/UIHelper.rb
modules/DontShowAgain.rb modules/Report.rb modules/ValueBrowser.rb
modules/Event.rb modules/Label.rb modules/Assert.rb modules/OSRelease.rb
modules/PackagesProposal.rb modules/Popup.rb modules/MailAliases.rb
modules/Stage.rb modules/RegistrationStatus.pm modules/MailTable.pm
modules/MailTableInclude.pm '/usr/share/YaST2/modules'
/usr/bin/mkdir -p '/usr/share/YaST2/modules'
/usr/bin/install -c -p -m 644 modules/Linuxrc.rb modules/ConfigHistory.rb
modules/Message.rb modules/Misc.rb modules/Icon.rb modules/Call.rb
modules/AsciiFile.rb modules/ContextMenu.rb modules/Crash.rb
modules/FileUtils.rb modules/Arch.rb modules/Mode.rb modules/Directory.rb
modules/Encoding.rb modules/CustomDialogs.rb modules/Distro.rb
modules/XVersion.rb modules/Summary.rb modules/Syslog.rb modules/UIHelper.rb
modules/DontShowAgain.rb modules/Report.rb modules/ValueBrowser.rb
modules/Event.rb modules/Label.rb modules/Assert.rb modules/OSRelease.rb
modules/PackagesProposal.rb modules/Popup.rb modules/MailAliases.rb
modules/Stage.rb modules/RegistrationStatus.pm modules/MailTable.pm
modules/MailTableInclude.pm '/usr/share/YaST2/modules'
/usr/bin/mkdir -p '/usr/share/YaST2/scrconf'
/usr/bin/install -c -p -m 644 scrconf/content.scr scrconf/cfg_hotplug.scr
scrconf/proc_meminfo.scr scrconf/etc_sysctl_conf.scr scrconf/cfg_sysctl.scr
scrconf/etc_inetd.scr scrconf/etc_inittab.scr scrconf/cfg_apache2.scr
scrconf/cfg_features.scr scrconf/etc_ssh_sshd_config.scr
scrconf/cfg_displaymanager.scr scrconf/contentfile.scr scrconf/cfg_yast2.scr
scrconf/cfg_xversion.scr scrconf/yast2_groups.scr scrconf/etc_fstab.scr
scrconf/cfg_cron.scr scrconf/cfg_suseconfig.scr scrconf/etc_login_defs.scr
scrconf/cfg_policykit.scr scrconf/system_freespace.scr scrconf/etc_xinetd.scr
scrconf/run_ifconfig.scr scrconf/cfg_apache.scr scrconf/cfg_services.scr
scrconf/anyxml.scr scrconf/yast2_desktop.scr scrconf/proc_mounts.scr
scrconf/cfg_ypserv.scr scrconf/cfg_security.scr '/usr/share/YaST2/scrconf'
/usr/bin/mkdir -p '/usr/share/YaST2/data'
/usr/bin/install -c -p -m 644 data/country.ycp data/country_long.ycp
'/usr/share/YaST2/data'
make[4]: Leaving directory
`<http://river.suse.de/job/yast-yast2-HEAD/ws/checkout/library/general/src'>
make[3]: Leaving directory
`<http://river.suse.de/job/yast-yast2-HEAD/ws/checkout/library/general/src'>
Making install in testsuite
make[3]: Entering directory
`<http://river.suse.de/job/yast-yast2-HEAD/ws/checkout/library/general/testsuite'>
make -f /usr/share/YaST2/data/testsuite/Makefile.testsuite RPMNAME=yast2
srcdir=.
make[4]: Entering directory
`<http://river.suse.de/job/yast-yast2-HEAD/ws/checkout/library/general/testsuite'>
make[4]: Nothing to be done for `all'.
make[4]: Leaving directory
`<http://river.suse.de/job/yast-yast2-HEAD/ws/checkout/library/general/testsuite'>
make[4]: Entering directory
`<http://river.suse.de/job/yast-yast2-HEAD/ws/checkout/library/general/testsuite'>
make[4]: Nothing to be done for `install-exec-am'.
make[4]: Nothing to be done for `install-data-am'.
make[4]: Leaving directory
`<http://river.suse.de/job/yast-yast2-HEAD/ws/checkout/library/general/testsuite'>
make[3]: Leaving directory
`<http://river.suse.de/job/yast-yast2-HEAD/ws/checkout/library/general/testsuite'>
make[3]: Entering directory
`<http://river.suse.de/job/yast-yast2-HEAD/ws/checkout/library/general'>
make[4]: Entering directory
`<http://river.suse.de/job/yast-yast2-HEAD/ws/checkout/library/general'>
make[4]: Nothing to be done for `install-exec-am'.
make[4]: Nothing to be done for `install-data-am'.
make[4]: Leaving directory
`<http://river.suse.de/job/yast-yast2-HEAD/ws/checkout/library/general'>
make[3]: Leaving directory
`<http://river.suse.de/job/yast-yast2-HEAD/ws/checkout/library/general'>
make[2]: Leaving directory
`<http://river.suse.de/job/yast-yast2-HEAD/ws/checkout/library/general'>
make[2]: Entering directory
`<http://river.suse.de/job/yast-yast2-HEAD/ws/checkout/library'>
make[3]: Entering directory
`<http://river.suse.de/job/yast-yast2-HEAD/ws/checkout/library'>
make[3]: Nothing to be done for `install-exec-am'.
make[3]: Nothing to be done for `install-data-am'.
make[3]: Leaving directory
`<http://river.suse.de/job/yast-yast2-HEAD/ws/checkout/library'>
make[2]: Leaving directory
`<http://river.suse.de/job/yast-yast2-HEAD/ws/checkout/library'>
make[1]: Leaving directory
`<http://river.suse.de/job/yast-yast2-HEAD/ws/checkout/library'>
Making install in scripts
make[1]: Entering directory
`<http://river.suse.de/job/yast-yast2-HEAD/ws/checkout/scripts'>
make[2]: Entering directory
`<http://river.suse.de/job/yast-yast2-HEAD/ws/checkout/scripts'>
/usr/bin/mkdir -p '/sbin'
/usr/bin/install -c -p yast2 save_y2logs '/sbin'
/usr/bin/mkdir -p '/etc/bash_completion.d'
/usr/bin/install -c -p -m 644 yast2-completion.sh '/etc/bash_completion.d'
install -d -m 755 /usr/lib/YaST2/bin
ln -snf yast2 /sbin/zast2
ln -snf yast2 /sbin/YaST2
ln -snf yast2 /sbin/ZaST2
ln -snf yast2 /sbin/yast
ln -snf yast2 /sbin/zast
ln -snf yast2 /sbin/YaST
ln -snf yast2 /sbin/ZaST
/usr/bin/mkdir -p '/usr/lib/YaST2/bin'
/usr/bin/install -c -p yast2-funcs check-all-syntax '/usr/lib/YaST2/bin'
make[2]: Leaving directory
`<http://river.suse.de/job/yast-yast2-HEAD/ws/checkout/scripts'>
make[1]: Leaving directory
`<http://river.suse.de/job/yast-yast2-HEAD/ws/checkout/scripts'>
make[1]: Entering directory
`<http://river.suse.de/job/yast-yast2-HEAD/ws/checkout'>
make[2]: Entering directory
`<http://river.suse.de/job/yast-yast2-HEAD/ws/checkout'>
make[2]: Nothing to be done for `install-exec-am'.
mkdir -p /usr/share/doc/packages/yast2
/usr/bin/install -c -p -m 644
/usr/share/YaST2/data/devtools/admin/copyright/gpl/README
/usr/share/doc/packages/yast2
/usr/bin/install -c -p -m 644
/usr/share/YaST2/data/devtools/admin/copyright/gpl/COPYING
/usr/share/doc/packages/yast2
make[2]: Leaving directory
`<http://river.suse.de/job/yast-yast2-HEAD/ws/checkout'>
make[1]: Leaving directory
`<http://river.suse.de/job/yast-yast2-HEAD/ws/checkout'>
+ make check
Making check in data
make[1]: Entering directory
`<http://river.suse.de/job/yast-yast2-HEAD/ws/checkout/data'>
make[1]: Nothing to be done for `check'.
make[1]: Leaving directory
`<http://river.suse.de/job/yast-yast2-HEAD/ws/checkout/data'>
Making check in doc
make[1]: Entering directory
`<http://river.suse.de/job/yast-yast2-HEAD/ws/checkout/doc'>
Making check in autodocs
make[2]: Entering directory
`<http://river.suse.de/job/yast-yast2-HEAD/ws/checkout/doc/autodocs'>
make[2]: Nothing to be done for `check'.
make[2]: Leaving directory
`<http://river.suse.de/job/yast-yast2-HEAD/ws/checkout/doc/autodocs'>
Making check in examples
make[2]: Entering directory
`<http://river.suse.de/job/yast-yast2-HEAD/ws/checkout/doc/examples'>
make[2]: Nothing to be done for `check'.
make[2]: Leaving directory
`<http://river.suse.de/job/yast-yast2-HEAD/ws/checkout/doc/examples'>
Making check in screenshots
make[2]: Entering directory
`<http://river.suse.de/job/yast-yast2-HEAD/ws/checkout/doc/screenshots'>
make[2]: Nothing to be done for `check'.
make[2]: Leaving directory
`<http://river.suse.de/job/yast-yast2-HEAD/ws/checkout/doc/screenshots'>
make[2]: Entering directory
`<http://river.suse.de/job/yast-yast2-HEAD/ws/checkout/doc'>
make[2]: Nothing to be done for `check-am'.
make[2]: Leaving directory
`<http://river.suse.de/job/yast-yast2-HEAD/ws/checkout/doc'>
make[1]: Leaving directory
`<http://river.suse.de/job/yast-yast2-HEAD/ws/checkout/doc'>
Making check in library
make[1]: Entering directory
`<http://river.suse.de/job/yast-yast2-HEAD/ws/checkout/library'>
Making check in types
make[2]: Entering directory
`<http://river.suse.de/job/yast-yast2-HEAD/ws/checkout/library/types'>
Making check in src
make[3]: Entering directory
`<http://river.suse.de/job/yast-yast2-HEAD/ws/checkout/library/types/src'>
make[3]: Nothing to be done for `check'.
make[3]: Leaving directory
`<http://river.suse.de/job/yast-yast2-HEAD/ws/checkout/library/types/src'>
Making check in testsuite
make[3]: Entering directory
`<http://river.suse.de/job/yast-yast2-HEAD/ws/checkout/library/types/testsuite'>
make -f /usr/share/YaST2/data/testsuite/Makefile.testsuite RPMNAME=yast2
srcdir=.
make[4]: Entering directory
`<http://river.suse.de/job/yast-yast2-HEAD/ws/checkout/library/types/testsuite'>
make[4]: Nothing to be done for `all'.
make[4]: Leaving directory
`<http://river.suse.de/job/yast-yast2-HEAD/ws/checkout/library/types/testsuite'>
make check-DEJAGNU check-local
make[4]: Entering directory
`<http://river.suse.de/job/yast-yast2-HEAD/ws/checkout/library/types/testsuite'>
Making a new site.exp file ...
srcdir='.'; export srcdir; \
EXPECT=expect; export EXPECT; \
runtest=runtest; \
if /bin/sh -c "$runtest --version" > /dev/null 2>&1; then \
exit_status=0; l='yast2'; for tool in $l; do \
if $runtest --tool $tool --srcdir $srcdir ; \
then :; else exit_status=1; fi; \
done; \
else echo "WARNING: could not find 'runtest'" 1>&2; :;\
fi; \
exit $exit_status
WARNING: Couldn't find tool init file
Test Run By root on Thu Aug 22 12:54:26 2013
Native configuration is x86_64-suse-linux-gnu

=== yast2 tests ===

Schedule of variations:
unix

Running target unix
Using /usr/share/dejagnu/baseboards/unix.exp as board description file for
target.
Using /usr/share/dejagnu/config/unix.exp as generic interface file for target.
Using ./config/unix.exp as tool-and-target-specific interface file.
Running ./yast2.test/testsuite.exp ...

Checking started

Running Address ...
Running FindMountPoint ...
Running Hostname ...
Running IP ...
Running IPvalidation ...
Running Integer ...
Running Map ...
Running Netmask ...
Running String ...
Running URL ...
Running URLRecode ...
Running enumtype ...
Running isempty ...
Running regextype ...
Running undefinedtype ...

Checking finished


=== yast2 Summary ===

# of expected passes 15
make -f /usr/share/YaST2/data/testsuite/Makefile.testsuite RPMNAME=yast2
srcdir=. check
make[5]: Entering directory
`<http://river.suse.de/job/yast-yast2-HEAD/ws/checkout/library/types/testsuite'>

Parse YCP
NOT RUNNING

make[5]: Leaving directory
`<http://river.suse.de/job/yast-yast2-HEAD/ws/checkout/library/types/testsuite'>
make[4]: Leaving directory
`<http://river.suse.de/job/yast-yast2-HEAD/ws/checkout/library/types/testsuite'>
make[3]: Leaving directory
`<http://river.suse.de/job/yast-yast2-HEAD/ws/checkout/library/types/testsuite'>
Making check in doc
make[3]: Entering directory
`<http://river.suse.de/job/yast-yast2-HEAD/ws/checkout/library/types/doc'>
Making check in autodocs
make[4]: Entering directory
`<http://river.suse.de/job/yast-yast2-HEAD/ws/checkout/library/types/doc/autodocs'>
make[4]: Nothing to be done for `check'.
make[4]: Leaving directory
`<http://river.suse.de/job/yast-yast2-HEAD/ws/checkout/library/types/doc/autodocs'>
make[4]: Entering directory
`<http://river.suse.de/job/yast-yast2-HEAD/ws/checkout/library/types/doc'>
make[4]: Nothing to be done for `check-am'.
make[4]: Leaving directory
`<http://river.suse.de/job/yast-yast2-HEAD/ws/checkout/library/types/doc'>
make[3]: Leaving directory
`<http://river.suse.de/job/yast-yast2-HEAD/ws/checkout/library/types/doc'>
Making check in test
make[3]: Entering directory
`<http://river.suse.de/job/yast-yast2-HEAD/ws/checkout/library/types/test'>
make check-TESTS
make[4]: Entering directory
`<http://river.suse.de/job/yast-yast2-HEAD/ws/checkout/library/types/test'>
/usr/lib64/ruby/1.9.1/rubygems/custom_require.rb:36:in `require':
libpy2UI.so.2: cannot open shared object file: No such file or directory -
/usr/lib64/ruby/vendor_ruby/1.9.1/x86_64-linux/yastx.so (LoadError)
from /usr/lib64/ruby/1.9.1/rubygems/custom_require.rb:36:in `require'
from /usr/lib64/ruby/vendor_ruby/1.9.1/yast.rb:22:in `<top (required)>'
from /usr/lib64/ruby/1.9.1/rubygems/custom_require.rb:36:in `require'
from /usr/lib64/ruby/1.9.1/rubygems/custom_require.rb:36:in `require'
from ./ip_test.rb:5:in `<main>'
FAIL: ip_test.rb
==========================================
1 of 1 test failed
Please report to http://bugs.opensuse.org/
==========================================
make[4]: *** [check-TESTS] Error 1
make[4]: Leaving directory
`<http://river.suse.de/job/yast-yast2-HEAD/ws/checkout/library/types/test'>
make[3]: *** [check-am] Error 2
make[3]: Leaving directory
`<http://river.suse.de/job/yast-yast2-HEAD/ws/checkout/library/types/test'>
make[2]: *** [check-recursive] Error 1
make[2]: Leaving directory
`<http://river.suse.de/job/yast-yast2-HEAD/ws/checkout/library/types'>
make[1]: *** [check-recursive] Error 1
make[1]: Leaving directory
`<http://river.suse.de/job/yast-yast2-HEAD/ws/checkout/library'>
make: *** [check-recursive] Error 1
++ error_exit 2
++ echo 'ERROR: detected exitcode 2'
ERROR: detected exitcode 2
++ cleanup
++ echo '==> Running cleanup'
==> Running cleanup
++ rm -f
<http://river.suse.de/job/yast-yast2-HEAD/ws/ICECC/40c0ab7e54f59a1e4e493c1ea90a882a.tar.gz>
++ footer_and_exit 1
++ '[' -z 1 ']'
++ MYEXIT=1
++ '[' 1 == 0 ']'
++ ascii_failed
++ cat

( )
( ) (
) _ )
( \_
_(_\ \)__
(____\___))

build failed

++ exit 1
Build step 'Execute shell' marked build as failure
--
To unsubscribe, e-mail: yast-commit+unsubscribe@xxxxxxxxxxxx
For additional commands, e-mail: yast-commit+help@xxxxxxxxxxxx

< Previous Next >
This Thread
Follow Ups