Mailinglist Archive: yast-commit (306 mails)

< Previous Next >
[yast-commit] Build failed in Jenkins: yast-packager-HEAD #162
  • From: hudson@xxxxxxx
  • Date: Thu, 22 Aug 2013 09:12:51 +0200 (CEST)
  • Message-id: <1082005454.695.1377155571060.JavaMail.jenkins@river>
See <http://river.suse.de/job/yast-packager-HEAD/162/changes>

Changes:

[jsuchome] - use OSRelease instead of obsolete SuSERelease (bnc#833955)

------------------------------------------
[...truncated 189 lines...]
in file `../../src/modules/Packages.rb' near line 2096
[warn]: @param tag has unknown parameter name: re-initialize
in file `../../src/modules/Packages.rb' near line 2096
[warn]: @param tag has unknown parameter name: string
in file `../../src/modules/ProductLicense.rb' near line 128
[warn]: @param tag has unknown parameter name: string
in file `../../src/modules/ProductLicense.rb' near line 140
[warn]: @param tag has unknown parameter name: string
in file `../../src/modules/ProductLicense.rb' near line 462
[warn]: @param tag has unknown parameter name: string
in file `../../src/modules/ProductLicense.rb' near line 502
[warn]: @param tag has unknown parameter name: id,
in file `../../src/modules/ProductLicense.rb' near line 1189
[warn]: @param tag has unknown parameter name: src_id
in file `../../src/modules/ProductLicense.rb' near line 1299
[warn]: @param tag has unknown parameter name: XML
in file `../../src/modules/OneClickInstallStandard.rb' near line 47
[warn]: Unknown tag @ret in file `../../src/modules/CheckMedia.rb` near line 156
[warn]: Invalid tag format for @return in file
`../../src/modules/CheckMedia.rb` near line 174
[warn]: @param tag has unknown parameter name: desktop
in file `../../src/modules/DefaultDesktop.rb' near line 287
[warn]: @param tag has unknown parameter name: string
in file `../../src/modules/SourceManagerSLP.rb' near line 304
[warn]: @param tag has unknown parameter name: string
in file `../../src/modules/AddOnProduct.rb' near line 252
[warn]: @param tag has unknown parameter name: string
in file `../../src/modules/AddOnProduct.rb' near line 352
[warn]: @param tag has unknown parameter name: integer
in file `../../src/modules/AddOnProduct.rb' near line 756
[warn]: @param tag has unknown parameter name: integer
in file `../../src/modules/AddOnProduct.rb' near line 857
[warn]: @param tag has unknown parameter name:
in file `../../src/modules/AddOnProduct.rb' near line 1429
[warn]: @param tag has unknown parameter name: string
in file `../../src/modules/InstShowInfo.rb' near line 24
Files: 23
Modules: 7 ( 6 undocumented)
Classes: 17 ( 17 undocumented)
Constants: 17 ( 17 undocumented)
Methods: 470 ( 194 undocumented)
54.21% documented
make[2]: Leaving directory
`<http://river.suse.de/job/yast-packager-HEAD/ws/checkout/doc/autodocs'>
make[2]: Entering directory
`<http://river.suse.de/job/yast-packager-HEAD/ws/checkout/doc'>
make[2]: Nothing to be done for `all-am'.
make[2]: Leaving directory
`<http://river.suse.de/job/yast-packager-HEAD/ws/checkout/doc'>
make[1]: Leaving directory
`<http://river.suse.de/job/yast-packager-HEAD/ws/checkout/doc'>
Making all in src
make[1]: Entering directory
`<http://river.suse.de/job/yast-packager-HEAD/ws/checkout/src'>
make[1]: Nothing to be done for `all'.
make[1]: Leaving directory
`<http://river.suse.de/job/yast-packager-HEAD/ws/checkout/src'>
Making all in testsuite
make[1]: Entering directory
`<http://river.suse.de/job/yast-packager-HEAD/ws/checkout/testsuite'>
make -f /usr/share/YaST2/data/testsuite/Makefile.testsuite
RPMNAME=yast2-packager srcdir=.
make[2]: Entering directory
`<http://river.suse.de/job/yast-packager-HEAD/ws/checkout/testsuite'>
mkdir -p ./run ./config ./yast2-packager.test ./tests
cp -f /usr/share/YaST2/data/testsuite/skel/default.exp config/default.exp
cp -f /usr/share/YaST2/data/testsuite/skel/unix.exp config/unix.exp
cp -f /usr/share/YaST2/data/testsuite/skel/unknown.exp config/unknown.exp
cp -f /usr/share/YaST2/data/testsuite/skel/testsuite.exp
yast2-packager.test/testsuite.exp
cp -f /usr/share/YaST2/data/testsuite/skel/runtest.sh run/runtest.sh
chmod +x run/runtest.sh
make[2]: Leaving directory
`<http://river.suse.de/job/yast-packager-HEAD/ws/checkout/testsuite'>
make[1]: Leaving directory
`<http://river.suse.de/job/yast-packager-HEAD/ws/checkout/testsuite'>
make[1]: Entering directory
`<http://river.suse.de/job/yast-packager-HEAD/ws/checkout'>
make[1]: Nothing to be done for `all-am'.
make[1]: Leaving directory
`<http://river.suse.de/job/yast-packager-HEAD/ws/checkout'>
+ make install
Making install in doc
make[1]: Entering directory
`<http://river.suse.de/job/yast-packager-HEAD/ws/checkout/doc'>
Making install in autodocs
make[2]: Entering directory
`<http://river.suse.de/job/yast-packager-HEAD/ws/checkout/doc/autodocs'>
make[3]: Entering directory
`<http://river.suse.de/job/yast-packager-HEAD/ws/checkout/doc/autodocs'>
make[3]: Nothing to be done for `install-exec-am'.
/usr/bin/mkdir -p '/usr/share/doc/packages/yast2-packager//autodocs'
/usr/bin/mkdir -p '/usr/share/doc/packages/yast2-packager//autodocs/js'
/usr/bin/install -c -p -m 644 js/full_list.js js/jquery.js js/app.js
'/usr/share/doc/packages/yast2-packager//autodocs/js'
/usr/bin/install -c -p -m 644 index.html file_list.html class_list.html
Yast.html _index.html method_list.html top-level-namespace.html frames.html
'/usr/share/doc/packages/yast2-packager//autodocs/.'
/usr/bin/mkdir -p '/usr/share/doc/packages/yast2-packager//autodocs/Yast'
/usr/bin/install -c -p -m 644 Yast/KeyManagerClass.html
Yast/DefaultDesktopClass.html Yast/OneClickInstallStandardClass.html
Yast/ProductLicenseClass.html Yast/PackagerInstSourceDialogsInclude.html
Yast/SourceManagerSLPClass.html Yast/PackagesClass.html
Yast/AddOnProductClass.html Yast/PackageSlideShowClass.html
Yast/PackagerStorageIncludeInclude.html Yast/CheckmediaUiInclude.html
Yast/PackagerLoadReleaseNotesInclude.html Yast/SourceDialogsClass.html
Yast/PackagerKeyManagerDialogsInclude.html Yast/SpaceCalculationClass.html
Yast/InstShowInfoClass.html Yast/SlideShowCallbacksClass.html
Yast/InstURLClass.html Yast/PackagerRepositoriesIncludeInclude.html
Yast/PackageInstallationClass.html Yast/WebpinPackageSearchClass.html
Yast/SourceManagerClass.html Yast/CheckMediaClass.html
'/usr/share/doc/packages/yast2-packager//autodocs/Yast'
/usr/bin/mkdir -p '/usr/share/doc/packages/yast2-packager//autodocs/css'
/usr/bin/install -c -p -m 644 css/full_list.css css/style.css css/common.css
'/usr/share/doc/packages/yast2-packager//autodocs/css'
make[3]: Leaving directory
`<http://river.suse.de/job/yast-packager-HEAD/ws/checkout/doc/autodocs'>
make[2]: Leaving directory
`<http://river.suse.de/job/yast-packager-HEAD/ws/checkout/doc/autodocs'>
make[2]: Entering directory
`<http://river.suse.de/job/yast-packager-HEAD/ws/checkout/doc'>
make[3]: Entering directory
`<http://river.suse.de/job/yast-packager-HEAD/ws/checkout/doc'>
make[3]: Nothing to be done for `install-exec-am'.
make[3]: Leaving directory
`<http://river.suse.de/job/yast-packager-HEAD/ws/checkout/doc'>
make[2]: Leaving directory
`<http://river.suse.de/job/yast-packager-HEAD/ws/checkout/doc'>
make[1]: Leaving directory
`<http://river.suse.de/job/yast-packager-HEAD/ws/checkout/doc'>
Making install in src
make[1]: Entering directory
`<http://river.suse.de/job/yast-packager-HEAD/ws/checkout/src'>
make[2]: Entering directory
`<http://river.suse.de/job/yast-packager-HEAD/ws/checkout/src'>
make[2]: Nothing to be done for `install-exec-am'.
/usr/bin/mkdir -p '/usr/lib/YaST2/servers_non_y2'
/usr/bin/install -c -p servers_non_y2/ag_zypp_repos
'/usr/lib/YaST2/servers_non_y2'
/usr/bin/mkdir -p '/usr/share/YaST2/clients'
/usr/bin/install -c -p -m 644 clients/repositories.rb
clients/inst_check_memsize.rb clients/select_slp_source.rb
clients/software_simple_proposal.rb clients/inst_packages.rb
clients/key_manager.rb clients/wrapper_storage.rb clients/inst_checkmedia.rb
clients/inst_kickoff.rb clients/media_proposal.rb
clients/do_not_show_again_editor.rb clients/inst_rpmcopy.rb
clients/inst_custom_packages.rb clients/inst_productsources.rb
clients/inst_media.rb clients/software_proposal.rb clients/pkg_finish.rb
clients/inst_sw_select.rb clients/sw_single.rb
clients/add_inst_source_slptype.rb clients/inst_desktop.rb
clients/inst_mediacopy.rb clients/wrapper_slideshow_callbacks.rb
clients/webpin_package_search.rb clients/checkmedia.rb
'/usr/share/YaST2/clients'
/usr/bin/mkdir -p '/usr/share/applications/YaST2'
/usr/bin/install -c -p -m 644 desktop/sw_source.desktop
desktop/sw_single.desktop desktop/checkmedia.desktop
'/usr/share/applications/YaST2'
/usr/bin/mkdir -p '/usr/share/YaST2/modules'
/usr/bin/install -c -p -m 644 modules/InstShowInfo.rb
modules/DefaultDesktop.rb modules/PackageInstallation.rb
modules/PackageSlideShow.rb modules/ProductLicense.rb
modules/SpaceCalculation.rb modules/SourceManager.rb modules/AddOnProduct.rb
modules/InstURL.rb modules/OneClickInstallStandard.rb modules/Packages.rb
modules/SourceDialogs.rb modules/SourceManagerSLP.rb
modules/WebpinPackageSearch.rb modules/KeyManager.rb modules/CheckMedia.rb
modules/SlideShowCallbacks.rb '/usr/share/YaST2/modules'
/usr/bin/mkdir -p '/usr/share/YaST2/modules'
/usr/bin/install -c -p -m 644 modules/InstShowInfo.rb
modules/DefaultDesktop.rb modules/PackageInstallation.rb
modules/PackageSlideShow.rb modules/ProductLicense.rb
modules/SpaceCalculation.rb modules/SourceManager.rb modules/AddOnProduct.rb
modules/InstURL.rb modules/OneClickInstallStandard.rb modules/Packages.rb
modules/SourceDialogs.rb modules/SourceManagerSLP.rb
modules/WebpinPackageSearch.rb modules/KeyManager.rb modules/CheckMedia.rb
modules/SlideShowCallbacks.rb '/usr/share/YaST2/modules'
/usr/bin/mkdir -p '/usr/share/YaST2/scrconf'
/usr/bin/install -c -p -m 644 scrconf/etc_zypp_conf.scr scrconf/zypp_repos.scr
'/usr/share/YaST2/scrconf'
/usr/bin/mkdir -p '/usr/share/YaST2/include/checkmedia'
/usr/bin/install -c -p -m 644 include/checkmedia/ui.rb
'/usr/share/YaST2/include/checkmedia'
/usr/bin/mkdir -p '/usr/share/YaST2/include/packager'
/usr/bin/install -c -p -m 644 include/packager/key_manager_dialogs.rb
include/packager/storage_include.rb include/packager/inst_source_dialogs.rb
include/packager/load_release_notes.rb include/packager/repositories_include.rb
'/usr/share/YaST2/include/packager'
make[2]: Leaving directory
`<http://river.suse.de/job/yast-packager-HEAD/ws/checkout/src'>
make[1]: Leaving directory
`<http://river.suse.de/job/yast-packager-HEAD/ws/checkout/src'>
Making install in testsuite
make[1]: Entering directory
`<http://river.suse.de/job/yast-packager-HEAD/ws/checkout/testsuite'>
make -f /usr/share/YaST2/data/testsuite/Makefile.testsuite
RPMNAME=yast2-packager srcdir=.
make[2]: Entering directory
`<http://river.suse.de/job/yast-packager-HEAD/ws/checkout/testsuite'>
make[2]: Nothing to be done for `all'.
make[2]: Leaving directory
`<http://river.suse.de/job/yast-packager-HEAD/ws/checkout/testsuite'>
make[2]: Entering directory
`<http://river.suse.de/job/yast-packager-HEAD/ws/checkout/testsuite'>
make[2]: Nothing to be done for `install-exec-am'.
make[2]: Nothing to be done for `install-data-am'.
make[2]: Leaving directory
`<http://river.suse.de/job/yast-packager-HEAD/ws/checkout/testsuite'>
make[1]: Leaving directory
`<http://river.suse.de/job/yast-packager-HEAD/ws/checkout/testsuite'>
make[1]: Entering directory
`<http://river.suse.de/job/yast-packager-HEAD/ws/checkout'>
make[2]: Entering directory
`<http://river.suse.de/job/yast-packager-HEAD/ws/checkout'>
make[2]: Nothing to be done for `install-exec-am'.
mkdir -p /usr/share/doc/packages/yast2-packager
/usr/bin/install -c -p -m 644
/usr/share/YaST2/data/devtools/admin/copyright/gpl/README
/usr/share/doc/packages/yast2-packager
/usr/bin/install -c -p -m 644
/usr/share/YaST2/data/devtools/admin/copyright/gpl/COPYING
/usr/share/doc/packages/yast2-packager
make[2]: Leaving directory
`<http://river.suse.de/job/yast-packager-HEAD/ws/checkout'>
make[1]: Leaving directory
`<http://river.suse.de/job/yast-packager-HEAD/ws/checkout'>
+ make check
Making check in doc
make[1]: Entering directory
`<http://river.suse.de/job/yast-packager-HEAD/ws/checkout/doc'>
Making check in autodocs
make[2]: Entering directory
`<http://river.suse.de/job/yast-packager-HEAD/ws/checkout/doc/autodocs'>
make[2]: Nothing to be done for `check'.
make[2]: Leaving directory
`<http://river.suse.de/job/yast-packager-HEAD/ws/checkout/doc/autodocs'>
make[2]: Entering directory
`<http://river.suse.de/job/yast-packager-HEAD/ws/checkout/doc'>
make[2]: Nothing to be done for `check-am'.
make[2]: Leaving directory
`<http://river.suse.de/job/yast-packager-HEAD/ws/checkout/doc'>
make[1]: Leaving directory
`<http://river.suse.de/job/yast-packager-HEAD/ws/checkout/doc'>
Making check in src
make[1]: Entering directory
`<http://river.suse.de/job/yast-packager-HEAD/ws/checkout/src'>
make[1]: Nothing to be done for `check'.
make[1]: Leaving directory
`<http://river.suse.de/job/yast-packager-HEAD/ws/checkout/src'>
Making check in testsuite
make[1]: Entering directory
`<http://river.suse.de/job/yast-packager-HEAD/ws/checkout/testsuite'>
make -f /usr/share/YaST2/data/testsuite/Makefile.testsuite
RPMNAME=yast2-packager srcdir=.
make[2]: Entering directory
`<http://river.suse.de/job/yast-packager-HEAD/ws/checkout/testsuite'>
make[2]: Nothing to be done for `all'.
make[2]: Leaving directory
`<http://river.suse.de/job/yast-packager-HEAD/ws/checkout/testsuite'>
make check-DEJAGNU check-local
make[2]: Entering directory
`<http://river.suse.de/job/yast-packager-HEAD/ws/checkout/testsuite'>
Making a new site.exp file ...
srcdir='.'; export srcdir; \
EXPECT=expect; export EXPECT; \
runtest=runtest; \
if /bin/sh -c "$runtest --version" > /dev/null 2>&1; then \
exit_status=0; l='yast2-packager'; for tool in $l; do \
if $runtest --tool $tool --srcdir $srcdir ; \
then :; else exit_status=1; fi; \
done; \
else echo "WARNING: could not find 'runtest'" 1>&2; :;\
fi; \
exit $exit_status
WARNING: Couldn't find tool init file
Test Run By root on Thu Aug 22 09:12:43 2013
Native configuration is x86_64-suse-linux-gnu

=== yast2-packager tests ===

Schedule of variations:
unix

Running target unix
Using /usr/share/dejagnu/baseboards/unix.exp as board description file for
target.
Using /usr/share/dejagnu/config/unix.exp as generic interface file for target.
Using ./config/unix.exp as tool-and-target-specific interface file.
Running ./yast2-packager.test/testsuite.exp ...

Checking started

Running AddOnProduct_test ...
Running DefaultDesktop ...
Running PackageSlideShow ...
Running Packages ...
FAIL: Wrong stdout for Packages

The diff follows...

--- tests/Packages.out 2013-01-22 11:40:37.000000000 +0100
+++ tmp.out.Packages 2013-08-22 09:12:47.000000000 +0200
@@ -9,8 +9,6 @@
Read .sysconfig.language.ROOT_USES_LANG "ctype"
Read .sysconfig.language.RC_LANG "en_US.UTF-8"
Read .sysconfig.language.INSTALLED_LANGUAGES ""
-Read .target.string ["//etc/SuSE-release", "?"] "SUSE Linux Enterprise
Server 11 (x86_64)\nVERSION = 11\nPATCHLEVEL = 1\n"
-Read .target.string ["//etc/SuSE-release", "?"] "SUSE Linux Enterprise
Server 11 (x86_64)\nVERSION = 11\nPATCHLEVEL = 1\n"
Dump ----- biosdevname tests -----
Read .target.string "/proc/cmdline" "install=cd:// vga=0x314 biosdevname=1"
Return ["biosdevname"]

FAIL: Wrong stdout for Packages
See the diff above.
Running SpaceCalculation ...
Running insturl-cd ...
Running insturl-ftp ...
Running insturl-http ...
Running insturl-iso ...
Running insturl-ops ...
Running insturl-smb ...

Checking finished


=== yast2-packager Summary ===

# of expected passes 10
# of unexpected failures 2
make[2]: *** [check-DEJAGNU] Error 1
make[2]: Leaving directory
`<http://river.suse.de/job/yast-packager-HEAD/ws/checkout/testsuite'>
make[1]: *** [check-am] Error 2
make[1]: Leaving directory
`<http://river.suse.de/job/yast-packager-HEAD/ws/checkout/testsuite'>
make: *** [check-recursive] Error 1
++ error_exit 2
++ echo 'ERROR: detected exitcode 2'
ERROR: detected exitcode 2
++ cleanup
++ echo '==> Running cleanup'
==> Running cleanup
++ rm -f
<http://river.suse.de/job/yast-packager-HEAD/ws/ICECC/40c0ab7e54f59a1e4e493c1ea90a882a.tar.gz>
++ footer_and_exit 1
++ '[' -z 1 ']'
++ MYEXIT=1
++ '[' 1 == 0 ']'
++ ascii_failed
++ cat

( )
( ) (
) _ )
( \_
_(_\ \)__
(____\___))

build failed

++ exit 1
Build step 'Execute shell' marked build as failure
--
To unsubscribe, e-mail: yast-commit+unsubscribe@xxxxxxxxxxxx
For additional commands, e-mail: yast-commit+help@xxxxxxxxxxxx

< Previous Next >
This Thread
Follow Ups