Mailinglist Archive: yast-commit (306 mails)

< Previous Next >
[yast-commit] Build failed in Jenkins: yast-libstorage-HEAD #56
  • From: hudson@xxxxxxx
  • Date: Mon, 12 Aug 2013 17:38:47 +0200 (CEST)
  • Message-id: <482093447.582.1376321927514.JavaMail.jenkins@river>
See <http://river.suse.de/job/yast-libstorage-HEAD/56/>

------------------------------------------
[...truncated 846 lines...]
<http://river.suse.de/job/yast-libstorage-HEAD/ws/checkout/storage/StorageInterface.h>:574:
warning: Member target (variable) of class storage::DmInfo is not documented.
<http://river.suse.de/job/yast-libstorage-HEAD/ws/checkout/storage/StorageInterface.h>:583:
warning: Member v (variable) of class storage::DmPartInfo is not documented.
<http://river.suse.de/job/yast-libstorage-HEAD/ws/checkout/storage/StorageInterface.h>:584:
warning: Member p (variable) of class storage::DmPartInfo is not documented.
<http://river.suse.de/job/yast-libstorage-HEAD/ws/checkout/storage/StorageInterface.h>:585:
warning: Member part (variable) of class storage::DmPartInfo is not documented.
<http://river.suse.de/job/yast-libstorage-HEAD/ws/checkout/storage/StorageInterface.h>:586:
warning: Member table (variable) of class storage::DmPartInfo is not
documented.
<http://river.suse.de/job/yast-libstorage-HEAD/ws/checkout/storage/StorageInterface.h>:587:
warning: Member target (variable) of class storage::DmPartInfo is not
documented.
<http://river.suse.de/job/yast-libstorage-HEAD/ws/checkout/storage/StorageInterface.h>:596:
warning: Member p (variable) of class storage::DmraidInfo is not documented.
<http://river.suse.de/job/yast-libstorage-HEAD/ws/checkout/storage/StorageInterface.h>:605:
warning: Member p (variable) of class storage::DmmultipathInfo is not
documented.
<http://river.suse.de/job/yast-libstorage-HEAD/ws/checkout/storage/StorageInterface.h>:614:
warning: Member ctype (variable) of class storage::ContVolInfo is not
documented.
<http://river.suse.de/job/yast-libstorage-HEAD/ws/checkout/storage/StorageInterface.h>:615:
warning: Member cname (variable) of class storage::ContVolInfo is not
documented.
<http://river.suse.de/job/yast-libstorage-HEAD/ws/checkout/storage/StorageInterface.h>:616:
warning: Member cdevice (variable) of class storage::ContVolInfo is not
documented.
<http://river.suse.de/job/yast-libstorage-HEAD/ws/checkout/storage/StorageInterface.h>:617:
warning: Member vname (variable) of class storage::ContVolInfo is not
documented.
<http://river.suse.de/job/yast-libstorage-HEAD/ws/checkout/storage/StorageInterface.h>:618:
warning: Member vdevice (variable) of class storage::ContVolInfo is not
documented.
<http://river.suse.de/job/yast-libstorage-HEAD/ws/checkout/storage/StorageInterface.h>:619:
warning: Member num (variable) of class storage::ContVolInfo is not documented.
<http://river.suse.de/job/yast-libstorage-HEAD/ws/checkout/storage/StorageInterface.h>:628:
warning: Member cylStart (variable) of class storage::PartitionSlotInfo is not
documented.
<http://river.suse.de/job/yast-libstorage-HEAD/ws/checkout/storage/StorageInterface.h>:629:
warning: Member cylSize (variable) of class storage::PartitionSlotInfo is not
documented.
<http://river.suse.de/job/yast-libstorage-HEAD/ws/checkout/storage/StorageInterface.h>:630:
warning: Member primarySlot (variable) of class storage::PartitionSlotInfo is
not documented.
<http://river.suse.de/job/yast-libstorage-HEAD/ws/checkout/storage/StorageInterface.h>:631:
warning: Member primaryPossible (variable) of class storage::PartitionSlotInfo
is not documented.
<http://river.suse.de/job/yast-libstorage-HEAD/ws/checkout/storage/StorageInterface.h>:632:
warning: Member extendedSlot (variable) of class storage::PartitionSlotInfo is
not documented.
<http://river.suse.de/job/yast-libstorage-HEAD/ws/checkout/storage/StorageInterface.h>:633:
warning: Member extendedPossible (variable) of class
storage::PartitionSlotInfo is not documented.
<http://river.suse.de/job/yast-libstorage-HEAD/ws/checkout/storage/StorageInterface.h>:634:
warning: Member logicalSlot (variable) of class storage::PartitionSlotInfo is
not documented.
<http://river.suse.de/job/yast-libstorage-HEAD/ws/checkout/storage/StorageInterface.h>:635:
warning: Member logicalPossible (variable) of class storage::PartitionSlotInfo
is not documented.
<http://river.suse.de/job/yast-libstorage-HEAD/ws/checkout/storage/StorageInterface.h>:644:
warning: Member destructive (variable) of class storage::CommitInfo is not
documented.
<http://river.suse.de/job/yast-libstorage-HEAD/ws/checkout/storage/StorageInterface.h>:645:
warning: Member text (variable) of class storage::CommitInfo is not documented.
<http://river.suse.de/job/yast-libstorage-HEAD/ws/checkout/storage/StorageInterface.h>:2251:
warning: argument 'sizeK' of command @param is not found in the argument list
of storage::StorageInterface::checkNfsDevice(const string &nfsDev, const string
&opts, bool nfs4, unsigned long long &SWIG_OUTPUTsizeK)
<http://river.suse.de/job/yast-libstorage-HEAD/ws/checkout/storage/StorageInterface.h>:2251:
warning: The following parameters of
storage::StorageInterface::checkNfsDevice(const string &nfsDev, const string
&opts, bool nfs4, unsigned long long &SWIG_OUTPUTsizeK) are not documented:
parameter 'SWIG_OUTPUT'
<http://river.suse.de/job/yast-libstorage-HEAD/ws/checkout/storage/StorageInterface.h>:2201:
warning: argument 'sizeK' of command @param is not found in the argument list
of storage::StorageInterface::computeMdSize(MdType md_type, const list< string
&devices, const list< string > &spares, unsigned long long &SWIG_OUTPUTsizeK)
<http://river.suse.de/job/yast-libstorage-HEAD/ws/checkout/storage/StorageInterface.h>:2201:
warning: The following parameters of
storage::StorageInterface::computeMdSize(MdType md_type, const list< string >
&devices, const list< string > &spares, unsigned long long &SWIG_OUTPUTsizeK)
are not documented:
parameter 'SWIG_OUTPUT'
<http://river.suse.de/job/yast-libstorage-HEAD/ws/checkout/storage/StorageInterface.h>:2263:
warning: argument 'device' of command @param is not found in the argument list
of storage::StorageInterface::createFileLoop(const string &lname, bool
reuseExisting, unsigned long long sizeK, const string &mp, const string &pwd,
string &SWIG_OUTPUTdevice)
<http://river.suse.de/job/yast-libstorage-HEAD/ws/checkout/storage/StorageInterface.h>:2263:
warning: The following parameters of
storage::StorageInterface::createFileLoop(const string &lname, bool
reuseExisting, unsigned long long sizeK, const string &mp, const string &pwd,
string &SWIG_OUTPUTdevice) are not documented:
parameter 'SWIG_OUTPUT'
<http://river.suse.de/job/yast-libstorage-HEAD/ws/checkout/storage/StorageInterface.h>:1927:
warning: argument 'device' of command @param is not found in the argument list
of storage::StorageInterface::createLvmLv(const string &vg, const string &name,
unsigned long long sizeK, unsigned stripes, string &SWIG_OUTPUTdevice)
<http://river.suse.de/job/yast-libstorage-HEAD/ws/checkout/storage/StorageInterface.h>:1927:
warning: The following parameters of
storage::StorageInterface::createLvmLv(const string &vg, const string &name,
unsigned long long sizeK, unsigned stripes, string &SWIG_OUTPUTdevice) are not
documented:
parameter 'SWIG_OUTPUT'
<http://river.suse.de/job/yast-libstorage-HEAD/ws/checkout/storage/StorageInterface.h>:2019:
warning: argument 'device' of command @param is not found in the argument list
of storage::StorageInterface::createLvmLvPool(const string &vg, const string
&name, unsigned long long sizeK, string &SWIG_OUTPUTdevice)
<http://river.suse.de/job/yast-libstorage-HEAD/ws/checkout/storage/StorageInterface.h>:2019:
warning: The following parameters of
storage::StorageInterface::createLvmLvPool(const string &vg, const string
&name, unsigned long long sizeK, string &SWIG_OUTPUTdevice) are not documented:
parameter 'SWIG_OUTPUT'
<http://river.suse.de/job/yast-libstorage-HEAD/ws/checkout/storage/StorageInterface.h>:1983:
warning: argument 'device' of command @param is not found in the argument list
of storage::StorageInterface::createLvmLvSnapshot(const string &vg, const
string &origin, const string &name, unsigned long long cowSizeK, string
&SWIG_OUTPUTdevice)
<http://river.suse.de/job/yast-libstorage-HEAD/ws/checkout/storage/StorageInterface.h>:1983:
warning: The following parameters of
storage::StorageInterface::createLvmLvSnapshot(const string &vg, const string
&origin, const string &name, unsigned long long cowSizeK, string
&SWIG_OUTPUTdevice) are not documented:
parameter 'SWIG_OUTPUT'
<http://river.suse.de/job/yast-libstorage-HEAD/ws/checkout/storage/StorageInterface.h>:2032:
warning: argument 'device' of command @param is not found in the argument list
of storage::StorageInterface::createLvmLvThin(const string &vg, const string
&name, const string &pool, unsigned long long sizeK, string &SWIG_OUTPUTdevice)
<http://river.suse.de/job/yast-libstorage-HEAD/ws/checkout/storage/StorageInterface.h>:2032:
warning: The following parameters of
storage::StorageInterface::createLvmLvThin(const string &vg, const string
&name, const string &pool, unsigned long long sizeK, string &SWIG_OUTPUTdevice)
are not documented:
parameter 'SWIG_OUTPUT'
<http://river.suse.de/job/yast-libstorage-HEAD/ws/checkout/storage/StorageInterface.h>:2081:
warning: argument 'device' of command @param is not found in the argument list
of storage::StorageInterface::createMdAny(MdType md_type, const list< string >
&devices, const list< string > &spares, string &SWIG_OUTPUTdevice)
<http://river.suse.de/job/yast-libstorage-HEAD/ws/checkout/storage/StorageInterface.h>:2081:
warning: The following parameters of
storage::StorageInterface::createMdAny(MdType md_type, const list< string >
&devices, const list< string > &spares, string &SWIG_OUTPUTdevice) are not
documented:
parameter 'SWIG_OUTPUT'
<http://river.suse.de/job/yast-libstorage-HEAD/ws/checkout/storage/StorageInterface.h>:1207:
warning: argument 'device' of command @param is not found in the argument list
of storage::StorageInterface::createPartition(const string &disk, PartitionType
type, unsigned long startCyl, unsigned long sizeCyl, string &SWIG_OUTPUTdevice)
<http://river.suse.de/job/yast-libstorage-HEAD/ws/checkout/storage/StorageInterface.h>:1207:
warning: The following parameters of
storage::StorageInterface::createPartition(const string &disk, PartitionType
type, unsigned long startCyl, unsigned long sizeCyl, string &SWIG_OUTPUTdevice)
are not documented:
parameter 'SWIG_OUTPUT'
<http://river.suse.de/job/yast-libstorage-HEAD/ws/checkout/storage/StorageInterface.h>:1302:
warning: argument 'device' of command @param is not found in the argument list
of storage::StorageInterface::createPartitionAny(const string &disk, unsigned
long long sizeK, string &SWIG_OUTPUTdevice)
<http://river.suse.de/job/yast-libstorage-HEAD/ws/checkout/storage/StorageInterface.h>:1302:
warning: The following parameters of
storage::StorageInterface::createPartitionAny(const string &disk, unsigned long
long sizeK, string &SWIG_OUTPUTdevice) are not documented:
parameter 'SWIG_OUTPUT'
<http://river.suse.de/job/yast-libstorage-HEAD/ws/checkout/storage/StorageInterface.h>:1285:
warning: argument 'device' of command @param is not found in the argument list
of storage::StorageInterface::createPartitionKb(const string &disk,
PartitionType type, unsigned long long startK, unsigned long long sizeK, string
&SWIG_OUTPUTdevice)
<http://river.suse.de/job/yast-libstorage-HEAD/ws/checkout/storage/StorageInterface.h>:1285:
warning: The following parameters of
storage::StorageInterface::createPartitionKb(const string &disk, PartitionType
type, unsigned long long startK, unsigned long long sizeK, string
&SWIG_OUTPUTdevice) are not documented:
parameter 'SWIG_OUTPUT'
<http://river.suse.de/job/yast-libstorage-HEAD/ws/checkout/storage/StorageInterface.h>:1316:
warning: argument 'device' of command @param is not found in the argument list
of storage::StorageInterface::createPartitionMax(const string &disk,
PartitionType type, string &SWIG_OUTPUTdevice)
<http://river.suse.de/job/yast-libstorage-HEAD/ws/checkout/storage/StorageInterface.h>:1316:
warning: The following parameters of
storage::StorageInterface::createPartitionMax(const string &disk, PartitionType
type, string &SWIG_OUTPUTdevice) are not documented:
parameter 'SWIG_OUTPUT'
<http://river.suse.de/job/yast-libstorage-HEAD/ws/checkout/storage/StorageInterface.h>:1260:
warning: argument 'freeCylsBefore' of command @param is not found in the
argument list of storage::StorageInterface::freeCylindersAroundPartition(const
string &device, unsigned long &SWIG_OUTPUTfreeCylsBefore, unsigned long
&SWIG_OUTPUTfreeCylsAfter)
<http://river.suse.de/job/yast-libstorage-HEAD/ws/checkout/storage/StorageInterface.h>:1260:
warning: argument 'freeCylsAfter' of command @param is not found in the
argument list of storage::StorageInterface::freeCylindersAroundPartition(const
string &device, unsigned long &SWIG_OUTPUTfreeCylsBefore, unsigned long
&SWIG_OUTPUTfreeCylsAfter)
<http://river.suse.de/job/yast-libstorage-HEAD/ws/checkout/storage/StorageInterface.h>:1260:
warning: The following parameters of
storage::StorageInterface::freeCylindersAroundPartition(const string &device,
unsigned long &SWIG_OUTPUTfreeCylsBefore, unsigned long
&SWIG_OUTPUTfreeCylsAfter) are not documented:
parameter 'SWIG_OUTPUT'
parameter 'SWIG_OUTPUT'
<http://river.suse.de/job/yast-libstorage-HEAD/ws/checkout/storage/StorageInterface.h>:1619:
warning: argument 'val' of command @param is not found in the argument list of
storage::StorageInterface::getCrypt(const string &device, bool &SWIG_OUTPUTval)
<http://river.suse.de/job/yast-libstorage-HEAD/ws/checkout/storage/StorageInterface.h>:1619:
warning: The following parameters of storage::StorageInterface::getCrypt(const
string &device, bool &SWIG_OUTPUTval) are not documented:
parameter 'SWIG_OUTPUT'
<http://river.suse.de/job/yast-libstorage-HEAD/ws/checkout/storage/StorageInterface.h>:1571:
warning: argument 'pwd' of command @param is not found in the argument list of
storage::StorageInterface::getCryptPassword(const string &device, string
&SWIG_OUTPUTpwd)
<http://river.suse.de/job/yast-libstorage-HEAD/ws/checkout/storage/StorageInterface.h>:1571:
warning: The following parameters of
storage::StorageInterface::getCryptPassword(const string &device, string
&SWIG_OUTPUTpwd) are not documented:
parameter 'SWIG_OUTPUT'
<http://river.suse.de/job/yast-libstorage-HEAD/ws/checkout/storage/StorageInterface.h>:1521:
warning: argument 'options' of command @param is not found in the argument
list of storage::StorageInterface::getFstabOptions(const string &device, string
&SWIG_OUTPUToptions)
<http://river.suse.de/job/yast-libstorage-HEAD/ws/checkout/storage/StorageInterface.h>:1521:
warning: The following parameters of
storage::StorageInterface::getFstabOptions(const string &device, string
&SWIG_OUTPUToptions) are not documented:
parameter 'SWIG_OUTPUT'
<http://river.suse.de/job/yast-libstorage-HEAD/ws/checkout/storage/StorageInterface.h>:1639:
warning: argument 'val' of command @param is not found in the argument list of
storage::StorageInterface::getIgnoreFstab(const string &device, bool
&SWIG_OUTPUTval)
<http://river.suse.de/job/yast-libstorage-HEAD/ws/checkout/storage/StorageInterface.h>:1639:
warning: The following parameters of
storage::StorageInterface::getIgnoreFstab(const string &device, bool
&SWIG_OUTPUTval) are not documented:
parameter 'SWIG_OUTPUT'
<http://river.suse.de/job/yast-libstorage-HEAD/ws/checkout/storage/StorageInterface.h>:1500:
warning: argument 'mby' of command @param is not found in the argument list of
storage::StorageInterface::getMountBy(const string &device, MountByType
&SWIG_OUTPUTmby)
<http://river.suse.de/job/yast-libstorage-HEAD/ws/checkout/storage/StorageInterface.h>:1500:
warning: The following parameters of
storage::StorageInterface::getMountBy(const string &device, MountByType
&SWIG_OUTPUTmby) are not documented:
parameter 'SWIG_OUTPUT'
<http://river.suse.de/job/yast-libstorage-HEAD/ws/checkout/storage/StorageInterface.h>:1481:
warning: argument 'mount' of command @param is not found in the argument list
of storage::StorageInterface::getMountPoint(const string &device, string
&SWIG_OUTPUTmount)
<http://river.suse.de/job/yast-libstorage-HEAD/ws/checkout/storage/StorageInterface.h>:1481:
warning: The following parameters of
storage::StorageInterface::getMountPoint(const string &device, string
&SWIG_OUTPUTmount) are not documented:
parameter 'SWIG_OUTPUT'
<http://river.suse.de/job/yast-libstorage-HEAD/ws/checkout/storage/StorageInterface.h>:2059:
warning: argument 'nr' of command @param is not found in the argument list of
storage::StorageInterface::nextFreeMd(unsigned &SWIG_OUTPUTnr, string
&SWIG_OUTPUTdevice)
<http://river.suse.de/job/yast-libstorage-HEAD/ws/checkout/storage/StorageInterface.h>:2059:
warning: argument 'device' of command @param is not found in the argument list
of storage::StorageInterface::nextFreeMd(unsigned &SWIG_OUTPUTnr, string
&SWIG_OUTPUTdevice)
<http://river.suse.de/job/yast-libstorage-HEAD/ws/checkout/storage/StorageInterface.h>:2059:
warning: The following parameters of
storage::StorageInterface::nextFreeMd(unsigned &SWIG_OUTPUTnr, string
&SWIG_OUTPUTdevice) are not documented:
parameter 'SWIG_OUTPUT'
parameter 'SWIG_OUTPUT'
<http://river.suse.de/job/yast-libstorage-HEAD/ws/checkout/storage/StorageInterface.h>:1272:
warning: argument 'nr' of command @param is not found in the argument list of
storage::StorageInterface::nextFreePartition(const string &disk, PartitionType
type, unsigned &SWIG_OUTPUTnr, string &SWIG_OUTPUTdevice)
<http://river.suse.de/job/yast-libstorage-HEAD/ws/checkout/storage/StorageInterface.h>:1272:
warning: argument 'device' of command @param is not found in the argument list
of storage::StorageInterface::nextFreePartition(const string &disk,
PartitionType type, unsigned &SWIG_OUTPUTnr, string &SWIG_OUTPUTdevice)
<http://river.suse.de/job/yast-libstorage-HEAD/ws/checkout/storage/StorageInterface.h>:1272:
warning: The following parameters of
storage::StorageInterface::nextFreePartition(const string &disk, PartitionType
type, unsigned &SWIG_OUTPUTnr, string &SWIG_OUTPUTdevice) are not documented:
parameter 'SWIG_OUTPUT'
parameter 'SWIG_OUTPUT'
<http://river.suse.de/job/yast-libstorage-HEAD/ws/checkout/storage/StorageInterface.h>:2829:
warning: Member Environment(bool readonly, const string
&logdr="/var/log/YaST2") (function) of class storage::Environment is not
documented.
<http://river.suse.de/job/yast-libstorage-HEAD/ws/checkout/storage/StorageInterface.h>:2833:
warning: Member readonly (variable) of class storage::Environment is not
documented.
<http://river.suse.de/job/yast-libstorage-HEAD/ws/checkout/storage/StorageInterface.h>:2834:
warning: Member testmode (variable) of class storage::Environment is not
documented.
<http://river.suse.de/job/yast-libstorage-HEAD/ws/checkout/storage/StorageInterface.h>:2835:
warning: Member autodetect (variable) of class storage::Environment is not
documented.
<http://river.suse.de/job/yast-libstorage-HEAD/ws/checkout/storage/StorageInterface.h>:2836:
warning: Member instsys (variable) of class storage::Environment is not
documented.
<http://river.suse.de/job/yast-libstorage-HEAD/ws/checkout/storage/StorageInterface.h>:2837:
warning: Member logdir (variable) of class storage::Environment is not
documented.
<http://river.suse.de/job/yast-libstorage-HEAD/ws/checkout/storage/StorageInterface.h>:2838:
warning: Member testdir (variable) of class storage::Environment is not
documented.
<http://river.suse.de/job/yast-libstorage-HEAD/ws/checkout/storage/StorageInterface.h>:75:
warning: unable to resolve link to
`storage::StorageInterface::createStorageInterface()' for \link command

Generating docs for compound storage::MdPartInfo...
Generating docs for compound storage::NfsInfo...
Generating docs for compound storage::LoopInfo...
Generating docs for compound storage::BtrfsInfo...
Generating docs for compound storage::TmpfsInfo...
Generating docs for compound storage::DmInfo...
Generating docs for compound storage::DmPartInfo...
Generating docs for compound storage::DmraidInfo...
Generating docs for compound storage::DmmultipathInfo...
Generating docs for compound storage::ContVolInfo...
Generating docs for compound storage::PartitionSlotInfo...
Generating docs for compound storage::CommitInfo...
Generating docs for compound storage::StorageInterface...
Generating docs for compound storage::Environment...
Generating graph info page...
Generating directory documentation...
Generating index page...
Generating page index...
Generating module index...
Generating namespace index...
Generating namespace member index...
Generating annotated compound index...
Generating alphabetical compound index...
Generating hierarchical class index...
Generating member index...
Generating file index...
Generating file member index...
Generating example index...
finalizing index lists...
symbol cache used 812/65536 hits=20764 misses=812
lookup cache used 1050/65536 hits=4436 misses=1119
finished...
make[3]: Leaving directory
`<http://river.suse.de/job/yast-libstorage-HEAD/ws/checkout/doc/autodocs'>
make[3]: Entering directory
`<http://river.suse.de/job/yast-libstorage-HEAD/ws/checkout/doc'>
make[3]: Nothing to be done for `all-am'.
make[3]: Leaving directory
`<http://river.suse.de/job/yast-libstorage-HEAD/ws/checkout/doc'>
make[2]: Leaving directory
`<http://river.suse.de/job/yast-libstorage-HEAD/ws/checkout/doc'>
Making all in bindings
make[2]: Entering directory
`<http://river.suse.de/job/yast-libstorage-HEAD/ws/checkout/bindings'>
Making all in python
make[3]: Entering directory
`<http://river.suse.de/job/yast-libstorage-HEAD/ws/checkout/bindings/python'>
Making all in examples
make[4]: Entering directory
`<http://river.suse.de/job/yast-libstorage-HEAD/ws/checkout/bindings/python/examples'>
make[4]: Nothing to be done for `all'.
make[4]: Leaving directory
`<http://river.suse.de/job/yast-libstorage-HEAD/ws/checkout/bindings/python/examples'>
make[4]: Entering directory
`<http://river.suse.de/job/yast-libstorage-HEAD/ws/checkout/bindings/python'>
/bin/sh ../../libtool --tag=CXX --mode=compile /opt/icecream/bin/g++
-DHAVE_CONFIG_H -I. -I../.. -I. -I../.. -I/usr/include/python2.7 -fPIC -DPIC
-g -O2 -std=c++0x -DHAVE_CXX0X -Wall -Wextra -Wformat=2 -Wnon-virtual-dtor
-Wno-unused-parameter -MT libstorage_wrap.lo -MD -MP -MF
.deps/libstorage_wrap.Tpo -c -o libstorage_wrap.lo libstorage_wrap.cxx
libtool: compile: /opt/icecream/bin/g++ -DHAVE_CONFIG_H -I. -I../.. -I.
-I../.. -I/usr/include/python2.7 -fPIC -DPIC -g -O2 -std=c++0x -DHAVE_CXX0X
-Wall -Wextra -Wformat=2 -Wnon-virtual-dtor -Wno-unused-parameter -MT
libstorage_wrap.lo -MD -MP -MF .deps/libstorage_wrap.Tpo -c libstorage_wrap.cxx
-fPIC -DPIC -o .libs/libstorage_wrap.o
libstorage_wrap.cxx: In function 'void init_libstorage()':
libstorage_wrap.cxx:58815:21: warning: variable 'md' set but not used
[-Wunused-but-set-variable]
mv -f .deps/libstorage_wrap.Tpo .deps/libstorage_wrap.Plo
/bin/sh ../../libtool --tag=CXX --mode=link /opt/icecream/bin/g++ -fPIC
-DPIC -g -O2 -std=c++0x -DHAVE_CXX0X -Wall -Wextra -Wformat=2
-Wnon-virtual-dtor -Wno-unused-parameter -module -avoid-version -o
_libstorage.la -rpath /usr/lib64/python2.7/site-packages libstorage_wrap.lo
../../storage/libstorage.la
libtool: link: warning:
`/usr/lib64/gcc/x86_64-suse-linux/4.7/../../../../lib64/libxml2.la' seems to be
moved
libtool: link: rm -fr .libs/_libstorage.la .libs/_libstorage.lai
.libs/_libstorage.so .libs/_libstorage.soT
libtool: link: /opt/icecream/bin/g++ -fPIC -DPIC -shared -nostdlib
/usr/lib64/gcc/x86_64-suse-linux/4.7/../../../../lib64/crti.o
/usr/lib64/gcc/x86_64-suse-linux/4.7/crtbeginS.o .libs/libstorage_wrap.o
-Wl,-rpath
-Wl,<http://river.suse.de/job/yast-libstorage-HEAD/ws/checkout/storage/.libs>
-Wl,-rpath -Wl,/usr/lib64 -Wl,-rpath -Wl,/usr/lib64
../../storage/.libs/libstorage.so
-L/usr/lib64/gcc/x86_64-suse-linux/4.7/../../../../lib64 /usr/lib64/libxml2.so
-ldl -lz -llzma -L/usr/lib64/gcc/x86_64-suse-linux/4.7 -L/lib/../lib64
-L/usr/lib/../lib64
-L/usr/lib64/gcc/x86_64-suse-linux/4.7/../../../../x86_64-suse-linux/lib
-L/usr/lib64/gcc/x86_64-suse-linux/4.7/../../.. -lstdc++ -lm -lc -lgcc_s
/usr/lib64/gcc/x86_64-suse-linux/4.7/crtendS.o
/usr/lib64/gcc/x86_64-suse-linux/4.7/../../../../lib64/crtn.o -O2
-Wl,-soname -Wl,_libstorage.so -o .libs/_libstorage.so
libtool: link: ( cd ".libs" && rm -f "_libstorage.la" && ln -s
"../_libstorage.la" "_libstorage.la" )
make[4]: Leaving directory
`<http://river.suse.de/job/yast-libstorage-HEAD/ws/checkout/bindings/python'>
make[3]: Leaving directory
`<http://river.suse.de/job/yast-libstorage-HEAD/ws/checkout/bindings/python'>
Making all in ruby
make[3]: Entering directory
`<http://river.suse.de/job/yast-libstorage-HEAD/ws/checkout/bindings/ruby'>
make all-recursive
make[4]: Entering directory
`<http://river.suse.de/job/yast-libstorage-HEAD/ws/checkout/bindings/ruby'>
Making all in examples
make[5]: Entering directory
`<http://river.suse.de/job/yast-libstorage-HEAD/ws/checkout/bindings/ruby/examples'>
make[5]: Nothing to be done for `all'.
make[5]: Leaving directory
`<http://river.suse.de/job/yast-libstorage-HEAD/ws/checkout/bindings/ruby/examples'>
make[5]: Entering directory
`<http://river.suse.de/job/yast-libstorage-HEAD/ws/checkout/bindings/ruby'>
/bin/sh ../../libtool --tag=CXX --mode=compile /opt/icecream/bin/g++
-DHAVE_CONFIG_H -I. -I../.. -I../.. -I/usr/include/ruby-1.9.1
-I/usr/include/ruby-1.9.1/x86_64-linux -fPIC -DPIC -g -O2 -std=c++0x
-DHAVE_CXX0X -Wall -Wextra -Wformat=2 -Wnon-virtual-dtor -Wno-unused-parameter
-MT storage_wrap.lo -MD -MP -MF .deps/storage_wrap.Tpo -c -o storage_wrap.lo
storage_wrap.cxx
libtool: compile: /opt/icecream/bin/g++ -DHAVE_CONFIG_H -I. -I../.. -I../..
-I/usr/include/ruby-1.9.1 -I/usr/include/ruby-1.9.1/x86_64-linux -fPIC -DPIC -g
-O2 -std=c++0x -DHAVE_CXX0X -Wall -Wextra -Wformat=2 -Wnon-virtual-dtor
-Wno-unused-parameter -MT storage_wrap.lo -MD -MP -MF .deps/storage_wrap.Tpo -c
storage_wrap.cxx -fPIC -DPIC -o .libs/storage_wrap.o
storage_wrap.cxx: In function 'void SWIG_Ruby_define_class(swig_type_info*)':
storage_wrap.cxx:1517:9: warning: variable 'klass' set but not used
[-Wunused-but-set-variable]
storage_wrap.cxx: In function 'VALUE SWIG_AUX_NUM2DBL(VALUE*)':
storage_wrap.cxx:2835:9: warning: unused variable 'type' [-Wunused-variable]
storage_wrap.cxx: In function 'VALUE
deque_Sl_std_string_Sg____getitem____SWIG_2(const
std::deque<std::basic_string<char> >*, VALUE)':
storage_wrap.cxx:4305:13: warning: unused variable 'r' [-Wunused-variable]
storage_wrap.cxx: In function 'VALUE
list_Sl_std_string_Sg____getitem____SWIG_2(const
std::list<std::basic_string<char> >*, VALUE)':
storage_wrap.cxx:4740:13: warning: unused variable 'r' [-Wunused-variable]
storage_wrap.cxx: At global scope:
storage_wrap.cxx:4952:113: warning: type qualifiers ignored on function return
type [-Wignored-qualifiers]
storage_wrap.cxx: In function 'VALUE list_Sl_int_Sg____getitem____SWIG_2(const
std::list<int>*, VALUE)':
storage_wrap.cxx:5007:13: warning: unused variable 'r' [-Wunused-variable]
storage_wrap.cxx: In function 'VALUE
deque_Sl_storage_ContainerInfo_Sg____getitem____SWIG_2(const
std::deque<storage::ContainerInfo>*, VALUE)':
storage_wrap.cxx:5277:13: warning: unused variable 'r' [-Wunused-variable]
storage_wrap.cxx: In function 'VALUE
deque_Sl_storage_PartitionInfo_Sg____getitem____SWIG_2(const
std::deque<storage::PartitionInfo>*, VALUE)':
storage_wrap.cxx:5535:13: warning: unused variable 'r' [-Wunused-variable]
storage_wrap.cxx: In function 'VALUE
deque_Sl_storage_MdPartInfo_Sg____getitem____SWIG_2(const
std::deque<storage::MdPartInfo>*, VALUE)':
storage_wrap.cxx:5793:13: warning: unused variable 'r' [-Wunused-variable]
storage_wrap.cxx: In function 'VALUE
deque_Sl_storage_DmraidInfo_Sg____getitem____SWIG_2(const
std::deque<storage::DmraidInfo>*, VALUE)':
storage_wrap.cxx:6051:13: warning: unused variable 'r' [-Wunused-variable]
storage_wrap.cxx: In function 'VALUE
deque_Sl_storage_LvmLvInfo_Sg____getitem____SWIG_2(const
std::deque<storage::LvmLvInfo>*, VALUE)':
storage_wrap.cxx:6309:13: warning: unused variable 'r' [-Wunused-variable]
storage_wrap.cxx: In function 'VALUE
deque_Sl_storage_MdInfo_Sg____getitem____SWIG_2(const
std::deque<storage::MdInfo>*, VALUE)':
storage_wrap.cxx:6567:13: warning: unused variable 'r' [-Wunused-variable]
storage_wrap.cxx: In function 'VALUE
deque_Sl_storage_LoopInfo_Sg____getitem____SWIG_2(const
std::deque<storage::LoopInfo>*, VALUE)':
storage_wrap.cxx:6825:13: warning: unused variable 'r' [-Wunused-variable]
storage_wrap.cxx: In function 'VALUE
deque_Sl_storage_DmInfo_Sg____getitem____SWIG_2(const
std::deque<storage::DmInfo>*, VALUE)':
storage_wrap.cxx:7083:13: warning: unused variable 'r' [-Wunused-variable]
storage_wrap.cxx: In function 'VALUE
deque_Sl_storage_NfsInfo_Sg____getitem____SWIG_2(const
std::deque<storage::NfsInfo>*, VALUE)':
storage_wrap.cxx:7341:13: warning: unused variable 'r' [-Wunused-variable]
storage_wrap.cxx: In function 'VALUE
deque_Sl_storage_TmpfsInfo_Sg____getitem____SWIG_2(const
std::deque<storage::TmpfsInfo>*, VALUE)':
storage_wrap.cxx:7599:13: warning: unused variable 'r' [-Wunused-variable]
storage_wrap.cxx: In function 'VALUE
deque_Sl_storage_BtrfsInfo_Sg____getitem____SWIG_2(const
std::deque<storage::BtrfsInfo>*, VALUE)':
storage_wrap.cxx:7857:13: warning: unused variable 'r' [-Wunused-variable]
storage_wrap.cxx: In function 'VALUE
list_Sl_storage_PartitionSlotInfo_Sg____getitem____SWIG_2(const
std::list<storage::PartitionSlotInfo>*, VALUE)':
storage_wrap.cxx:8115:13: warning: unused variable 'r' [-Wunused-variable]
storage_wrap.cxx: In function 'VALUE
list_Sl_storage_CommitInfo_Sg____getitem____SWIG_2(const
std::list<storage::CommitInfo>*, VALUE)':
storage_wrap.cxx:8373:13: warning: unused variable 'r' [-Wunused-variable]
g++: internal compiler error: Killed (program cc1plus)
Please submit a full bug report,
with preprocessed source if appropriate.
See <http://bugs.opensuse.org/> for instructions.
make[5]: *** [storage_wrap.lo] Error 1
make[5]: Leaving directory
`<http://river.suse.de/job/yast-libstorage-HEAD/ws/checkout/bindings/ruby'>
make[4]: *** [all-recursive] Error 1
make[4]: Leaving directory
`<http://river.suse.de/job/yast-libstorage-HEAD/ws/checkout/bindings/ruby'>
make[3]: *** [all] Error 2
make[3]: Leaving directory
`<http://river.suse.de/job/yast-libstorage-HEAD/ws/checkout/bindings/ruby'>
make[2]: *** [all-recursive] Error 1
make[2]: Leaving directory
`<http://river.suse.de/job/yast-libstorage-HEAD/ws/checkout/bindings'>
make[1]: *** [all-recursive] Error 1
make[1]: Leaving directory
`<http://river.suse.de/job/yast-libstorage-HEAD/ws/checkout'>
make: *** [all] Error 2
++ error_exit 2
++ echo 'ERROR: detected exitcode 2'
ERROR: detected exitcode 2
++ cleanup
++ echo '==> Running cleanup'
==> Running cleanup
++ rm -f
<http://river.suse.de/job/yast-libstorage-HEAD/ws/ICECC/40c0ab7e54f59a1e4e493c1ea90a882a.tar.gz>
++ footer_and_exit 1
++ '[' -z 1 ']'
++ MYEXIT=1
++ '[' 1 == 0 ']'
++ ascii_failed
++ cat

( )
( ) (
) _ )
( \_
_(_\ \)__
(____\___))

build failed

++ exit 1
Build step 'Execute shell' marked build as failure
--
To unsubscribe, e-mail: yast-commit+unsubscribe@xxxxxxxxxxxx
For additional commands, e-mail: yast-commit+help@xxxxxxxxxxxx

< Previous Next >
This Thread
Follow Ups
References