Mailinglist Archive: yast-commit (306 mails)

< Previous Next >
[yast-commit] Build failed in Jenkins: yast-storage-HEAD #263
  • From: hudson@xxxxxxx
  • Date: Mon, 12 Aug 2013 15:47:00 +0200 (CEST)
  • Message-id: <1605980090.574.1376315220105.JavaMail.jenkins@river>
See <http://river.suse.de/job/yast-storage-HEAD/263/changes>

Changes:

[Arvin Schnell] - rename directory

------------------------------------------
[...truncated 405 lines...]
make[3]: Nothing to be done for `check'.
make[3]: Leaving directory
`<http://river.suse.de/job/yast-storage-HEAD/ws/checkout/testsuite/data/windows'>
Making check in windows-only
make[3]: Entering directory
`<http://river.suse.de/job/yast-storage-HEAD/ws/checkout/testsuite/data/windows-only'>
make[3]: Nothing to be done for `check'.
make[3]: Leaving directory
`<http://river.suse.de/job/yast-storage-HEAD/ws/checkout/testsuite/data/windows-only'>
Making check in windows-only-efi
make[3]: Entering directory
`<http://river.suse.de/job/yast-storage-HEAD/ws/checkout/testsuite/data/windows-only-efi'>
make[3]: Nothing to be done for `check'.
make[3]: Leaving directory
`<http://river.suse.de/job/yast-storage-HEAD/ws/checkout/testsuite/data/windows-only-efi'>
make[3]: Entering directory
`<http://river.suse.de/job/yast-storage-HEAD/ws/checkout/testsuite/data'>
make[3]: Nothing to be done for `check-am'.
make[3]: Leaving directory
`<http://river.suse.de/job/yast-storage-HEAD/ws/checkout/testsuite/data'>
make[2]: Leaving directory
`<http://river.suse.de/job/yast-storage-HEAD/ws/checkout/testsuite/data'>
make[2]: Entering directory
`<http://river.suse.de/job/yast-storage-HEAD/ws/checkout/testsuite'>
make -f /usr/share/YaST2/data/testsuite/Makefile.testsuite
RPMNAME=yast2-storage srcdir=.
make[3]: Entering directory
`<http://river.suse.de/job/yast-storage-HEAD/ws/checkout/testsuite'>
make[3]: Nothing to be done for `all'.
make[3]: Leaving directory
`<http://river.suse.de/job/yast-storage-HEAD/ws/checkout/testsuite'>
make check-DEJAGNU check-local
make[3]: Entering directory
`<http://river.suse.de/job/yast-storage-HEAD/ws/checkout/testsuite'>
Making a new site.exp file ...
srcdir='.'; export srcdir; \
EXPECT=expect; export EXPECT; \
runtest=runtest; \
if /bin/sh -c "$runtest --version" > /dev/null 2>&1; then \
exit_status=0; l='yast2-storage'; for tool in $l; do \
if $runtest --tool $tool --srcdir $srcdir ; \
then :; else exit_status=1; fi; \
done; \
else echo "WARNING: could not find 'runtest'" 1>&2; :;\
fi; \
exit $exit_status
WARNING: Couldn't find tool init file
Test Run By root on Mon Aug 12 15:46:30 2013
Native configuration is x86_64-suse-linux-gnu

=== yast2-storage tests ===

Schedule of variations:
unix

Running target unix
Using /usr/share/dejagnu/baseboards/unix.exp as board description file for
target.
Using /usr/share/dejagnu/config/unix.exp as generic interface file for target.
Using ./config/unix.exp as tool-and-target-specific interface file.
Running ./yast2-storage.test/testsuite.exp ...

Checking started

Running empty-efi1 ...
Running empty-efi2 ...
FAIL: Wrong stdout for empty-efi2

The diff follows...

--- tests/empty-efi2.out 2013-07-30 13:45:30.000000000 +0200
+++ tmp.out.empty-efi2 2013-08-12 15:46:38.000000000 +0200
@@ -1,5 +1,5 @@
Dump Proposal:
Dump Create boot volume /dev/sda1 (156.88 MB) with vfat
Dump Create swap volume /dev/sda2 (2.01 GB)
-Dump Create root volume /dev/sda3 (20.00 GB) with ext4
-Dump Create volume /dev/sda4 (275.93 GB) for /home with ext4
+Dump Create root volume /dev/sda3 (10.00 GB) with ext4
+Dump Create volume /dev/sda4 (285.92 GB) for /home with ext4

FAIL: Wrong stdout for empty-efi2
See the diff above.
Running empty1 ...
Running empty2 ...
FAIL: Wrong stdout for empty2

The diff follows...

--- tests/empty2.out 2013-07-30 13:45:30.000000000 +0200
+++ tmp.out.empty2 2013-08-12 15:46:44.000000000 +0200
@@ -1,4 +1,4 @@
Dump Proposal:
Dump Create swap volume /dev/sda1 (2.01 GB)
-Dump Create root volume /dev/sda2 (20.00 GB) with ext4
-Dump Create volume /dev/sda3 (276.08 GB) for /home with ext4
+Dump Create root volume /dev/sda2 (10.00 GB) with ext4
+Dump Create volume /dev/sda3 (286.08 GB) for /home with ext4

FAIL: Wrong stdout for empty2
See the diff above.
Running empty3 ...
FAIL: Wrong stdout for empty3

The diff follows...

--- tests/empty3.out 2013-07-30 13:45:30.000000000 +0200
+++ tmp.out.empty3 2013-08-12 15:46:46.000000000 +0200
@@ -1,6 +1,6 @@
Dump Proposal:
Dump Create boot volume /dev/sda1 (400.06 MB) with ext4
-Dump Create volume /dev/sda2 (29.96 GB)
-Dump Create volume group system (29.96 GB) from /dev/sda2 [destructive]
+Dump Create volume /dev/sda2 (14.98 GB)
+Dump Create volume group system (14.97 GB) from /dev/sda2 [destructive]
Dump Create logical volume /dev/system/root (10.00 GB) for / with ext4
Dump Create swap logical volume /dev/system/swap (512.00 MB)

FAIL: Wrong stdout for empty3
See the diff above.
Running empty4 ...
FAIL: Wrong stdout for empty4

The diff follows...

--- tests/empty4.out 2013-07-30 13:45:30.000000000 +0200
+++ tmp.out.empty4 2013-08-12 15:46:48.000000000 +0200
@@ -1,7 +1,7 @@
Dump Proposal:
Dump Create boot volume /dev/sda1 (400.06 MB) with ext4
-Dump Create volume /dev/sda2 (29.96 GB)
-Dump Create volume group system (29.96 GB) from /dev/sda2 [destructive]
-Dump Create logical volume /dev/system/home (19.46 GB) for /home with ext4
-Dump Create logical volume /dev/system/root (10.00 GB) for / with ext4
+Dump Create volume /dev/sda2 (14.98 GB)
+Dump Create volume group system (14.97 GB) from /dev/sda2 [destructive]
+Dump Create logical volume /dev/system/home (8.68 GB) for /home with ext4
+Dump Create logical volume /dev/system/root (5.79 GB) for / with ext4
Dump Create swap logical volume /dev/system/swap (512.00 MB)

FAIL: Wrong stdout for empty4
See the diff above.
Running empty5 ...
Running empty6 ...
Running half-empty1 ...
FAIL: Wrong stdout for half-empty1

The diff follows...

--- tests/half-empty1.out 2013-07-30 13:45:30.000000000 +0200
+++ tmp.out.half-empty1 2013-08-12 15:46:53.000000000 +0200
@@ -1,5 +1,5 @@
Dump Proposal:
Dump Create extended partition /dev/sda3 (147.09 GB)
Dump Create swap volume /dev/sda5 (2.01 GB)
-Dump Create root volume /dev/sda6 (20.00 GB) with ext4
-Dump Create volume /dev/sda7 (125.08 GB) for /home with ext4
+Dump Create root volume /dev/sda6 (10.00 GB) with ext4
+Dump Create volume /dev/sda7 (135.08 GB) for /home with ext4

FAIL: Wrong stdout for half-empty1
See the diff above.
Skipping file helper1a.rb ...
Skipping file helper1b.rb ...
Running reuse-home1 ...
Skipping file setup-system.rb ...
Running windows-only-efi1 ...
FAIL: Wrong stdout for windows-only-efi1

The diff follows...

--- tests/windows-only-efi1.out 2013-07-30 13:45:30.000000000 +0200
+++ tmp.out.windows-only-efi1 2013-08-12 15:46:56.000000000 +0200
@@ -1,5 +1,6 @@
Dump Proposal:
Dump Shrink Windows partition /dev/sda2 to 7.78 GB [destructive]
Dump Create swap volume /dev/sda3 (517.72 MB)
-Dump Create root volume /dev/sda4 (7.62 GB) with ext4
+Dump Create root volume /dev/sda4 (3.22 GB) with ext4
+Dump Create volume /dev/sda5 (4.40 GB) for /home with ext4
Dump Set mount point of /dev/sda1 to /boot/efi

FAIL: Wrong stdout for windows-only-efi1
See the diff above.
Running windows-only1 ...
FAIL: Wrong stdout for windows-only1

The diff follows...

--- tests/windows-only1.out 2013-07-30 13:45:30.000000000 +0200
+++ tmp.out.windows-only1 2013-08-12 15:46:58.000000000 +0200
@@ -1,6 +1,6 @@
Dump Proposal:
Dump Shrink Windows partition /dev/sda1 to 33.21 GB [destructive]
Dump Create extended partition /dev/sda2 (41.32 GB)
-Dump Create swap volume /dev/sda5 (517.72 MB)
-Dump Create root volume /dev/sda6 (16.50 GB) with ext4
-Dump Create volume /dev/sda7 (24.31 GB) for /home with ext4
+Dump Create swap volume /dev/sda5 (2.01 GB)
+Dump Create root volume /dev/sda6 (10.00 GB) with ext4
+Dump Create volume /dev/sda7 (29.31 GB) for /home with ext4

FAIL: Wrong stdout for windows-only1
See the diff above.
Running windows1 ...
FAIL: Wrong stdout for windows1

The diff follows...

--- tests/windows1.out 2013-07-30 13:45:30.000000000 +0200
+++ tmp.out.windows1 2013-08-12 15:46:59.000000000 +0200
@@ -1,5 +1,5 @@
Dump Proposal:
Dump Create extended partition /dev/sda2 (34.52 GB)
-Dump Create swap volume /dev/sda5 (517.72 MB)
-Dump Create root volume /dev/sda6 (15.01 GB) with ext4
-Dump Create volume /dev/sda7 (19.01 GB) for /home with ext4
+Dump Create swap volume /dev/sda5 (596.16 MB)
+Dump Create root volume /dev/sda6 (10.00 GB) with ext4
+Dump Create volume /dev/sda7 (23.93 GB) for /home with ext4

FAIL: Wrong stdout for windows1
See the diff above.

Checking finished


=== yast2-storage Summary ===

# of expected passes 5
# of unexpected failures 16
make[3]: *** [check-DEJAGNU] Error 1
make[3]: Leaving directory
`<http://river.suse.de/job/yast-storage-HEAD/ws/checkout/testsuite'>
make[2]: *** [check-am] Error 2
make[2]: Leaving directory
`<http://river.suse.de/job/yast-storage-HEAD/ws/checkout/testsuite'>
make[1]: *** [check-recursive] Error 1
make[1]: Leaving directory
`<http://river.suse.de/job/yast-storage-HEAD/ws/checkout/testsuite'>
make: *** [check-recursive] Error 1
++ error_exit 2
++ echo 'ERROR: detected exitcode 2'
ERROR: detected exitcode 2
++ cleanup
++ echo '==> Running cleanup'
==> Running cleanup
++ rm -f
<http://river.suse.de/job/yast-storage-HEAD/ws/ICECC/40c0ab7e54f59a1e4e493c1ea90a882a.tar.gz>
++ footer_and_exit 1
++ '[' -z 1 ']'
++ MYEXIT=1
++ '[' 1 == 0 ']'
++ ascii_failed
++ cat

( )
( ) (
) _ )
( \_
_(_\ \)__
(____\___))

build failed

++ exit 1
Build step 'Execute shell' marked build as failure
--
To unsubscribe, e-mail: yast-commit+unsubscribe@xxxxxxxxxxxx
For additional commands, e-mail: yast-commit+help@xxxxxxxxxxxx

< Previous Next >
Follow Ups
References