Mailinglist Archive: yast-commit (306 mails)

< Previous Next >
[yast-commit] Build failed in Jenkins: yast-storage-HEAD #238
  • From: hudson@xxxxxxx
  • Date: Thu, 1 Aug 2013 14:52:33 +0200 (CEST)
  • Message-id: <1776230739.280.1375361553232.JavaMail.jenkins@river>
See <http://river.suse.de/job/yast-storage-HEAD/238/changes>

Changes:

[Arvin Schnell] - updated gitignore

------------------------------------------
[...truncated 443 lines...]

Schedule of variations:
unix

Running target unix
Using /usr/share/dejagnu/baseboards/unix.exp as board description file for
target.
Using /usr/share/dejagnu/config/unix.exp as generic interface file for target.
Using ./config/unix.exp as tool-and-target-specific interface file.
Running ./yast2-storage.test/testsuite.exp ...

Checking started

Running empty-efi1 ...
FAIL: Wrong stderr for empty-efi1

The diff follows...

--- tests/empty-efi1.err 2013-07-30 13:45:30.000000000 +0200
+++ tmp.err.empty-efi1 2013-08-01 14:52:28.000000000 +0200
@@ -0,0 +1,4 @@
+2013-08-01 14:52:28 <3> app42(11865) [Y2Ruby] binary/YRuby.cc(loadModule):148
Module /usr/share/YaST2/modules/Storage load failed:cannot load such file --
dbus at /usr/lib64/ruby/1.9.1/rubygems/custom_require.rb:36:in `require'
+2013-08-01 14:52:28 <3> app42(11865) [Interpreter] yast/i18n.rb:83
Ruby::loadModule() / Can't load ruby module '/usr/share/YaST2/modules/Storage'
+2013-08-01 14:52:28 <5> app42(11865) [Y2Ruby]
binary/YRubyNamespace.cc(YRubyNamespace):192 The Ruby module 'Storage' is not
provided by its rb file
+2013-08-01 14:52:28 <3> app42(11865) [Interpreter] yast/i18n.rb:83 No table
associated to module 'Storage'

FAIL: Wrong stderr for empty-efi1
See the diff above.
Running empty-efi2 ...
FAIL: Wrong stderr for empty-efi2

The diff follows...

--- tests/empty-efi2.err 2013-07-30 13:45:30.000000000 +0200
+++ tmp.err.empty-efi2 2013-08-01 14:52:28.000000000 +0200
@@ -0,0 +1,4 @@
+2013-08-01 14:52:28 <3> app42(11900) [Y2Ruby] binary/YRuby.cc(loadModule):148
Module /usr/share/YaST2/modules/Storage load failed:cannot load such file --
dbus at /usr/lib64/ruby/1.9.1/rubygems/custom_require.rb:36:in `require'
+2013-08-01 14:52:28 <3> app42(11900) [Interpreter] yast/i18n.rb:83
Ruby::loadModule() / Can't load ruby module '/usr/share/YaST2/modules/Storage'
+2013-08-01 14:52:28 <5> app42(11900) [Y2Ruby]
binary/YRubyNamespace.cc(YRubyNamespace):192 The Ruby module 'Storage' is not
provided by its rb file
+2013-08-01 14:52:28 <3> app42(11900) [Interpreter] yast/i18n.rb:83 No table
associated to module 'Storage'

FAIL: Wrong stderr for empty-efi2
See the diff above.
Running empty1 ...
FAIL: Wrong stderr for empty1

The diff follows...

--- tests/empty1.err 2013-07-30 13:45:30.000000000 +0200
+++ tmp.err.empty1 2013-08-01 14:52:29.000000000 +0200
@@ -0,0 +1,4 @@
+2013-08-01 14:52:29 <3> app42(11935) [Y2Ruby] binary/YRuby.cc(loadModule):148
Module /usr/share/YaST2/modules/Storage load failed:cannot load such file --
dbus at /usr/lib64/ruby/1.9.1/rubygems/custom_require.rb:36:in `require'
+2013-08-01 14:52:29 <3> app42(11935) [Interpreter] yast/i18n.rb:83
Ruby::loadModule() / Can't load ruby module '/usr/share/YaST2/modules/Storage'
+2013-08-01 14:52:29 <5> app42(11935) [Y2Ruby]
binary/YRubyNamespace.cc(YRubyNamespace):192 The Ruby module 'Storage' is not
provided by its rb file
+2013-08-01 14:52:29 <3> app42(11935) [Interpreter] yast/i18n.rb:83 No table
associated to module 'Storage'

FAIL: Wrong stderr for empty1
See the diff above.
Running empty2 ...
FAIL: Wrong stderr for empty2

The diff follows...

--- tests/empty2.err 2013-07-30 13:45:30.000000000 +0200
+++ tmp.err.empty2 2013-08-01 14:52:29.000000000 +0200
@@ -0,0 +1,4 @@
+2013-08-01 14:52:29 <3> app42(11970) [Y2Ruby] binary/YRuby.cc(loadModule):148
Module /usr/share/YaST2/modules/Storage load failed:cannot load such file --
dbus at /usr/lib64/ruby/1.9.1/rubygems/custom_require.rb:36:in `require'
+2013-08-01 14:52:29 <3> app42(11970) [Interpreter] yast/i18n.rb:83
Ruby::loadModule() / Can't load ruby module '/usr/share/YaST2/modules/Storage'
+2013-08-01 14:52:29 <5> app42(11970) [Y2Ruby]
binary/YRubyNamespace.cc(YRubyNamespace):192 The Ruby module 'Storage' is not
provided by its rb file
+2013-08-01 14:52:29 <3> app42(11970) [Interpreter] yast/i18n.rb:83 No table
associated to module 'Storage'

FAIL: Wrong stderr for empty2
See the diff above.
Running empty3 ...
FAIL: Wrong stderr for empty3

The diff follows...

--- tests/empty3.err 2013-07-30 13:45:30.000000000 +0200
+++ tmp.err.empty3 2013-08-01 14:52:29.000000000 +0200
@@ -0,0 +1,4 @@
+2013-08-01 14:52:29 <3> app42(12005) [Y2Ruby] binary/YRuby.cc(loadModule):148
Module /usr/share/YaST2/modules/Storage load failed:cannot load such file --
dbus at /usr/lib64/ruby/1.9.1/rubygems/custom_require.rb:36:in `require'
+2013-08-01 14:52:29 <3> app42(12005) [Interpreter] yast/i18n.rb:83
Ruby::loadModule() / Can't load ruby module '/usr/share/YaST2/modules/Storage'
+2013-08-01 14:52:29 <5> app42(12005) [Y2Ruby]
binary/YRubyNamespace.cc(YRubyNamespace):192 The Ruby module 'Storage' is not
provided by its rb file
+2013-08-01 14:52:29 <3> app42(12005) [Interpreter] yast/i18n.rb:83 No table
associated to module 'Storage'

FAIL: Wrong stderr for empty3
See the diff above.
Running empty4 ...
FAIL: Wrong stderr for empty4

The diff follows...

--- tests/empty4.err 2013-07-30 13:45:30.000000000 +0200
+++ tmp.err.empty4 2013-08-01 14:52:30.000000000 +0200
@@ -0,0 +1,4 @@
+2013-08-01 14:52:30 <3> app42(12040) [Y2Ruby] binary/YRuby.cc(loadModule):148
Module /usr/share/YaST2/modules/Storage load failed:cannot load such file --
dbus at /usr/lib64/ruby/1.9.1/rubygems/custom_require.rb:36:in `require'
+2013-08-01 14:52:30 <3> app42(12040) [Interpreter] yast/i18n.rb:83
Ruby::loadModule() / Can't load ruby module '/usr/share/YaST2/modules/Storage'
+2013-08-01 14:52:30 <5> app42(12040) [Y2Ruby]
binary/YRubyNamespace.cc(YRubyNamespace):192 The Ruby module 'Storage' is not
provided by its rb file
+2013-08-01 14:52:30 <3> app42(12040) [Interpreter] yast/i18n.rb:83 No table
associated to module 'Storage'

FAIL: Wrong stderr for empty4
See the diff above.
Running empty5 ...
FAIL: Wrong stderr for empty5

The diff follows...

--- tests/empty5.err 2013-07-30 13:45:30.000000000 +0200
+++ tmp.err.empty5 2013-08-01 14:52:30.000000000 +0200
@@ -0,0 +1,4 @@
+2013-08-01 14:52:30 <3> app42(12075) [Y2Ruby] binary/YRuby.cc(loadModule):148
Module /usr/share/YaST2/modules/Storage load failed:cannot load such file --
dbus at /usr/lib64/ruby/1.9.1/rubygems/custom_require.rb:36:in `require'
+2013-08-01 14:52:30 <3> app42(12075) [Interpreter] yast/i18n.rb:83
Ruby::loadModule() / Can't load ruby module '/usr/share/YaST2/modules/Storage'
+2013-08-01 14:52:30 <5> app42(12075) [Y2Ruby]
binary/YRubyNamespace.cc(YRubyNamespace):192 The Ruby module 'Storage' is not
provided by its rb file
+2013-08-01 14:52:30 <3> app42(12075) [Interpreter] yast/i18n.rb:83 No table
associated to module 'Storage'

FAIL: Wrong stderr for empty5
See the diff above.
Running empty6 ...
FAIL: Wrong stderr for empty6

The diff follows...

--- tests/empty6.err 2013-07-30 13:45:30.000000000 +0200
+++ tmp.err.empty6 2013-08-01 14:52:31.000000000 +0200
@@ -0,0 +1,4 @@
+2013-08-01 14:52:31 <3> app42(12110) [Y2Ruby] binary/YRuby.cc(loadModule):148
Module /usr/share/YaST2/modules/Storage load failed:cannot load such file --
dbus at /usr/lib64/ruby/1.9.1/rubygems/custom_require.rb:36:in `require'
+2013-08-01 14:52:31 <3> app42(12110) [Interpreter] yast/i18n.rb:83
Ruby::loadModule() / Can't load ruby module '/usr/share/YaST2/modules/Storage'
+2013-08-01 14:52:31 <5> app42(12110) [Y2Ruby]
binary/YRubyNamespace.cc(YRubyNamespace):192 The Ruby module 'Storage' is not
provided by its rb file
+2013-08-01 14:52:31 <3> app42(12110) [Interpreter] yast/i18n.rb:83 No table
associated to module 'Storage'

FAIL: Wrong stderr for empty6
See the diff above.
Running half-empty1 ...
FAIL: Wrong stderr for half-empty1

The diff follows...

--- tests/half-empty1.err 2013-07-30 13:45:30.000000000 +0200
+++ tmp.err.half-empty1 2013-08-01 14:52:31.000000000 +0200
@@ -0,0 +1,4 @@
+2013-08-01 14:52:31 <3> app42(12145) [Y2Ruby] binary/YRuby.cc(loadModule):148
Module /usr/share/YaST2/modules/Storage load failed:cannot load such file --
dbus at /usr/lib64/ruby/1.9.1/rubygems/custom_require.rb:36:in `require'
+2013-08-01 14:52:31 <3> app42(12145) [Interpreter] yast/i18n.rb:83
Ruby::loadModule() / Can't load ruby module '/usr/share/YaST2/modules/Storage'
+2013-08-01 14:52:31 <5> app42(12145) [Y2Ruby]
binary/YRubyNamespace.cc(YRubyNamespace):192 The Ruby module 'Storage' is not
provided by its rb file
+2013-08-01 14:52:31 <3> app42(12145) [Interpreter] yast/i18n.rb:83 No table
associated to module 'Storage'

FAIL: Wrong stderr for half-empty1
See the diff above.
Skipping file helper1a.rb ...
Skipping file helper1b.rb ...
Running reuse-home1 ...
FAIL: Wrong stderr for reuse-home1

The diff follows...

--- tests/reuse-home1.err 2013-07-30 13:45:30.000000000 +0200
+++ tmp.err.reuse-home1 2013-08-01 14:52:32.000000000 +0200
@@ -0,0 +1,4 @@
+2013-08-01 14:52:31 <3> app42(12180) [Y2Ruby] binary/YRuby.cc(loadModule):148
Module /usr/share/YaST2/modules/Storage load failed:cannot load such file --
dbus at /usr/lib64/ruby/1.9.1/rubygems/custom_require.rb:36:in `require'
+2013-08-01 14:52:31 <3> app42(12180) [Interpreter] yast/i18n.rb:83
Ruby::loadModule() / Can't load ruby module '/usr/share/YaST2/modules/Storage'
+2013-08-01 14:52:31 <5> app42(12180) [Y2Ruby]
binary/YRubyNamespace.cc(YRubyNamespace):192 The Ruby module 'Storage' is not
provided by its rb file
+2013-08-01 14:52:31 <3> app42(12180) [Interpreter] yast/i18n.rb:83 No table
associated to module 'Storage'

FAIL: Wrong stderr for reuse-home1
See the diff above.
Skipping file setup-system.rb ...
Running windows-only-efi1 ...
FAIL: Wrong stderr for windows-only-efi1

The diff follows...

--- tests/windows-only-efi1.err 2013-07-30 13:45:30.000000000 +0200
+++ tmp.err.windows-only-efi1 2013-08-01 14:52:32.000000000 +0200
@@ -0,0 +1,4 @@
+2013-08-01 14:52:32 <3> app42(12215) [Y2Ruby] binary/YRuby.cc(loadModule):148
Module /usr/share/YaST2/modules/Storage load failed:cannot load such file --
dbus at /usr/lib64/ruby/1.9.1/rubygems/custom_require.rb:36:in `require'
+2013-08-01 14:52:32 <3> app42(12215) [Interpreter] yast/i18n.rb:83
Ruby::loadModule() / Can't load ruby module '/usr/share/YaST2/modules/Storage'
+2013-08-01 14:52:32 <5> app42(12215) [Y2Ruby]
binary/YRubyNamespace.cc(YRubyNamespace):192 The Ruby module 'Storage' is not
provided by its rb file
+2013-08-01 14:52:32 <3> app42(12215) [Interpreter] yast/i18n.rb:83 No table
associated to module 'Storage'

FAIL: Wrong stderr for windows-only-efi1
See the diff above.
Running windows-only1 ...
FAIL: Wrong stderr for windows-only1

The diff follows...

--- tests/windows-only1.err 2013-07-30 13:45:30.000000000 +0200
+++ tmp.err.windows-only1 2013-08-01 14:52:32.000000000 +0200
@@ -0,0 +1,4 @@
+2013-08-01 14:52:32 <3> app42(12250) [Y2Ruby] binary/YRuby.cc(loadModule):148
Module /usr/share/YaST2/modules/Storage load failed:cannot load such file --
dbus at /usr/lib64/ruby/1.9.1/rubygems/custom_require.rb:36:in `require'
+2013-08-01 14:52:32 <3> app42(12250) [Interpreter] yast/i18n.rb:83
Ruby::loadModule() / Can't load ruby module '/usr/share/YaST2/modules/Storage'
+2013-08-01 14:52:32 <5> app42(12250) [Y2Ruby]
binary/YRubyNamespace.cc(YRubyNamespace):192 The Ruby module 'Storage' is not
provided by its rb file
+2013-08-01 14:52:32 <3> app42(12250) [Interpreter] yast/i18n.rb:83 No table
associated to module 'Storage'

FAIL: Wrong stderr for windows-only1
See the diff above.
Running windows1 ...
FAIL: Wrong stderr for windows1

The diff follows...

--- tests/windows1.err 2013-07-30 13:45:30.000000000 +0200
+++ tmp.err.windows1 2013-08-01 14:52:33.000000000 +0200
@@ -0,0 +1,4 @@
+2013-08-01 14:52:33 <3> app42(12285) [Y2Ruby] binary/YRuby.cc(loadModule):148
Module /usr/share/YaST2/modules/Storage load failed:cannot load such file --
dbus at /usr/lib64/ruby/1.9.1/rubygems/custom_require.rb:36:in `require'
+2013-08-01 14:52:33 <3> app42(12285) [Interpreter] yast/i18n.rb:83
Ruby::loadModule() / Can't load ruby module '/usr/share/YaST2/modules/Storage'
+2013-08-01 14:52:33 <5> app42(12285) [Y2Ruby]
binary/YRubyNamespace.cc(YRubyNamespace):192 The Ruby module 'Storage' is not
provided by its rb file
+2013-08-01 14:52:33 <3> app42(12285) [Interpreter] yast/i18n.rb:83 No table
associated to module 'Storage'

FAIL: Wrong stderr for windows1
See the diff above.

Checking finished


=== yast2-storage Summary ===

# of unexpected failures 26
make[3]: *** [check-DEJAGNU] Error 1
make[3]: Leaving directory
`<http://river.suse.de/job/yast-storage-HEAD/ws/checkout/testsuite'>
make[2]: *** [check-am] Error 2
make[2]: Leaving directory
`<http://river.suse.de/job/yast-storage-HEAD/ws/checkout/testsuite'>
make[1]: *** [check-recursive] Error 1
make[1]: Leaving directory
`<http://river.suse.de/job/yast-storage-HEAD/ws/checkout/testsuite'>
make: *** [check-recursive] Error 1
++ error_exit 2
++ echo 'ERROR: detected exitcode 2'
ERROR: detected exitcode 2
++ cleanup
++ echo '==> Running cleanup'
==> Running cleanup
++ rm -f
<http://river.suse.de/job/yast-storage-HEAD/ws/ICECC/40c0ab7e54f59a1e4e493c1ea90a882a.tar.gz>
++ footer_and_exit 1
++ '[' -z 1 ']'
++ MYEXIT=1
++ '[' 1 == 0 ']'
++ ascii_failed
++ cat

( )
( ) (
) _ )
( \_
_(_\ \)__
(____\___))

build failed

++ exit 1
Build step 'Execute shell' marked build as failure
--
To unsubscribe, e-mail: yast-commit+unsubscribe@xxxxxxxxxxxx
For additional commands, e-mail: yast-commit+help@xxxxxxxxxxxx

< Previous Next >
This Thread
Follow Ups