Mailinglist Archive: yast-commit (306 mails)

< Previous Next >
[yast-commit] Build failed in Jenkins: yast-yast2-HEAD #151
  • From: hudson@xxxxxxx
  • Date: Thu, 1 Aug 2013 08:13:26 +0200 (CEST)
  • Message-id: <1621953631.268.1375337606332.JavaMail.jenkins@river>
See <http://river.suse.de/job/yast-yast2-HEAD/151/changes>

Changes:

[Ladislav Slezak] removed empty files

------------------------------------------
[...truncated 298 lines...]
[warn]: @param tag has unknown parameter name: symbol
in file `../../library/general/src/modules/PackagesProposal.rb' near line
281
[warn]: Invalid tag format for @example in file
`../../library/general/src/modules/PackagesProposal.rb` near line 329
[warn]: @param tag has unknown parameter name: icon_name
in file `../../library/general/src/modules/Popup.rb' near line 1136
[warn]: @param tag has unknown parameter name: defaultv
in file `../../library/general/src/modules/Misc.rb' near line 215
[warn]: Invalid tag format for @example in file
`../../library/general/src/modules/FileUtils.rb` near line 55
[warn]: @param tag has unknown parameter name: string
in file `../../library/general/src/modules/FileUtils.rb' near line 55
[warn]: Invalid tag format for @example in file
`../../library/general/src/modules/FileUtils.rb` near line 72
[warn]: @param tag has unknown parameter name: string
in file `../../library/general/src/modules/FileUtils.rb' near line 72
[warn]: Invalid tag format for @example in file
`../../library/general/src/modules/FileUtils.rb` near line 89
[warn]: @param tag has unknown parameter name: string
in file `../../library/general/src/modules/FileUtils.rb' near line 89
[warn]: Invalid tag format for @example in file
`../../library/general/src/modules/FileUtils.rb` near line 106
[warn]: @param tag has unknown parameter name: string
in file `../../library/general/src/modules/FileUtils.rb' near line 106
[warn]: @param tag has unknown parameter name: string
in file `../../library/general/src/modules/FileUtils.rb' near line 118
[warn]: @param tag has unknown parameter name: string
in file `../../library/general/src/modules/FileUtils.rb' near line 129
[warn]: @param tag has unknown parameter name: string
in file `../../library/general/src/modules/FileUtils.rb' near line 141
[warn]: @param tag has unknown parameter name: string
in file `../../library/general/src/modules/FileUtils.rb' near line 153
[warn]: Invalid tag format for @example in file
`../../library/general/src/modules/FileUtils.rb` near line 170
[warn]: @param tag has unknown parameter name: string
in file `../../library/general/src/modules/FileUtils.rb' near line 170
[warn]: @param tag has unknown parameter name: string
in file `../../library/general/src/modules/FileUtils.rb' near line 197
[warn]: Invalid tag format for @example in file
`../../library/general/src/modules/FileUtils.rb` near line 228
[warn]: @param tag has unknown parameter name: string
in file `../../library/general/src/modules/FileUtils.rb' near line 228
[warn]: Invalid tag format for @example in file
`../../library/general/src/modules/FileUtils.rb` near line 240
[warn]: @param tag has unknown parameter name: string
in file `../../library/general/src/modules/FileUtils.rb' near line 240
[warn]: Invalid tag format for @example in file
`../../library/general/src/modules/FileUtils.rb` near line 254
[warn]: @param tag has unknown parameter name: string
in file `../../library/general/src/modules/FileUtils.rb' near line 254
[warn]: Invalid tag format for @example in file
`../../library/general/src/modules/FileUtils.rb` near line 354
[warn]: @param tag has unknown parameter name: string
in file `../../library/general/src/modules/FileUtils.rb' near line 354
[warn]: Invalid tag format for @example in file
`../../library/general/src/modules/FileUtils.rb` near line 396
[warn]: @param tag has unknown parameter name: string
in file `../../library/general/src/modules/FileUtils.rb' near line 396
[warn]: @param tag has unknown parameter name: recursive,
in file `../../library/general/src/modules/FileUtils.rb' near line 396
[warn]: Invalid tag format for @example in file
`../../library/general/src/modules/FileUtils.rb` near line 428
[warn]: @param tag has unknown parameter name: recursive,
in file `../../library/general/src/modules/FileUtils.rb' near line 428
[warn]: Invalid tag format for @example in file
`../../library/general/src/modules/FileUtils.rb` near line 495
[warn]: @param tag has unknown parameter name: string
in file `../../library/general/src/modules/FileUtils.rb' near line 495
[warn]: @param tag has unknown parameter name: string
in file `../../library/general/src/modules/FileUtils.rb' near line 495
[warn]: Invalid tag format for @example in file
`../../library/general/src/modules/FileUtils.rb` near line 503
[warn]: @param tag has unknown parameter name: log
in file `../../library/general/src/modules/Syslog.rb' near line 44
[warn]: @param tag has unknown parameter name: logger
in file `../../library/general/src/modules/Syslog.rb' near line 44
[warn]: @param tag has unknown parameter name: log
in file `../../library/general/src/modules/Syslog.rb' near line 66
[warn]: Invalid tag format for @example
[warn]: Invalid tag format for @example
[warn]: @param tag has unknown parameter name: map
in file `../../library/general/src/modules/DontShowAgain.rb' near line 146
[warn]: @param tag has unknown parameter name: map
in file `../../library/general/src/modules/DontShowAgain.rb' near line 197
[warn]: @param tag has unknown parameter name: boolean
in file `../../library/general/src/modules/DontShowAgain.rb' near line 197
[warn]: @param tag has unknown parameter name: map
in file `../../library/general/src/modules/DontShowAgain.rb' near line 258
[warn]: @param tag has unknown parameter name: map
in file `../../library/general/src/modules/DontShowAgain.rb' near line 300
[warn]: @param tag has unknown parameter name: any
in file `../../library/general/src/modules/DontShowAgain.rb' near line 300
[warn]: @param tag has unknown parameter name: map
in file `../../library/general/src/modules/DontShowAgain.rb' near line 370
[warn]: Invalid tag format for @example in file
`../../library/general/src/modules/Icon.rb` near line 80
[warn]: In file `../../library/general/src/modules/Mode.rb':234: Cannot resolve
link to #demo from text:
[warn]: ...{#demo}...
Files: 32
Modules: 1 ( 1 undocumented)
Classes: 32 ( 32 undocumented)
Constants: 32 ( 32 undocumented)
Methods: 437 ( 43 undocumented)
78.49% documented
make[2]: Leaving directory
`<http://river.suse.de/job/yast-yast2-HEAD/ws/checkout/doc/autodocs'>
Making all in examples
make[2]: Entering directory
`<http://river.suse.de/job/yast-yast2-HEAD/ws/checkout/doc/examples'>
make[2]: Nothing to be done for `all'.
make[2]: Leaving directory
`<http://river.suse.de/job/yast-yast2-HEAD/ws/checkout/doc/examples'>
Making all in screenshots
make[2]: Entering directory
`<http://river.suse.de/job/yast-yast2-HEAD/ws/checkout/doc/screenshots'>
make[2]: Nothing to be done for `all'.
make[2]: Leaving directory
`<http://river.suse.de/job/yast-yast2-HEAD/ws/checkout/doc/screenshots'>
make[2]: Entering directory
`<http://river.suse.de/job/yast-yast2-HEAD/ws/checkout/doc'>
make[2]: Nothing to be done for `all-am'.
make[2]: Leaving directory
`<http://river.suse.de/job/yast-yast2-HEAD/ws/checkout/doc'>
make[1]: Leaving directory
`<http://river.suse.de/job/yast-yast2-HEAD/ws/checkout/doc'>
Making all in library
make[1]: Entering directory
`<http://river.suse.de/job/yast-yast2-HEAD/ws/checkout/library'>
Making all in types
make[2]: Entering directory
`<http://river.suse.de/job/yast-yast2-HEAD/ws/checkout/library/types'>
Making all in src
make[3]: Entering directory
`<http://river.suse.de/job/yast-yast2-HEAD/ws/checkout/library/types/src'>
make[3]: Nothing to be done for `all'.
make[3]: Leaving directory
`<http://river.suse.de/job/yast-yast2-HEAD/ws/checkout/library/types/src'>
Making all in testsuite
make[3]: Entering directory
`<http://river.suse.de/job/yast-yast2-HEAD/ws/checkout/library/types/testsuite'>
make -f /usr/share/YaST2/data/testsuite/Makefile.testsuite RPMNAME=yast2
srcdir=.
make[4]: Entering directory
`<http://river.suse.de/job/yast-yast2-HEAD/ws/checkout/library/types/testsuite'>
make[4]: Nothing to be done for `all'.
make[4]: Leaving directory
`<http://river.suse.de/job/yast-yast2-HEAD/ws/checkout/library/types/testsuite'>
make[3]: Leaving directory
`<http://river.suse.de/job/yast-yast2-HEAD/ws/checkout/library/types/testsuite'>
Making all in doc
make[3]: Entering directory
`<http://river.suse.de/job/yast-yast2-HEAD/ws/checkout/library/types/doc'>
Making all in autodocs
make[4]: Entering directory
`<http://river.suse.de/job/yast-yast2-HEAD/ws/checkout/library/types/doc/autodocs'>
make[4]: Nothing to be done for `all'.
make[4]: Leaving directory
`<http://river.suse.de/job/yast-yast2-HEAD/ws/checkout/library/types/doc/autodocs'>
make[4]: Entering directory
`<http://river.suse.de/job/yast-yast2-HEAD/ws/checkout/library/types/doc'>
make[4]: Nothing to be done for `all-am'.
make[4]: Leaving directory
`<http://river.suse.de/job/yast-yast2-HEAD/ws/checkout/library/types/doc'>
make[3]: Leaving directory
`<http://river.suse.de/job/yast-yast2-HEAD/ws/checkout/library/types/doc'>
make[3]: Entering directory
`<http://river.suse.de/job/yast-yast2-HEAD/ws/checkout/library/types'>
make[3]: Nothing to be done for `all-am'.
make[3]: Leaving directory
`<http://river.suse.de/job/yast-yast2-HEAD/ws/checkout/library/types'>
make[2]: Leaving directory
`<http://river.suse.de/job/yast-yast2-HEAD/ws/checkout/library/types'>
Making all in runlevel
make[2]: Entering directory
`<http://river.suse.de/job/yast-yast2-HEAD/ws/checkout/library/runlevel'>
Making all in doc
make[3]: Entering directory
`<http://river.suse.de/job/yast-yast2-HEAD/ws/checkout/library/runlevel/doc'>
Making all in autodocs
make[4]: Entering directory
`<http://river.suse.de/job/yast-yast2-HEAD/ws/checkout/library/runlevel/doc/autodocs'>
make[4]: Nothing to be done for `all'.
make[4]: Leaving directory
`<http://river.suse.de/job/yast-yast2-HEAD/ws/checkout/library/runlevel/doc/autodocs'>
make[4]: Entering directory
`<http://river.suse.de/job/yast-yast2-HEAD/ws/checkout/library/runlevel/doc'>
make[4]: Nothing to be done for `all-am'.
make[4]: Leaving directory
`<http://river.suse.de/job/yast-yast2-HEAD/ws/checkout/library/runlevel/doc'>
make[3]: Leaving directory
`<http://river.suse.de/job/yast-yast2-HEAD/ws/checkout/library/runlevel/doc'>
Making all in src
make[3]: Entering directory
`<http://river.suse.de/job/yast-yast2-HEAD/ws/checkout/library/runlevel/src'>
make[3]: Nothing to be done for `all'.
make[3]: Leaving directory
`<http://river.suse.de/job/yast-yast2-HEAD/ws/checkout/library/runlevel/src'>
Making all in testsuite
make[3]: Entering directory
`<http://river.suse.de/job/yast-yast2-HEAD/ws/checkout/library/runlevel/testsuite'>
make -f /usr/share/YaST2/data/testsuite/Makefile.testsuite RPMNAME=yast2
srcdir=.
make[4]: Entering directory
`<http://river.suse.de/job/yast-yast2-HEAD/ws/checkout/library/runlevel/testsuite'>
make[4]: Nothing to be done for `all'.
make[4]: Leaving directory
`<http://river.suse.de/job/yast-yast2-HEAD/ws/checkout/library/runlevel/testsuite'>
make[3]: Leaving directory
`<http://river.suse.de/job/yast-yast2-HEAD/ws/checkout/library/runlevel/testsuite'>
make[3]: Entering directory
`<http://river.suse.de/job/yast-yast2-HEAD/ws/checkout/library/runlevel'>
make[3]: Nothing to be done for `all-am'.
make[3]: Leaving directory
`<http://river.suse.de/job/yast-yast2-HEAD/ws/checkout/library/runlevel'>
make[2]: Leaving directory
`<http://river.suse.de/job/yast-yast2-HEAD/ws/checkout/library/runlevel'>
Making all in sequencer
make[2]: Entering directory
`<http://river.suse.de/job/yast-yast2-HEAD/ws/checkout/library/sequencer'>
Making all in doc
make[3]: Entering directory
`<http://river.suse.de/job/yast-yast2-HEAD/ws/checkout/library/sequencer/doc'>
Making all in autodocs
make[4]: Entering directory
`<http://river.suse.de/job/yast-yast2-HEAD/ws/checkout/library/sequencer/doc/autodocs'>
make[4]: Nothing to be done for `all'.
make[4]: Leaving directory
`<http://river.suse.de/job/yast-yast2-HEAD/ws/checkout/library/sequencer/doc/autodocs'>
Making all in images
make[4]: Entering directory
`<http://river.suse.de/job/yast-yast2-HEAD/ws/checkout/library/sequencer/doc/images'>
make[4]: Nothing to be done for `all'.
make[4]: Leaving directory
`<http://river.suse.de/job/yast-yast2-HEAD/ws/checkout/library/sequencer/doc/images'>
Making all in examples
make[4]: Entering directory
`<http://river.suse.de/job/yast-yast2-HEAD/ws/checkout/library/sequencer/doc/examples'>
make[4]: Nothing to be done for `all'.
make[4]: Leaving directory
`<http://river.suse.de/job/yast-yast2-HEAD/ws/checkout/library/sequencer/doc/examples'>
make[4]: Entering directory
`<http://river.suse.de/job/yast-yast2-HEAD/ws/checkout/library/sequencer/doc'>
make[4]: Nothing to be done for `all-am'.
make[4]: Leaving directory
`<http://river.suse.de/job/yast-yast2-HEAD/ws/checkout/library/sequencer/doc'>
make[3]: Leaving directory
`<http://river.suse.de/job/yast-yast2-HEAD/ws/checkout/library/sequencer/doc'>
Making all in src
make[3]: Entering directory
`<http://river.suse.de/job/yast-yast2-HEAD/ws/checkout/library/sequencer/src'>
make[3]: Nothing to be done for `all'.
make[3]: Leaving directory
`<http://river.suse.de/job/yast-yast2-HEAD/ws/checkout/library/sequencer/src'>
Making all in testsuite
make[3]: Entering directory
`<http://river.suse.de/job/yast-yast2-HEAD/ws/checkout/library/sequencer/testsuite'>
make -f /usr/share/YaST2/data/testsuite/Makefile.testsuite RPMNAME=yast2
srcdir=.
make[4]: Entering directory
`<http://river.suse.de/job/yast-yast2-HEAD/ws/checkout/library/sequencer/testsuite'>
make[4]: Nothing to be done for `all'.
make[4]: Leaving directory
`<http://river.suse.de/job/yast-yast2-HEAD/ws/checkout/library/sequencer/testsuite'>
make[3]: Leaving directory
`<http://river.suse.de/job/yast-yast2-HEAD/ws/checkout/library/sequencer/testsuite'>
make[3]: Entering directory
`<http://river.suse.de/job/yast-yast2-HEAD/ws/checkout/library/sequencer'>
make[3]: Nothing to be done for `all-am'.
make[3]: Leaving directory
`<http://river.suse.de/job/yast-yast2-HEAD/ws/checkout/library/sequencer'>
make[2]: Leaving directory
`<http://river.suse.de/job/yast-yast2-HEAD/ws/checkout/library/sequencer'>
Making all in xml
make[2]: Entering directory
`<http://river.suse.de/job/yast-yast2-HEAD/ws/checkout/library/xml'>
Making all in doc
make[3]: Entering directory
`<http://river.suse.de/job/yast-yast2-HEAD/ws/checkout/library/xml/doc'>
Making all in autodocs
make[4]: Entering directory
`<http://river.suse.de/job/yast-yast2-HEAD/ws/checkout/library/xml/doc/autodocs'>
make[4]: Nothing to be done for `all'.
make[4]: Leaving directory
`<http://river.suse.de/job/yast-yast2-HEAD/ws/checkout/library/xml/doc/autodocs'>
make[4]: Entering directory
`<http://river.suse.de/job/yast-yast2-HEAD/ws/checkout/library/xml/doc'>
make[4]: Nothing to be done for `all-am'.
make[4]: Leaving directory
`<http://river.suse.de/job/yast-yast2-HEAD/ws/checkout/library/xml/doc'>
make[3]: Leaving directory
`<http://river.suse.de/job/yast-yast2-HEAD/ws/checkout/library/xml/doc'>
Making all in src
make[3]: Entering directory
`<http://river.suse.de/job/yast-yast2-HEAD/ws/checkout/library/xml/src'>
make[3]: Nothing to be done for `all'.
make[3]: Leaving directory
`<http://river.suse.de/job/yast-yast2-HEAD/ws/checkout/library/xml/src'>
make[3]: Entering directory
`<http://river.suse.de/job/yast-yast2-HEAD/ws/checkout/library/xml'>
make[3]: Nothing to be done for `all-am'.
make[3]: Leaving directory
`<http://river.suse.de/job/yast-yast2-HEAD/ws/checkout/library/xml'>
make[2]: Leaving directory
`<http://river.suse.de/job/yast-yast2-HEAD/ws/checkout/library/xml'>
Making all in commandline
make[2]: Entering directory
`<http://river.suse.de/job/yast-yast2-HEAD/ws/checkout/library/commandline'>
Making all in agents
make[3]: Entering directory
`<http://river.suse.de/job/yast-yast2-HEAD/ws/checkout/library/commandline/agents'>
make[3]: *** No rule to make target `Makefile.am', needed by `Makefile.in'.
Stop.
make[3]: Leaving directory
`<http://river.suse.de/job/yast-yast2-HEAD/ws/checkout/library/commandline/agents'>
make[2]: *** [all-recursive] Error 1
make[2]: Leaving directory
`<http://river.suse.de/job/yast-yast2-HEAD/ws/checkout/library/commandline'>
make[1]: *** [all-recursive] Error 1
make[1]: Leaving directory
`<http://river.suse.de/job/yast-yast2-HEAD/ws/checkout/library'>
make: *** [all-recursive] Error 1
++ error_exit 2
++ echo 'ERROR: detected exitcode 2'
ERROR: detected exitcode 2
++ cleanup
++ echo '==> Running cleanup'
==> Running cleanup
++ rm -f
<http://river.suse.de/job/yast-yast2-HEAD/ws/ICECC/40c0ab7e54f59a1e4e493c1ea90a882a.tar.gz>
++ footer_and_exit 1
++ '[' -z 1 ']'
++ MYEXIT=1
++ '[' 1 == 0 ']'
++ ascii_failed
++ cat

( )
( ) (
) _ )
( \_
_(_\ \)__
(____\___))

build failed

++ exit 1
Build step 'Execute shell' marked build as failure
--
To unsubscribe, e-mail: yast-commit+unsubscribe@xxxxxxxxxxxx
For additional commands, e-mail: yast-commit+help@xxxxxxxxxxxx

< Previous Next >
This Thread
Follow Ups